{"text_format":"1","workbook":"xlsx","n_sheets":4,"sheets":["Simulador Port","Planilha 1","PZO","VL_PARC"],"not_rendered":{"charts":0,"images":0,"macros":0,"external_links":0,"defined_names":1,"comments":0,"pivot_tables":0},"unopened":[],"bounds":{"document_bytes":16777216,"sheet_cells":100000,"rows_first":2000,"rows_last":500,"rows_between":2000,"halvings":0,"cell_chars":16384,"cell_head_chars":4096},"cells_cut":0,"cells_raw":0,"read":"whole","date_system":"1900"}

{"sheet":"Simulador Port","index":0,"n_rows":26,"n_cols":17,"rows_kept":26,"cut":false,"hidden":false,"merged":[]}
[null,null,null,null,null,null,null,null,null,null,null,null,null,null,"V.2026003"]
[null,"CONVÊNIO","INSS"]
[null,"Prazo simulado (meses)",{"$f":"'Planilha 1'!P3","v":108}]
[]
[]
[null,null,null,null,"Observação",null,null,"TABELA PORT",null,{"$f":"C18","v":"NORMAL"},null,null,{"$f":"E18","v":"NORMAL"}]
[null,"Data Saldo*",{"$f":"TODAY()","v":"2026-05-26"}]
[null,"Saldo Portado**",10000,{"$f":"IF('Planilha 1'!K8=\"\",\"\",'Planilha 1'!K8)","v":""},null,null,null,null,null,{"$f":"C20","v":"1. Otimiza Pzo *"},null,null,{"$f":"E20","v":"2.Redução Vlr Parcela**"}]
[null,"Valor Parcela",270,null,null,null,null,"Tabela",null,"Val Fin Novo","Troco",null,"Val Fin Novo","Troco"]
[null,"Nº de Parcelas Restantes",60,{"$f":"IF('Planilha 1'!K10=\"\",\"\",'Planilha 1'!K10)","v":""},null,null,1,{"$f":"IF('Planilha 1'!M8=\"\",\"\",'Planilha 1'!M8)","v":"Tx1,779~1,74 (+90d Car) Flex1-RfnP"},null,{"$f":"IF('Planilha 1'!O8=\"\",\"\",'Planilha 1'!O8)","v":12125.074221916626},{"$f":"IF('Planilha 1'!P8=\"\",\"\",'Planilha 1'!P8)","v":2032.7546142523988},null,{"$f":"IF('Planilha 1'!Q8=\"\",\"\",'Planilha 1'!Q8)","v":12125.074221916626},{"$f":"IF('Planilha 1'!R8=\"\",\"\",'Planilha 1'!R8)","v":2032.7546142523988}]
[null,"Taxa de Juros",{"$f":"IFERROR('Planilha 1'!J17,\"\")","v":1.6897391149092833E-2},{"$f":"IF('Planilha 1'!K17=\"\",\"\",'Planilha 1'!K17)","v":""},null,null,{"$f":"G10+1","v":2},{"$f":"IF('Planilha 1'!M9=\"\",\"\",'Planilha 1'!M9)","v":"Tx1,739~1,70 (+90d Car) Flex2-RfnP"},null,{"$f":"IF('Planilha 1'!O9=\"\",\"\",'Planilha 1'!O9)","v":12236.454167510979},{"$f":"IF('Planilha 1'!P9=\"\",\"\",'Planilha 1'!P9)","v":2142.136265965466},null,{"$f":"IF('Planilha 1'!Q9=\"\",\"\",'Planilha 1'!Q9)","v":12236.454167510979},{"$f":"IF('Planilha 1'!R9=\"\",\"\",'Planilha 1'!R9)","v":2142.136265965466}]
[null,null,null,{"$f":"'Planilha 1'!T18","v":""},null,null,{"$f":"G11+1","v":3},{"$f":"IF('Planilha 1'!M10=\"\",\"\",'Planilha 1'!M10)","v":"Tx1,699~1,65 (+90d Car) Flex3-RfnP"},null,{"$f":"IF('Planilha 1'!O10=\"\",\"\",'Planilha 1'!O10)","v":12443.232351143488},{"$f":"IF('Planilha 1'!P10=\"\",\"\",'Planilha 1'!P10)","v":2345.1815939507451},null,{"$f":"IF('Planilha 1'!Q10=\"\",\"\",'Planilha 1'!Q10)","v":12443.232351143488},{"$f":"IF('Planilha 1'!R10=\"\",\"\",'Planilha 1'!R10)","v":2345.1815939507451}]
[null,"*Data Saldo = data de consulta do valor",null,null,null,null,4,{"$f":"IF('Planilha 1'!M11=\"\",\"\",'Planilha 1'!M11)","v":""},null,{"$f":"IF('Planilha 1'!O11=\"\",\"\",'Planilha 1'!O11)","v":""},{"$f":"IF('Planilha 1'!P11=\"\",\"\",'Planilha 1'!P11)","v":""},null,{"$f":"IF('Planilha 1'!Q11=\"\",\"\",'Planilha 1'!Q11)","v":""},{"$f":"IF('Planilha 1'!R11=\"\",\"\",'Planilha 1'!R11)","v":""}]
[null,"**Saldo Portado = valor informado do banco origem",null,null,null,null,5,{"$f":"IF('Planilha 1'!M12=\"\",\"\",'Planilha 1'!M12)","v":""},null,{"$f":"IF('Planilha 1'!O12=\"\",\"\",'Planilha 1'!O12)","v":""},{"$f":"IF('Planilha 1'!P12=\"\",\"\",'Planilha 1'!P12)","v":""},null,{"$f":"IF('Planilha 1'!Q12=\"\",\"\",'Planilha 1'!Q12)","v":""},{"$f":"IF('Planilha 1'!R12=\"\",\"\",'Planilha 1'!R12)","v":""}]
[null,null,null,null,null,null,6,{"$f":"IF('Planilha 1'!M13=\"\",\"\",'Planilha 1'!M13)","v":""},null,{"$f":"IF('Planilha 1'!O13=\"\",\"\",'Planilha 1'!O13)","v":""},{"$f":"IF('Planilha 1'!P13=\"\",\"\",'Planilha 1'!P13)","v":""},null,{"$f":"IF('Planilha 1'!Q13=\"\",\"\",'Planilha 1'!Q13)","v":""},{"$f":"IF('Planilha 1'!R13=\"\",\"\",'Planilha 1'!R13)","v":""}]
[null,null,null,null,null,null,7,{"$f":"IF('Planilha 1'!M14=\"\",\"\",'Planilha 1'!M14)","v":""},null,{"$f":"IF('Planilha 1'!O14=\"\",\"\",'Planilha 1'!O14)","v":""},{"$f":"IF('Planilha 1'!P14=\"\",\"\",'Planilha 1'!P14)","v":""},null,{"$f":"IF('Planilha 1'!Q14=\"\",\"\",'Planilha 1'!Q14)","v":""},{"$f":"IF('Planilha 1'!R14=\"\",\"\",'Planilha 1'!R14)","v":""}]
[null,null,null,null,null,null,8,{"$f":"IF('Planilha 1'!M15=\"\",\"\",'Planilha 1'!M15)","v":""},null,{"$f":"IF('Planilha 1'!O15=\"\",\"\",'Planilha 1'!O15)","v":""},{"$f":"IF('Planilha 1'!P15=\"\",\"\",'Planilha 1'!P15)","v":""},null,{"$f":"IF('Planilha 1'!Q15=\"\",\"\",'Planilha 1'!Q15)","v":""},{"$f":"IF('Planilha 1'!R15=\"\",\"\",'Planilha 1'!R15)","v":""}]
[null,"TABELA PORT",{"$f":"UPPER(IFERROR('Planilha 1'!I26,\"\"))","v":"NORMAL"},null,{"$f":"UPPER(IFERROR('Planilha 1'!I27,\"\"))","v":"NORMAL"},null,9,{"$f":"IF('Planilha 1'!M16=\"\",\"\",'Planilha 1'!M16)","v":""},null,{"$f":"IF('Planilha 1'!O16=\"\",\"\",'Planilha 1'!O16)","v":""},{"$f":"IF('Planilha 1'!P16=\"\",\"\",'Planilha 1'!P16)","v":""},null,{"$f":"IF('Planilha 1'!Q16=\"\",\"\",'Planilha 1'!Q16)","v":""},{"$f":"IF('Planilha 1'!R16=\"\",\"\",'Planilha 1'!R16)","v":""}]
[null,null,null,null,null,null,10,{"$f":"IF('Planilha 1'!M17=\"\",\"\",'Planilha 1'!M17)","v":""},null,{"$f":"IF('Planilha 1'!O17=\"\",\"\",'Planilha 1'!O17)","v":""},{"$f":"IF('Planilha 1'!P17=\"\",\"\",'Planilha 1'!P17)","v":""},null,{"$f":"IF('Planilha 1'!Q17=\"\",\"\",'Planilha 1'!Q17)","v":""},{"$f":"IF('Planilha 1'!R17=\"\",\"\",'Planilha 1'!R17)","v":""}]
[null,null,"1. Otimiza Pzo *",null,"2.Redução Vlr Parcela**",null,11,{"$f":"IF('Planilha 1'!M18=\"\",\"\",'Planilha 1'!M18)","v":""},null,{"$f":"IF('Planilha 1'!O18=\"\",\"\",'Planilha 1'!O18)","v":""},{"$f":"IF('Planilha 1'!P18=\"\",\"\",'Planilha 1'!P18)","v":""},null,{"$f":"IF('Planilha 1'!Q18=\"\",\"\",'Planilha 1'!Q18)","v":""},{"$f":"IF('Planilha 1'!R18=\"\",\"\",'Planilha 1'!R18)","v":""}]
[null,"Prazo",{"$f":"IFERROR('Planilha 1'!BU31,\"\")","v":60},{"$f":"IF(C21<>C10,1,0)","v":0},{"$f":"IF(E23=\"\",\"\",'Planilha 1'!BZ16)","v":60},{"$f":"IF(E21<>C10,1,0)","v":0},12]
[null,"Valor Parcela",{"$f":"IFERROR('Planilha 1'!BU32,\"\")","v":270},{"$f":"IF(C22<>C9,1,0)","v":0},{"$f":"IF(E23=\"\",\"\",'Planilha 1'!BZ17)","v":270},{"$f":"IF(E22<>C9,1,0)","v":0}]
[null,"Taxa de Juros",{"$f":"IFERROR('Planilha 1'!BU33,\"\")","v":1.6897391149092833E-2},null,{"$f":"IFERROR('Planilha 1'!BS32,\"\")","v":1.6897391149092833E-2}]
[]
[null,null,null,null,null,null,null,null,null,null,null,null,null,null,null,null,"INSS"]
[null,null,null,null,null,null,null,null,null,null,null,null,null,null,null,null,"SIAPE"]

{"sheet":"Planilha 1","index":1,"n_rows":1297,"n_cols":173,"rows_kept":1297,"cut":false,"hidden":true,"merged":[]}
["IOF ad",{"$f":"ROUND(3%/365,6)","v":8.2000000000000001E-5},null,null,null,null,null,null,null,null,null,null,null,null,null,null,null,null,null,null,"TETO",null,{"$f":"J16","v":1.6897391149092833E-2},{"$f":"IF($P$2=$AH$4,AH1,AP1)","v":"INSS"},{"$f":"IF($P$2=$AH$4,AI1,AQ1)","v":1.35E-2},{"$f":"IF($P$2=$AH$4,AJ1,AR1)","v":1.8499999999999999E-2},{"$f":"IF($P$2=$AH$4,AK1,AS1)","v":"Port"},null,null,null,null,null,null,"INSS",1.35E-2,{"$f":"MAX(AI4:AJ15)","v":1.8499999999999999E-2},"Port",null,null,null,null,"SIAPE",1.6E-2,1.7999999999999999E-2,"Port"]
["IOF adic.",3.8E-3,null,null,null,null,null,"CONVÊNIO",null,null,null,null,null,null,null,{"$f":"'Simulador Port'!C2","v":"INSS"},null,null,null,null,"TAXA TETO PONDERADO",{"$f":"((W1*W2)+(Z1*(Z2-W2)))/P3","v":1.7609661749496016E-2},{"$f":"J10","v":60},null,null,{"$f":"P3","v":108},null,null,null,null,null,null,null,null,null,null,null,null,null,null,null,null,96,null,null,null,null,null,null,null,null,null,null,null,null,{"$f":"'Simulador Port'!C20","v":"1. Otimiza Pzo *"},null,{"$f":"'Simulador Port'!E20","v":"2.Redução Vlr Parcela**"}]
[null,null,null,null,null,null,null,null,null,null,null,null,null,null,"Prazo simulado (meses)",{"$f":"IF(P2=\"INSS\",108,96)","v":108},null,null,null,null,null,null,null,"Convenio","TxMax","TxMin","Nome",null,"Fator um jr","Novo Saldo","IOF","TROCO","VLR FIN","Convenio","TxMax","TxMin","Nome","Nome",null,null,null,"Convenio","TxMax","TxMin","Nome","Nome",null,null,null,null,"Convenio","TxMax","TxMin","Nome",null,"Val Fin Novo","Troco","Val Fin Novo","Troco"]
[null,null,null,null,null,null,null,null,null,null,null,null,null,null,null,null,null,null,null,null,"Troco min %",0,{"$f":"IF(PZO!W4+VL_PARC!W4>0,'Planilha 1'!W3+1,0)","v":0},{"$f":"IF($P$2=$AH$4,AH4,AP4)","v":"INSS"},{"$f":"IF($P$2=$AH$4,AI4,AQ4)","v":1.8499999999999999E-2},{"$f":"IF($P$2=$AH$4,AJ4,AR4)","v":1.78E-2},{"$f":"IF($P$2=$AH$4,AK4,AS4)","v":"Normal"},{"$f":"IF($P$2=$AH$4,AL4,AT4)","v":"Tx1,850~1,78 (+90d Car) Normal-RfnP"},{"$f":"(1+MIN(Y4,$V$2))^(1/30)","v":1.0005820495985809},{"$f":"OFFSET($U$32,,ROW()-ROW($AD$4))","v":12125.074221916626},{"$f":"OFFSET($AH$29,,ROW()-ROW($AE$4))","v":92.319531811806996},{"$f":"AD4-AE4-$J$8","v":2032.7546142523988},{"$f":"SUM(AD4,AF4)","v":14157.828836169025},"INSS",1.8499999999999999E-2,1.78E-2,"Normal","Tx1,850~1,78 (+90d Car) Normal-RfnP",null,null,null,"SIAPE",1.7989999999999999E-2,1.7989999999999999E-2,"Normal","SIAPE RfnPort Tx1.799 Normal Web",null,null,null,{"$f":"W4","v":0},{"$f":"X4","v":"INSS"},{"$f":"Y4","v":1.8499999999999999E-2},{"$f":"Z4","v":1.78E-2},{"$f":"AA4","v":"Normal"},{"$f":"AB4","v":"Tx1,850~1,78 (+90d Car) Normal-RfnP"},{"$f":"IF(PZO!$W4=0,\"\",PZO!AD4)","v":""},{"$f":"IF(PZO!$W4=0,\"\",PZO!AF4)","v":""},{"$f":"IF(VL_PARC!$W4=0,\"\",VL_PARC!AD4)","v":""},{"$f":"IF(VL_PARC!$W4=0,\"\",VL_PARC!AF4)","v":""}]
[96,null,null,null,null,null,null,null,null,null,null,null,null,null,null,null,null,null,null,null,"Troco min R$",50,{"$f":"IF(PZO!W5+VL_PARC!W5>0,'Planilha 1'!W4+1,0)","v":1},{"$f":"IF($P$2=$AH$4,AH5,AP5)","v":"INSS"},{"$f":"IF($P$2=$AH$4,AI5,AQ5)","v":1.779E-2},{"$f":"IF($P$2=$AH$4,AJ5,AR5)","v":1.7399999999999999E-2},{"$f":"IF($P$2=$AH$4,AK5,AS5)","v":"Flex 1"},{"$f":"IF($P$2=$AH$4,AL5,AT5)","v":"Tx1,779~1,74 (+90d Car) Flex1-RfnP"},{"$f":"(1+MIN(Y5,$V$2))^(1/30)","v":1.0005820495985809},{"$f":"OFFSET($U$32,,ROW()-ROW($AD$4))","v":12125.074221916626},{"$f":"OFFSET($AH$29,,ROW()-ROW($AE$4))","v":92.319531811806996},{"$f":"AD5-AE5-$J$8","v":2032.7546142523988},{"$f":"SUM(AD5,AF5)","v":14157.828836169025},"INSS",1.779E-2,1.7399999999999999E-2,"Flex 1","Tx1,779~1,74 (+90d Car) Flex1-RfnP",null,null,null,"SIAPE",1.7979999999999999E-2,1.7499999999999998E-2,"Flex 1","SIAPE RfnPort Tx1.798 ~ 1.75 Flex 1 Web",null,null,null,{"$f":"W5","v":1},{"$f":"X5","v":"INSS"},1.779E-2,1.7399999999999999E-2,"Flex 1","Tx1,779~1,74 (+90d Car) Flex1-RfnP",{"$f":"IF(PZO!$W5=0,\"\",PZO!AD5)","v":12125.074221916626},{"$f":"IF(PZO!$W5=0,\"\",PZO!AF5)","v":2032.7546142523988},{"$f":"IF(VL_PARC!$W5=0,\"\",VL_PARC!AD5)","v":12125.074221916626},{"$f":"IF(VL_PARC!$W5=0,\"\",VL_PARC!AF5)","v":2032.7546142523988}]
["INSS","INSS",108,null,null,null,null,null,null,null,"Observação",null,"Tabela",null,"Val Fin Novo","Troco",null,null,null,null,"Ticket Min",2000,{"$f":"IF(PZO!W6+VL_PARC!W6>0,'Planilha 1'!W5+1,0)","v":2},"INSS",1.7389999999999999E-2,1.7000000000000001E-2,{"$f":"IF($P$2=$AH$4,AK6,AS6)","v":"Flex 2"},"Tx1,739~1,70 (+90d Car) Flex2-RfnP",1.0005748493086513,12236.454167510979,94.317825693092928,2142.136265965466,14378.590433476445,"INSS",1.7389999999999999E-2,1.7000000000000001E-2,"Flex 2","Tx1,739~1,70 (+90d Car) Flex2-RfnP",null,null,null,"SIAPE",1.7489999999999999E-2,1.6999999999999998E-2,"Flex 2","SIAPE RfnPort Tx1.749 ~ 1.70 Flex 2 Web",null,null,null,2,"INSS",1.7389999999999999E-2,1.7000000000000001E-2,"Flex 2","Tx1,739~1,70 (+90d Car) Flex2-RfnP",{"$f":"IF(PZO!$W6=0,\"\",PZO!AD6)","v":12236.454167510979},{"$f":"IF(PZO!$W6=0,\"\",PZO!AF6)","v":2142.136265965466},{"$f":"IF(VL_PARC!$W6=0,\"\",VL_PARC!AD6)","v":12236.454167510979},{"$f":"IF(VL_PARC!$W6=0,\"\",VL_PARC!AF6)","v":2142.136265965466}]
["SIAPE","SIAPE",96,null,null,null,null,"Data Saldo",{"$f":"'Simulador Port'!C7","v":"2026-05-26"},{"$f":"TODAY()","v":"2026-05-26"},{"$f":"'Simulador Port'!D7","v":0},null,null,null,null,null,null,null,null,null,null,null,{"$f":"IF(PZO!W7+VL_PARC!W7>0,'Planilha 1'!W6+1,0)","v":3},"INSS",1.6990000000000002E-2,1.6500000000000001E-2,"Flex 3","Tx1,699~1,65 (+90d Car) Flex3-RfnP",1.0005617338526143,12443.232351143488,98.050681340323393,2345.1815939507451,14788.413945094233,"INSS",1.6990000000000002E-2,1.6500000000000001E-2,"Flex 3","Tx1,699~1,65 (+90d Car) Flex3-RfnP",null,null,null,"SIAPE",1.6990000000000002E-2,1.6500000000000001E-2,"Flex 3","SIAPE RfnPort Tx1.699 ~ 1.65 Flex 3 Web",null,null,null,3,"INSS",1.6990000000000002E-2,1.6500000000000001E-2,"Flex 3","Tx1,699~1,65 (+90d Car) Flex3-RfnP",{"$f":"IF(PZO!$W7=0,\"\",PZO!AD7)","v":12443.232351143488},{"$f":"IF(PZO!$W7=0,\"\",PZO!AF7)","v":2345.1815939507451},{"$f":"IF(VL_PARC!$W7=0,\"\",VL_PARC!AD7)","v":12443.232351143488},{"$f":"IF(VL_PARC!$W7=0,\"\",VL_PARC!AF7)","v":2345.1815939507451}]
[null,null,null,null,null,null,null,"Saldo Portado",{"$f":"'Simulador Port'!C8","v":10000},{"$f":"SUM(J35:J143)","v":10000.00007585242},{"$f":"T8","v":""},1,{"$f":"IFERROR(VLOOKUP(L8,$W$4:$AF$15,6,0),\"\")","v":"Tx1,779~1,74 (+90d Car) Flex1-RfnP"},null,{"$f":"IFERROR(VLOOKUP(L8,$AX$4:$BG$15,7,0),\"\")","v":12125.074221916626},{"$f":"IFERROR(VLOOKUP(L8,$AX$4:$BG$15,8,0),\"\")","v":2032.7546142523988},{"$f":"IFERROR(VLOOKUP(L8,$AX$4:$BG$15,9,0),\"\")","v":12125.074221916626},{"$f":"IFERROR(VLOOKUP(L8,$AX$4:$BG$15,10,0),\"\")","v":2032.7546142523988},null,{"$f":"IFERROR(IF(OR((J17-I17)/I17>2%,(J17-I17)/I17<-2%),\"Saldo e Parcela não correspondem à taxa informada\",\"\"),\"\")","v":""},"TAXA TROCO",null,{"$f":"IF(PZO!W8+VL_PARC!W8>0,'Planilha 1'!W7+1,0)","v":0},"INSS",1.6490000000000001E-2,1.6E-2,"Flex 4","Tx1,649~1,60 (+90d Car) Flex4-RfnP",1.0005453325183937,12709.097215721285,102.89314393191702,2606.2039959369486,15315.301211658234,"INSS",1.6490000000000001E-2,1.6E-2,"Flex 4","Tx1,649~1,60 (+90d Car) Flex4-RfnP",null,null,null,null,null,null,null,null,null,null,null,0,"INSS",1.6490000000000001E-2,1.6E-2,"Flex 4","Tx1,649~1,60 (+90d Car) Flex4-RfnP",{"$f":"IF(PZO!$W8=0,\"\",PZO!AD8)","v":""},{"$f":"IF(PZO!$W8=0,\"\",PZO!AF8)","v":""},{"$f":"IF(VL_PARC!$W8=0,\"\",VL_PARC!AD8)","v":""},{"$f":"IF(VL_PARC!$W8=0,\"\",VL_PARC!AF8)","v":""}]
[null,null,null,null,null,null,null,"Valor Parcela",{"$f":"'Simulador Port'!C9","v":270},{"$f":"I9","v":270},{"$f":"'Simulador Port'!D9","v":0},{"$f":"L8+1","v":2},{"$f":"IFERROR(VLOOKUP(L9,$W$4:$AF$15,6,0),\"\")","v":"Tx1,739~1,70 (+90d Car) Flex2-RfnP"},null,{"$f":"IFERROR(VLOOKUP(L9,$AX$4:$BG$15,7,0),\"\")","v":12236.454167510979},{"$f":"IFERROR(VLOOKUP(L9,$AX$4:$BG$15,8,0),\"\")","v":2142.136265965466},{"$f":"IFERROR(VLOOKUP(L9,$AX$4:$BG$15,9,0),\"\")","v":12236.454167510979},{"$f":"IFERROR(VLOOKUP(L9,$AX$4:$BG$15,10,0),\"\")","v":2142.136265965466},null,null,"TAXA Port MIN",{"$f":"IF(SUM(PZO!$W$4:$W$15,VL_PARC!$W$4:$W$15)=0,\"Refin Indisponivel\",\"\")","v":""},{"$f":"IF(PZO!W9+VL_PARC!W9>0,'Planilha 1'!W8+1,0)","v":0},"INSS",1.5990000000000001E-2,1.55E-2,"Flex 5","Tx1,599~1,55 (+90d Car) Flex5-RfnP",1.0005289233836074,12983.474045695073,107.9398742041439,2875.5340956385098,15859.008141333583,"INSS",1.5990000000000001E-2,1.55E-2,"Flex 5","Tx1,599~1,55 (+90d Car) Flex5-RfnP",null,null,null,null,null,null,null,null,null,null,null,0,"INSS",1.5990000000000001E-2,1.55E-2,"Flex 5","Tx1,599~1,55 (+90d Car) Flex5-RfnP",{"$f":"IF(PZO!$W9=0,\"\",PZO!AD9)","v":""},{"$f":"IF(PZO!$W9=0,\"\",PZO!AF9)","v":""},{"$f":"IF(VL_PARC!$W9=0,\"\",VL_PARC!AD9)","v":""},{"$f":"IF(VL_PARC!$W9=0,\"\",VL_PARC!AF9)","v":""}]
[null,null,null,null,null,null,null,"Nº de Parcelas Restantes",{"$f":"'Simulador Port'!C10","v":60},{"$f":"I10","v":60},{"$f":"T10","v":""},{"$f":"L9+1","v":3},"Tx1,699~1,65 (+90d Car) Flex3-RfnP",null,12443.232351143488,2345.1815939507451,12443.232351143488,2345.1815939507451,null,{"$f":"IF(P3-J10<12,\"Contrato com menos de 12 parcelas pagas\",\"\")","v":""},null,null,{"$f":"IF(PZO!W10+VL_PARC!W10>0,'Planilha 1'!W9+1,0)","v":0},0,0,0,0,0,1,{"$error":"#N/A"},{"$error":"#N/A"},{"$error":"#N/A"},{"$error":"#N/A"},null,null,null,null,null,null,null,null,null,null,null,null,null,null,null,null,0,0,0,0,0,0,{"$f":"IF(PZO!$W10=0,\"\",PZO!AD10)","v":""},{"$f":"IF(PZO!$W10=0,\"\",PZO!AF10)","v":""},{"$f":"IF(VL_PARC!$W10=0,\"\",VL_PARC!AD10)","v":""},{"$f":"IF(VL_PARC!$W10=0,\"\",VL_PARC!AF10)","v":""}]
[null,null,null,null,null,null,null,null,null,null,null,4,"",null,"","","","",null,null,null,null,{"$f":"IF(PZO!W11+VL_PARC!W11>0,'Planilha 1'!W10+1,0)","v":0},0,0,0,0,0,1,{"$error":"#N/A"},{"$error":"#N/A"},{"$error":"#N/A"},{"$error":"#N/A"},null,null,null,null,null,null,null,null,null,null,null,null,null,null,null,null,0,0,0,0,0,0,{"$f":"IF(PZO!$W11=0,\"\",PZO!AD11)","v":""},{"$f":"IF(PZO!$W11=0,\"\",PZO!AF11)","v":""},{"$f":"IF(VL_PARC!$W11=0,\"\",VL_PARC!AD11)","v":""},{"$f":"IF(VL_PARC!$W11=0,\"\",VL_PARC!AF11)","v":""}]
[null,null,null,null,null,null,null,null,null,null,null,5,"",null,"","","","",null,null,null,null,{"$f":"IF(PZO!W12+VL_PARC!W12>0,'Planilha 1'!W11+1,0)","v":0},0,0,0,0,0,1,{"$error":"#N/A"},{"$error":"#N/A"},{"$error":"#N/A"},{"$error":"#N/A"},null,null,null,null,null,null,null,null,null,null,null,null,null,null,null,";",0,0,0,0,0,0,{"$f":"IF(PZO!$W12=0,\"\",PZO!AD12)","v":""},{"$f":"IF(PZO!$W12=0,\"\",PZO!AF12)","v":""},{"$f":"IF(VL_PARC!$W12=0,\"\",VL_PARC!AD12)","v":""},{"$f":"IF(VL_PARC!$W12=0,\"\",VL_PARC!AF12)","v":""}]
[null,null,null,null,null,null,null,null,null,null,null,6,"",null,"","","","",null,null,null,null,{"$f":"IF(PZO!W13+VL_PARC!W13>0,'Planilha 1'!W12+1,0)","v":0},0,0,0,0,0,1,{"$error":"#N/A"},{"$error":"#N/A"},{"$error":"#N/A"},{"$error":"#N/A"},null,null,null,null,null,null,null,null,null,null,null,null,null,null,null,null,0,0,0,0,0,0,{"$f":"IF(PZO!$W13=0,\"\",PZO!AD13)","v":""},{"$f":"IF(PZO!$W13=0,\"\",PZO!AF13)","v":""},{"$f":"IF(VL_PARC!$W13=0,\"\",VL_PARC!AD13)","v":""},{"$f":"IF(VL_PARC!$W13=0,\"\",VL_PARC!AF13)","v":""}]
[null,null,null,null,null,null,null,null,null,null,null,7,"",null,"","","","",null,null,null,null,{"$f":"IF(PZO!W14+VL_PARC!W14>0,'Planilha 1'!W13+1,0)","v":0},0,0,0,0,0,1,{"$error":"#N/A"},{"$error":"#N/A"},{"$error":"#N/A"},{"$error":"#N/A"},null,null,null,null,null,null,null,null,null,null,null,null,null,null,null,null,0,0,0,0,0,0,{"$f":"IF(PZO!$W14=0,\"\",PZO!AD14)","v":""},{"$f":"IF(PZO!$W14=0,\"\",PZO!AF14)","v":""},{"$f":"IF(VL_PARC!$W14=0,\"\",VL_PARC!AD14)","v":""},{"$f":"IF(VL_PARC!$W14=0,\"\",VL_PARC!AF14)","v":""},null,null,null,null,null,null,null,null,null,null,null,null,null,null,null,null,null,"Maior Parcela"]
[null,null,null,null,null,null,null,null,null,null,null,8,"",null,"","","","",null,null,null,null,{"$f":"IF(PZO!W15+VL_PARC!W15>0,'Planilha 1'!W14+1,0)","v":0},0,0,0,0,0,1,{"$error":"#N/A"},{"$error":"#N/A"},{"$error":"#N/A"},{"$error":"#N/A"},null,null,null,null,null,null,null,null,null,null,null,null,null,null,null,null,0,0,0,0,0,0,{"$f":"IF(PZO!$W15=0,\"\",PZO!AD15)","v":""},{"$f":"IF(PZO!$W15=0,\"\",PZO!AF15)","v":""},{"$f":"IF(VL_PARC!$W15=0,\"\",VL_PARC!AD15)","v":""},{"$f":"IF(VL_PARC!$W15=0,\"\",VL_PARC!AF15)","v":""},null,null,null,null,null,null,null,null,null,null,null,null,null,null,null,null,null,"Maior Parcela"]
[null,null,null,null,null,null,null,null,null,{"$f":"J17","v":1.6897391149092833E-2},null,9,"",null,"","","","",null,null,null,null,null,null,null,null,null,null,null,null,null,null,null,null,null,null,null,null,null,null,null,null,null,null,null,null,null,null,null,null,null,null,null,null,null,null,null,null,null,null,null,null,null,null,null,null,null,null,null,null,null,null,null,null,null,null,"Pzo",{"$f":"I10","v":60}]
[null,null,null,null,null,null,null,"Taxa de Juros",{"$f":"J17","v":1.6897391149092833E-2},{"$f":"(1+XIRR($I$35:$I$143,$M$35:$M$143))^(360/365)^(30/360)-1","v":1.6897391149092833E-2},{"$f":"T17","v":""},10,"",null,"","","","",null,{"$f":"IFERROR(IF(J17<'Planilha 1'!Y1,\"Taxa original inferior a mínima\",IF(J17>'Planilha 1'!Z1,\"Atenção! Enquadrar valores p/ port.\",IF(SUM(PZO!$W$4:$W$15,VL_PARC!$W$4:$W$15)=0,\"Refin Indisponivel\",\"\"))),\"\")","v":""},null,null,null,null,null,null,null,null,null,null,null,null,null,null,null,null,null,null,null,null,null,null,null,null,null,null,null,null,null,null,null,null,null,null,null,null,null,null,null,null,null,null,null,null,null,null,null,null,null,null,null,null,null,null,null,null,"Parcela",{"$f":"BS36","v":270}]
[null,null,null,null,null,null,null,"Saldo Calculado pela Taxa",{"$f":"SUM(K36:K143)","v":10000.00007585242},{"$f":"SUM(J36:J143)","v":10000.00007585242},null,11,"",null,"","","",null,null,{"$f":"IFERROR(IF(J17<'Planilha 1'!Y1,2,IF(J17>'Planilha 1'!Z1,1,\"\")),\"\")","v":""},null,null,null,null,null,null,null,null,null,null,null,null,null,null,null,null,null,null,null,null,null,null,null,null,null,null,null,null,null,null,null,null,null,null,null,null,null,null,null,null,null,null,"saldo",14510.8716191106]
[null,null,null,null,null,null,null,null,null,null,null,12,"",null,"","","",null,null,null,null,null,null,null,null,null,null,null,null,null,null,null,null,null,null,null,null,null,null,null,null,null,null,null,null,null,null,null,null,null,null,null,null,null,null,null,null,null,null,null,null,null,null,null,null,null,null,null,null,null,null,null,null,null,null,null,"Maior Prazo",null,1,null,"Maior Prazo",{"$f":"MAX(BY29:EX29)-1","v":5}]
[null,null,null,null,null,null,null,null,null,null,null,null,null,null,null,null,null,null,null,null,null,null,null,null,null,null,null,{"$f":"IFERROR(VLOOKUP(Y20,$W$4:$AF$15,8,0),\"\")","v":12125.074221916626},null,null,null,null,null,null,null,null,null,null,null,null,null,null,null,null,null,null,null,null,null,null,null,null,null,null,null,null,null,null,null,null,null,null,null,null,null,null,null,null,null,null,null,null,null,null,null,null,"Pzo",{"$f":"MIN(HLOOKUP(CA19,$BY$29:$EX$31,3,0),'Planilha 1'!I10)","v":60},null,null,"Pzo"]
[null,null,null,null,null,null,null,null,null,null,null,null,null,null,null,null,null,null,null,null,null,null,null,null,null,null,null,null,null,null,null,null,null,null,null,null,null,null,null,null,null,null,null,null,null,null,null,null,null,null,null,null,null,null,null,null,null,null,null,null,null,null,null,{"$f":"BL32*1000","v":17.852294835851048},null,null,null,null,null,null,null,null,null,null,null,null,"Taxa",{"$f":"MIN(HLOOKUP(CA19,$BY$29:$EX$32,4,0),'Planilha 1'!I17)","v":1.5144779179962597E-2},null,null,"Taxa"]
[null,null,null,null,null,null,null,"Taxa AP considerando base 365",{"$f":"J16","v":1.6897391149092833E-2},null,null,null,null,null,null,null,null,null,null,null,null,null,null,null,null,null,null,null,null,null,null,null,null,null,null,null,null,null,null,null,null,null,null,null,null,null,null,null,null,null,null,null,null,null,null,null,null,null,null,null,null,null,null,{"$f":"1.55%*1000","v":15.5},{"$f":"BL22-BL21","v":-2.3522948358510476}]
[null,null,null,null,null,null,null,"Taxa CET da PORT",{"$f":"J17","v":1.6897391149092833E-2},null,null,null,null,null,null,null,null,null,null,null,null,null,null,null,null,null,null,null,null,null,null,null,null,null,null,null,null,null,null,null,null,null,null,null,null,null,null,null,null,null,null,null,null,null,null,null,null,null,null,null,null,null,null,null,null,null,null,null,null,null,null,null,null,null,"Teto Conv",{"$f":"Z1","v":1.8499999999999999E-2}]
[null,null,null,null,null,null,null,null,null,null,null,null,null,null,null,null,null,null,null,null,null,null,null,null,null,null,null,null,null,null,null,null,null,null,null,null,null,null,null,null,null,null,null,null,null,null,null,null,null,null,null,null,null,null,null,null,null,null,null,null,null,null,null,null,null,null,null,null,null,null,null,null,null,null,"Pzo Conv",{"$f":"Z2","v":108}]
[null,null,null,null,null,null,null,"Enquadramento Port",null,null,null,null,null,"Taxa minima TAB PORT",null,null,null,null,null,null,null,null,null,null,null,null,null,null,null,null,null,null,null,null,null,null,null,null,null,null,null,null,null,null,null,null,null,null,null,null,null,null,null,null,null,null,null,null,null,null,null,null,null,null,null,null,null,null,null,null,null,null,null,null,null,null,{"$f":"IF(((BY31*BY30)+($BX$23*($BX$24-BY30)))/$BX$24<$BX$23,1,0)","v":0}]
[null,null,null,null,null,null,null,"1. Otimiza Pzo *",{"$f":"IF('Simulador Port'!$C$2=\"INSS\",'Planilha 1'!J26,\"NORMAL\")","v":"Normal"},{"$f":"IF('Simulador Port'!C23>=$N$26,\"Normal\",IF('Simulador Port'!C23>=$N$27,\"Flex 1\",NA()))","v":"Normal"},null,"Normal",null,1.6799999999999999E-2,null,null,null,null,null,null,null,null,null,null,null,null,null,null,null,null,null,null,null,null,null,null,null,null,null,null,null,null,null,null,null,null,null,null,null,null,null,null,null,null,null,null,null,null,null,null,null,"SEM MUDA PRAZO","SOMAR 1 PARCELA","SOMAR 2 PARCELAS","TIRAR 1 PARCELA","TIRAR 2 PARCELAS",null,null,null,null,null,null,null,null,"Tx Alvo","Teto Pond",{"$f":"IF(((BY32*BY31)+($BX$23*($BX$24-BY31)))/$BX$24<$BX$23,1,0)","v":0},{"$f":"IF(((BZ32*BZ31)+($BX$23*($BX$24-BZ31)))/$BX$24<$BX$23,1,0)","v":0},0,0,0,0,0,0,0,0,0,0,0,0,0,0,0,0,0,0,0,0,0,0,0,0,0,0,0,0,0,0,0,{"$f":"IF(((DF32*DF31)+($BX$23*($BX$24-DF31)))/$BX$24<$BX$23,1,0)","v":0},0,0,1,1,1,1,1,1,1,1,1,1,1,1,1,1,1,1,1,1,1,1,1,1,1,1,1,1,1,1,1,{"$f":"IF(((EL32*EL31)+($BX$23*($BX$24-EL31)))/$BX$24<$BX$23,1,0)","v":1},1,1,1,1,1,1,1,1,1,1,1,1,{"$f":"IF(((EY32*EY31)+($BX$23*($BX$24-EY31)))/$BX$24<$BX$23,1,0)","v":1},1,1,1,1,1,1,1,1,1,1,1,1,1,1,1,1,1,1]
[null,null,null,null,null,null,null,"2.Redução Vlr Parcela**",{"$f":"IF('Simulador Port'!$C$2=\"INSS\",'Planilha 1'!J27,\"NORMAL\")","v":"Normal"},{"$f":"IF('Simulador Port'!E23>=$N$26,\"Normal\",IF('Simulador Port'!E23>=$N$27,\"Flex 1\",NA()))","v":"Normal"},null,"Flex1",null,1.35E-2,null,null,null,null,null,null,null,null,null,null,null,null,null,null,null,null,null,null,null,null,null,null,null,null,null,null,null,null,null,null,null,{"$f":"XIRR(AU$35:AU$143,$H$35:$H$143)","v":6.1476138234138486E-2},{"$f":"XIRR(AV$35:AV$143,$H$35:$H$143)","v":6.1476138234138486E-2},6.0273954272270197E-2,5.8066871762275707E-2,5.5275341868400565E-2,5.2447351813316362E-2,{"$error":"#N/A"},{"$error":"#N/A"},{"$error":"#N/A"},{"$error":"#N/A"},{"$error":"#N/A"},{"$error":"#N/A"},null,null,null,null,{"$f":"IF(K17<>\"\",\"Taxa original inferior a mínima\",\"\")","v":""},{"$f":"IF(BK32<'Planilha 1'!$Y$1,\"Taxa original inferior a mínima\",\"\")","v":""},{"$f":"IF(BL32<'Planilha 1'!$Y$1,\"Taxa original inferior a mínima\",\"\")","v":""},{"$f":"IF(BM32<'Planilha 1'!$Y$1,\"Taxa original inferior a mínima\",\"\")","v":""},{"$f":"IF(BN32<'Planilha 1'!$Y$1,\"Taxa original inferior a mínima\",\"\")","v":""},null,null,null,null,null,null,null,null,null,"VAlid1",{"$f":"IF(BY31>$P$3-12,0,IF(BY31>$I$10,0,1))","v":0},{"$f":"IF(BZ31>$P$3-12,0,IF(BZ31>$I$10,0,1))","v":0},{"$f":"IF(CA31>$P$3-12,0,IF(CA31>$I$10,0,1))","v":0},0,0,0,0,0,0,0,0,0,0,0,0,0,0,0,0,0,0,{"$f":"IF(CT31>$P$3-12,0,IF(CT31>$I$10,0,1))","v":0},0,0,0,0,0,0,0,0,0,0,0,0,0,0,0,0,0,0,0,0,0,0,0,0,0,0,1,1,1,1,1,1,1,1,1,1,1,1,1,1,1,1,1,{"$f":"IF(EL31>$P$3-12,0,IF(EL31>$I$10,0,1))","v":1},1,1,1,1,1,1,1,1,1,1,1,1,{"$f":"IF(EY31>$P$3-12,0,IF(EY31>$I$10,0,1))","v":1},1,1,1,1,1,1,1,1,1,1,1,1,1,1,1,1,1,1]
[null,null,null,null,null,null,null,null,null,null,null,null,null,null,null,null,null,null,null,null,null,null,null,null,null,null,null,null,null,null,null,null,null,{"$f":"U32-$J$8","v":2125.0741460642057},{"$f":"V32-$J$8","v":2125.0741460642057},2236.4540916585593,2443.2322752910677,2709.0971398688653,2983.4739698426529,{"$error":"#N/A"},{"$error":"#N/A"},{"$error":"#N/A"},{"$error":"#N/A"},{"$error":"#N/A"},{"$error":"#N/A"},null,null,null,null,null,null,null,null,null,null,null,null,null,null,null,null,null,null,null,null,null,null,null,null,null,null,null,null,null,"Tx Alvo",{"$f":"Y1","v":1.35E-2},{"$f":"MAX((BY32-$BX$28)*BY27*BY26,0)","v":0},{"$f":"MAX((BZ32-$BX$28)*BZ27*BZ26,0)","v":0},0,0,0,0,0,0,0,0,0,0,0,0,0,0,0,0,0,0,0,0,0,0,0,0,0,0,0,0,0,0,0,0,0,0,0,0,0,0,0,0,0,0,0,0,0,0,1.6447791799625976E-3,1.2899227901528986E-3,9.1820056709475233E-4,5.2860565599772806E-4,1.2024171228015683E-4,0,0,0,0,0,0,0,0,0,0,0,0,{"$f":"MAX((EL32-$BX$28)*EL27*EL26,0)","v":0},0,{"$f":"MAX((EN32-$BX$28)*EN27*EN26,0)","v":0},0,0,0,0,0,0,0,0,0,0,{"$f":"MAX((EY32-$BX$28)*EY27*EY26,0)","v":0},0,0,0,0,0,0,0,0,0,0,0,0,0,0,0,0,0,0]
[null,null,null,null,null,null,null,null,null,null,null,null,null,null,null,null,null,null,null,"Taxa REFIN",{"$f":"VLOOKUP(U34,$AA$4:$AC$15,3,0)","v":1.0005820495985809},{"$f":"VLOOKUP(V34,$AA$4:$AC$15,3,0)","v":1.0005820495985809},{"$f":"VLOOKUP(W34,$AA$4:$AC$15,3,0)","v":1.0005748493086513},{"$f":"VLOOKUP(X34,$AA$4:$AC$15,3,0)","v":1.0005617338526143},1.0005453325183937,1.0005289233836074,{"$error":"#N/A"},{"$error":"#N/A"},{"$error":"#N/A"},{"$error":"#N/A"},{"$error":"#N/A"},{"$error":"#N/A"},null,{"$f":"SUM(AH35:AH143)","v":92.319531811806996},{"$f":"SUM(AI35:AI143)","v":92.319531811806996},94.317825693092928,98.050681340323393,102.89314393191702,107.9398742041439,{"$error":"#N/A"},{"$error":"#N/A"},{"$error":"#N/A"},{"$error":"#N/A"},{"$error":"#N/A"},{"$error":"#N/A"},null,{"$f":"(1+AT27)^(30/365)-1","v":4.9156469434352701E-3},4.9156469434352701E-3,4.8220536960905669E-3,4.6499725681552473E-3,4.4318509451279908E-3,4.2103397725425928E-3,{"$error":"#N/A"},{"$error":"#N/A"},{"$error":"#N/A"},{"$error":"#N/A"},{"$error":"#N/A"},{"$error":"#N/A"},null,null,null,null,null,null,null,null,null,null,null,null,null,null,null,null,null,null,{"$f":"RANK(BY28,$BY$28:$EX$28,0)","v":6},6,6,6,6,6,6,6,6,6,6,6,6,6,6,6,6,6,6,6,6,6,6,6,6,6,6,6,6,6,6,6,{"$f":"RANK(DE28,$BY$28:$EX$28,0)","v":6},6,6,6,6,6,6,6,6,6,6,6,6,6,6,6,1,2,3,4,5,6,6,6,6,6,6,6,6,6,6,6,{"$f":"RANK(EK28,$BY$28:$EX$28,0)","v":6},6,6,6,6,6,6,6,6,6,6,6,6,6,{"$f":"RANK(EY28,$BY$28:$EX$28,0)","v":6},6,6,6,6,6,6,6,6,6,6,6,6,6,6,6,6,6,{"$f":"RANK(FQ28,$BY$28:$EX$28,0)","v":6}]
[null,null,null,null,null,null,null,"dt ini fx pmt",null,{"$f":"NETWORKDAYS(EOMONTH(I7,-1)+1,I7,$A$34:$A$1297)","v":17}]
[null,null,null,null,null,null,null,"Prox Vencimento",null,{"$f":"IF(I31=\"\",IF(P2=\"INSS\",IF(J30<3,EOMONTH(I7,3)+7,EOMONTH(I7,4)+7),IF(DAY(I7)<11,EOMONTH(I7,0)+10,EOMONTH(I7,1)+10)),I31)","v":"2026-10-07"},null,null,{"$f":"IF(I31=\"\",IF(P2=\"INSS\",IF(J30<3,EOMONTH(I7,0)+7,EOMONTH(I7,1)+7),IF(DAY(I7)<11,EOMONTH(I7,0)+10,EOMONTH(I7,1)+10)),I31)","v":"2026-07-07"},null,null,null,null,null,null,null,{"$f":"U32-$I$8","v":2125.0742219166259},{"$f":"V32-$I$8","v":2125.0742219166259},2236.4541675109795,2443.2323511434879,2709.0972157212855,2983.4740456950731,{"$error":"#N/A"},{"$error":"#N/A"},{"$error":"#N/A"},{"$error":"#N/A"},{"$f":"AE32-$I$8","v":{"$error":"#N/A"}},{"$error":"#N/A"},null,null,null,null,null,null,null,null,null,null,null,null,null,null,null,null,null,null,null,null,null,null,null,null,null,null,null,null,null,"Prox Vencimento",null,{"$f":"M31","v":"2026-07-07"},null,null,null,null,null,{"$f":"(1+BX23)^((364.6/12)/30)-1","v":1.8738590066706973E-2},null,{"$f":"MAX($I$10-3,BZ20)","v":60},{"$f":"MAX($I$10-3,BZ20)","v":60},null,null,"Pzo",{"$f":"COUNTIFS(BY36:BY143,\">\"&0)","v":108},{"$f":"COUNTIFS(BZ36:BZ143,\">\"&0)","v":107},106,105,104,103,102,101,100,99,98,97,96,95,94,93,92,91,90,89,88,87,86,85,84,83,82,81,80,79,78,77,76,75,74,73,72,71,70,69,68,67,66,65,64,63,62,61,60,59,58,57,56,55,54,53,52,51,50,49,48,47,46,45,44,{"$f":"COUNTIFS(EL36:EL143,\">\"&0)","v":43},42,41,40,39,38,37,36,35,34,33,32,31,{"$f":"COUNTIFS(EY36:EY143,\">\"&0)","v":30},29,28,27,26,25,24,23,22,21,20,19,18,17,16,15,14,13,12]
[null,null,null,null,null,null,null,"Fator Dia",{"$f":"(1+I17)^(1/30)","v":1.0005586966234388},{"$f":"(1+J17)^(1/30)","v":1.0005586966234388},null,null,null,null,null,null,null,null,null,"Vlr Troco",{"$f":"SUM(U36:U143)","v":12125.074221916626},{"$f":"SUM(V36:V143)","v":12125.074221916626},12236.454167510979,12443.232351143488,12709.097215721285,12983.474045695073,{"$error":"#N/A"},{"$error":"#N/A"},{"$error":"#N/A"},{"$error":"#N/A"},{"$error":"#N/A"},{"$error":"#N/A"},null,null,null,null,null,null,null,null,null,null,null,null,null,null,null,null,null,null,null,null,null,null,null,null,null,null,null,null,null,"XITR",{"$f":"(1+XIRR(BK$35:BK$143,$BJ$35:$BJ$143))^(30/360)-1","v":1.7501773465547377E-2},{"$f":"(1+XIRR(BL$35:BL$143,$BJ$35:$BJ$143))^(30/360)-1","v":1.7852294835851046E-2},1.6748367289740829E-2,1.6343308340452278E-2,null,null,null,{"$f":"BX23","v":1.8499999999999999E-2},{"$f":"(1+XIRR(BS$35:BS$143,$BJ$35:$BJ$143))^(30/365)-1","v":1.6897391149092833E-2},{"$f":"MIN(PMT($BR$31,MAX($I$10-3,BZ20),$BR$35),I9)","v":270},{"$f":"MIN(PMT($BR$31,MAX($I$10-3,BZ20),$BR$35),I9)","v":270},null,null,"Tx",{"$f":"(1+XIRR(BY35:BY143,'Planilha 1'!$H$35:$H$143))^(30/365)-1","v":2.2484785967047838E-2},{"$f":"(1+XIRR(BZ35:BZ143,'Planilha 1'!$H$35:$H$143))^(30/365)-1","v":2.2426328933873307E-2},{"$f":"(1+XIRR(CA35:CA143,'Planilha 1'!$H$35:$H$143))^(30/365)-1","v":2.2365936474786796E-2},{"$f":"(1+XIRR(CB35:CB143,'Planilha 1'!$H$35:$H$143))^(30/365)-1","v":2.23035358504311E-2},{"$f":"(1+XIRR(CC35:CC143,'Planilha 1'!$H$35:$H$143))^(30/365)-1","v":2.2239096151943194E-2},{"$f":"(1+XIRR(CD35:CD143,'Planilha 1'!$H$35:$H$143))^(30/365)-1","v":2.217249114788733E-2},{"$f":"(1+XIRR(CE35:CE143,'Planilha 1'!$H$35:$H$143))^(30/365)-1","v":2.210368850665545E-2},{"$f":"(1+XIRR(CF35:CF143,'Planilha 1'!$H$35:$H$143))^(30/365)-1","v":2.2032551179806958E-2},{"$f":"(1+XIRR(CG35:CG143,'Planilha 1'!$H$35:$H$143))^(30/365)-1","v":2.1959147558531233E-2},{"$f":"(1+XIRR(CH35:CH143,'Planilha 1'!$H$35:$H$143))^(30/365)-1","v":2.1883226784954468E-2},{"$f":"(1+XIRR(CI35:CI143,'Planilha 1'!$H$35:$H$143))^(30/365)-1","v":2.1804689455694248E-2},{"$f":"(1+XIRR(CJ35:CJ143,'Planilha 1'!$H$35:$H$143))^(30/365)-1","v":2.17234880277557E-2},{"$f":"(1+XIRR(CK35:CK143,'Planilha 1'!$H$35:$H$143))^(30/365)-1","v":2.1639455764697058E-2},{"$f":"(1+XIRR(CL35:CL143,'Planilha 1'!$H$35:$H$143))^(30/365)-1","v":2.1552540905212414E-2},{"$f":"(1+XIRR(CM35:CM143,'Planilha 1'!$H$35:$H$143))^(30/365)-1","v":2.1462561378490452E-2},{"$f":"(1+XIRR(CN35:CN143,'Planilha 1'!$H$35:$H$143))^(30/365)-1","v":2.1369391371885316E-2},{"$f":"(1+XIRR(CO35:CO143,'Planilha 1'!$H$35:$H$143))^(30/365)-1","v":2.1272964666317007E-2},{"$f":"(1+XIRR(CP35:CP143,'Planilha 1'!$H$35:$H$143))^(30/365)-1","v":2.1173076415903713E-2},{"$f":"(1+XIRR(CQ35:CQ143,'Planilha 1'!$H$35:$H$143))^(30/365)-1","v":2.1069653265350485E-2},{"$f":"(1+XIRR(CR35:CR143,'Planilha 1'!$H$35:$H$143))^(30/365)-1","v":2.0962470369896957E-2},{"$f":"(1+XIRR(CS35:CS143,'Planilha 1'!$H$35:$H$143))^(30/365)-1","v":2.0851597879017802E-2},{"$f":"(1+XIRR(CT35:CT143,'Planilha 1'!$H$35:$H$143))^(30/365)-1","v":2.0736643064651172E-2},{"$f":"(1+XIRR(CU35:CU143,'Planilha 1'!$H$35:$H$143))^(30/365)-1","v":2.0617428394948734E-2},{"$f":"(1+XIRR(CV35:CV143,'Planilha 1'!$H$35:$H$143))^(30/365)-1","v":2.0493848298499096E-2},{"$f":"(1+XIRR(CW35:CW143,'Planilha 1'!$H$35:$H$143))^(30/365)-1","v":2.0365625518101726E-2},{"$f":"(1+XIRR(CX35:CX143,'Planilha 1'!$H$35:$H$143))^(30/365)-1","v":2.0232640420836612E-2},{"$f":"(1+XIRR(CY35:CY143,'Planilha 1'!$H$35:$H$143))^(30/365)-1","v":2.0094586826277849E-2},{"$f":"(1+XIRR(CZ35:CZ143,'Planilha 1'!$H$35:$H$143))^(30/365)-1","v":1.995123295812129E-2},{"$f":"(1+XIRR(DA35:DA143,'Planilha 1'!$H$35:$H$143))^(30/365)-1","v":1.9802432907942924E-2},{"$f":"(1+XIRR(DB35:DB143,'Planilha 1'!$H$35:$H$143))^(30/365)-1","v":1.964783393063696E-2},{"$f":"(1+XIRR(DC35:DC143,'Planilha 1'!$H$35:$H$143))^(30/365)-1","v":1.948726631041664E-2},{"$f":"(1+XIRR(DD35:DD143,'Planilha 1'!$H$35:$H$143))^(30/365)-1","v":1.9320343638431492E-2},{"$f":"(1+XIRR(DE35:DE143,'Planilha 1'!$H$35:$H$143))^(30/365)-1","v":1.9147092511773156E-2},{"$f":"(1+XIRR(DF35:DF143,'Planilha 1'!$H$35:$H$143))^(30/365)-1","v":1.8966871264327612E-2},{"$f":"(1+XIRR(DG35:DG143,'Planilha 1'!$H$35:$H$143))^(30/365)-1","v":1.8779339825460095E-2},{"$f":"(1+XIRR(DH35:DH143,'Planilha 1'!$H$35:$H$143))^(30/365)-1","v":1.8584257469549392E-2},{"$f":"(1+XIRR(DI35:DI143,'Planilha 1'!$H$35:$H$143))^(30/365)-1","v":1.8381124707592456E-2},{"$f":"(1+XIRR(DJ35:DJ143,'Planilha 1'!$H$35:$H$143))^(30/365)-1","v":1.8169662513100482E-2},{"$f":"(1+XIRR(DK35:DK143,'Planilha 1'!$H$35:$H$143))^(30/365)-1","v":1.7949318155577876E-2},{"$f":"(1+XIRR(DL35:DL143,'Planilha 1'!$H$35:$H$143))^(30/365)-1","v":1.7719631160948213E-2},{"$f":"(1+XIRR(DM35:DM143,'Planilha 1'!$H$35:$H$143))^(30/365)-1","v":1.7480255019325153E-2},{"$f":"(1+XIRR(DN35:DN143,'Planilha 1'!$H$35:$H$143))^(30/365)-1","v":1.7230537312988847E-2},{"$f":"(1+XIRR(DO35:DO143,'Planilha 1'!$H$35:$H$143))^(30/365)-1","v":1.6970072831798522E-2},{"$f":"(1+XIRR(DP35:DP143,'Planilha 1'!$H$35:$H$143))^(30/365)-1","v":1.6698130824759128E-2},{"$f":"(1+XIRR(DQ35:DQ143,'Planilha 1'!$H$35:$H$143))^(30/365)-1","v":1.6414396994524294E-2},{"$f":"(1+XIRR(DR35:DR143,'Planilha 1'!$H$35:$H$143))^(30/365)-1","v":1.611790169706806E-2},{"$f":"(1+XIRR(DS35:DS143,'Planilha 1'!$H$35:$H$143))^(30/365)-1","v":1.5807927882070194E-2},{"$f":"(1+XIRR(DT35:DT143,'Planilha 1'!$H$35:$H$143))^(30/365)-1","v":1.54838806587414E-2},{"$f":"(1+XIRR(DU35:DU143,'Planilha 1'!$H$35:$H$143))^(30/365)-1","v":1.5144779179962597E-2},{"$f":"(1+XIRR(DV35:DV143,'Planilha 1'!$H$35:$H$143))^(30/365)-1","v":1.4789922790152898E-2},{"$f":"(1+XIRR(DW35:DW143,'Planilha 1'!$H$35:$H$143))^(30/365)-1","v":1.4418200567094752E-2},{"$f":"(1+XIRR(DX35:DX143,'Planilha 1'!$H$35:$H$143))^(30/365)-1","v":1.4028605655997728E-2},{"$f":"(1+XIRR(DY35:DY143,'Planilha 1'!$H$35:$H$143))^(30/365)-1","v":1.3620241712280157E-2},{"$f":"(1+XIRR(DZ35:DZ143,'Planilha 1'!$H$35:$H$143))^(30/365)-1","v":1.3191760973156219E-2},{"$f":"(1+XIRR(EA35:EA143,'Planilha 1'!$H$35:$H$143))^(30/365)-1","v":1.2742103482776601E-2},{"$f":"(1+XIRR(EB35:EB143,'Planilha 1'!$H$35:$H$143))^(30/365)-1","v":1.2269728226032672E-2},{"$f":"(1+XIRR(EC35:EC143,'Planilha 1'!$H$35:$H$143))^(30/365)-1","v":1.1773768923732497E-2},{"$f":"(1+XIRR(ED35:ED143,'Planilha 1'!$H$35:$H$143))^(30/365)-1","v":1.1252060554749255E-2},{"$f":"(1+XIRR(EE35:EE143,'Planilha 1'!$H$35:$H$143))^(30/365)-1","v":1.0702897407647738E-2},{"$f":"(1+XIRR(EF35:EF143,'Planilha 1'!$H$35:$H$143))^(30/365)-1","v":1.0124629309634869E-2},{"$f":"(1+XIRR(EG35:EG143,'Planilha 1'!$H$35:$H$143))^(30/365)-1","v":9.5150493842630635E-3},{"$f":"(1+XIRR(EH35:EH143,'Planilha 1'!$H$35:$H$143))^(30/365)-1","v":8.8721761882055716E-3},{"$f":"(1+XIRR(EI35:EI143,'Planilha 1'!$H$35:$H$143))^(30/365)-1","v":8.1934385662723042E-3},{"$f":"(1+XIRR(EJ35:EJ143,'Planilha 1'!$H$35:$H$143))^(30/365)-1","v":7.4762585853980212E-3},{"$f":"(1+XIRR(EK35:EK143,'Planilha 1'!$H$35:$H$143))^(30/365)-1","v":6.7179987487562265E-3},{"$f":"(1+XIRR(EL35:EL143,'Planilha 1'!$H$35:$H$143))^(30/365)-1","v":5.9153942266683135E-3},{"$f":"(1+XIRR(EM35:EM143,'Planilha 1'!$H$35:$H$143))^(30/365)-1","v":5.0652324977829011E-3},{"$f":"(1+XIRR(EN35:EN143,'Planilha 1'!$H$35:$H$143))^(30/365)-1","v":4.1636511562028744E-3},{"$f":"(1+XIRR(EO35:EO143,'Planilha 1'!$H$35:$H$143))^(30/365)-1","v":3.2069211584837554E-3},{"$f":"(1+XIRR(EP35:EP143,'Planilha 1'!$H$35:$H$143))^(30/365)-1","v":2.1901143183928884E-3},{"$f":"(1+XIRR(EQ35:EQ143,'Planilha 1'!$H$35:$H$143))^(30/365)-1","v":1.108289725388234E-3},{"$f":"(1+XIRR(ER35:ER143,'Planilha 1'!$H$35:$H$143))^(30/365)-1","v":-4.4004181582679713E-5},{"$f":"(1+XIRR(ES35:ES143,'Planilha 1'!$H$35:$H$143))^(30/365)-1","v":-1.2728950584002252E-3},{"$f":"(1+XIRR(ET35:ET143,'Planilha 1'!$H$35:$H$143))^(30/365)-1","v":-2.5852014041162219E-3},{"$f":"(1+XIRR(EU35:EU143,'Planilha 1'!$H$35:$H$143))^(30/365)-1","v":-3.9883976448875647E-3},{"$f":"(1+XIRR(EV35:EV143,'Planilha 1'!$H$35:$H$143))^(30/365)-1","v":-5.4908024315601933E-3},{"$f":"(1+XIRR(EW35:EW143,'Planilha 1'!$H$35:$H$143))^(30/365)-1","v":-7.1020871419477105E-3},{"$f":"(1+XIRR(EX35:EX143,'Planilha 1'!$H$35:$H$143))^(30/365)-1","v":-8.832484347156111E-3},{"$f":"(1+XIRR(EY35:EY143,'Planilha 1'!$H$35:$H$143))^(30/365)-1","v":-1.069436712828109E-2},{"$f":"(1+XIRR(EZ35:EZ143,'Planilha 1'!$H$35:$H$143))^(30/365)-1","v":-1.2700550375850383E-2},{"$f":"(1+XIRR(FA35:FA143,'Planilha 1'!$H$35:$H$143))^(30/365)-1","v":-1.4869303996144168E-2},{"$f":"(1+XIRR(FB35:FB143,'Planilha 1'!$H$35:$H$143))^(30/365)-1","v":-1.721582137916966E-2},{"$f":"(1+XIRR(FC35:FC143,'Planilha 1'!$H$35:$H$143))^(30/365)-1","v":-1.9759712432263932E-2},{"$f":"(1+XIRR(FD35:FD143,'Planilha 1'!$H$35:$H$143))^(30/365)-1","v":-2.2525533943206999E-2},{"$f":"(1+XIRR(FE35:FE143,'Planilha 1'!$H$35:$H$143))^(30/365)-1","v":-2.5537725500724973E-2},{"$f":"(1+XIRR(FF35:FF143,'Planilha 1'!$H$35:$H$143))^(30/365)-1","v":-2.8829352855156531E-2},{"$f":"(1+XIRR(FG35:FG143,'Planilha 1'!$H$35:$H$143))^(30/365)-1","v":-3.2432915058612011E-2},{"$f":"(1+XIRR(FH35:FH143,'Planilha 1'!$H$35:$H$143))^(30/365)-1","v":-3.6388547433218288E-2},{"$f":"(1+XIRR(FI35:FI143,'Planilha 1'!$H$35:$H$143))^(30/365)-1","v":-4.074932933168296E-2},{"$f":"(1+XIRR(FJ35:FJ143,'Planilha 1'!$H$35:$H$143))^(30/365)-1","v":-4.5566534203971831E-2},{"$f":"(1+XIRR(FK35:FK143,'Planilha 1'!$H$35:$H$143))^(30/365)-1","v":-5.0915089039976991E-2},{"$f":"(1+XIRR(FL35:FL143,'Planilha 1'!$H$35:$H$143))^(30/365)-1","v":-5.68668765224426E-2},{"$f":"(1+XIRR(FM35:FM143,'Planilha 1'!$H$35:$H$143))^(30/365)-1","v":-6.3546208882319211E-2},{"$f":"(1+XIRR(FN35:FN143,'Planilha 1'!$H$35:$H$143))^(30/365)-1","v":-7.1050701357357582E-2},{"$f":"(1+XIRR(FO35:FO143,'Planilha 1'!$H$35:$H$143))^(30/365)-1","v":-7.9521499573914967E-2},{"$f":"(1+XIRR(FP35:FP143,'Planilha 1'!$H$35:$H$143))^(30/365)-1","v":-8.9163261639357838E-2},{"$f":"(1+XIRR(FQ35:FQ143,'Planilha 1'!$H$35:$H$143))^(30/365)-1","v":-0.10017501091163816}]
["Data","Dia da Semana","Feriado",null,null,null,null,"OPERAÇÃO ORIGINAL",null,null,null,null,null,null,null,null,null,null,null,"REFINANCIAMENTO",null,null,null,null,null,null,null,null,null,null,null,null,null,"IOF",null,null,null,null,null,null,null,null,null,null,null,null,"REFINANCIAMENTO",null,null,null,null,null,null,null,null,null,null,null,null,null,null,"OPERAÇÃO ORIGINAL",null,null,null,null,null,null,null,{"$f":"(1+BX23)^(1/30)","v":1.000611218607504},{"$f":"(1+XIRR(BR$35:BR$143,$BP$35:$BP$143))^(30/365)-1","v":1.8459054867643765E-2},{"$f":"(1+XIRR(BT$35:BT$143,$BO$35:$BO$143))^(30/365)-1","v":1.5894337678863613E-2},{"$f":"(1+XIRR(BU$35:BU$143,$BO$35:$BO$143))^(30/365)-1","v":1.6897391149092833E-2},null,null,null,108,{"$f":"BY33-1","v":107},{"$f":"BZ33-1","v":106},105,104,103,102,101,100,99,98,97,96,95,94,93,92,91,90,89,88,87,86,85,84,{"$f":"CW33-1","v":83},82,81,80,79,78,77,76,75,74,73,72,71,70,69,68,67,66,65,64,63,62,61,60,59,58,57,56,55,54,53,52,51,50,49,48,47,46,45,44,43,42,41,40,39,38,37,36,35,34,33,32,31,{"$f":"EX33-1","v":30},{"$f":"EY33-1","v":29},{"$f":"EZ33-1","v":28},{"$f":"FA33-1","v":27},{"$f":"FB33-1","v":26},{"$f":"FC33-1","v":25},{"$f":"FD33-1","v":24},{"$f":"FE33-1","v":23},{"$f":"FF33-1","v":22},{"$f":"FG33-1","v":21},{"$f":"FH33-1","v":20},{"$f":"FI33-1","v":19},{"$f":"FJ33-1","v":18},{"$f":"FK33-1","v":17},{"$f":"FL33-1","v":16},{"$f":"FM33-1","v":15},{"$f":"FN33-1","v":14},{"$f":"FO33-1","v":13},12]
["2001-01-01","segunda-feira","Confraternização Universal",null,null,null,null,"DATA EV","FLUXO","Principal","Principal2","IOF","Data Sld",null,null,null,null,null,null,"FX Refin","Normal","Flex 1","Flex 2","Flex 3","Flex 4","Flex 5","Flex 6","Flex 7","Flex 8","Flex 9","Flex 10","Flex 11",null,"Normal","Flex 1","Flex 2","Flex 3","Flex 4","Flex 5","Flex 6","Flex 7","Flex 8","Flex 9","Flex 10","Flex 11",null,"Normal","Flex 1","Flex 2","Flex 3","Flex 4","Flex 5","Flex 6","Flex 7","Flex 8","Flex 9","Flex 10","Flex 11",null,null,null,"DATA EV","FLUXO1","FLUXO2","FLUXO3","FLUXO4",null,null,null,"FLUX06",null,null,null,null,null,null,"FLUXO","FLUXO","FLUXO","FLUXO","FLUXO","FLUXO","FLUXO","FLUXO","FLUXO","FLUXO","FLUXO","FLUXO","FLUXO","FLUXO","FLUXO","FLUXO","FLUXO","FLUXO","FLUXO","FLUXO","FLUXO","FLUXO","FLUXO","FLUXO","FLUXO","FLUXO","FLUXO","FLUXO","FLUXO","FLUXO","FLUXO","FLUXO","FLUXO","FLUXO","FLUXO","FLUXO","FLUXO","FLUXO","FLUXO","FLUXO","FLUXO","FLUXO","FLUXO","FLUXO","FLUXO","FLUXO","FLUXO","FLUXO","FLUXO","FLUXO","FLUXO","FLUXO","FLUXO","FLUXO","FLUXO","FLUXO","FLUXO","FLUXO","FLUXO","FLUXO","FLUXO","FLUXO","FLUXO","FLUXO","FLUXO","FLUXO","FLUXO","FLUXO","FLUXO","FLUXO","FLUXO","FLUXO","FLUXO","FLUXO","FLUXO","FLUXO","FLUXO","FLUXO","FLUXO","FLUXO","FLUXO","FLUXO","FLUXO","FLUXO","FLUXO","FLUXO","FLUXO","FLUXO","FLUXO","FLUXO","FLUXO","FLUXO","FLUXO","FLUXO","FLUXO","FLUXO","FLUXO"]
["2001-02-26","segunda-feira","Carnaval",null,null,null,0,{"$f":"I7","v":"2026-05-26"},{"$f":"-I8","v":-10000},null,";",{"$f":"I35*-0.38%","v":38},{"$f":"I7","v":"2026-05-26"},null,null,null,null,null,null,{"$f":"I35","v":-10000},null,null,null,null,null,null,null,null,null,null,null,null,null,{"$f":"(U31)*$B$2","v":8.0752820432831776},{"$f":"(V31)*$B$2","v":8.0752820432831776},8.498525836541722,9.2842829343452546,10.294569419740885,11.337201373641278,{"$error":"#N/A"},{"$error":"#N/A"},{"$error":"#N/A"},{"$error":"#N/A"},{"$error":"#N/A"},{"$error":"#N/A"},null,{"$f":"-U32+$I$35","v":-22125.074221916628},{"$f":"-V32+$I$35","v":-22125.074221916628},-22236.454167510979,-22443.232351143488,-22709.097215721285,-22983.474045695075,{"$error":"#N/A"},{"$error":"#N/A"},{"$error":"#N/A"},{"$error":"#N/A"},{"$error":"#N/A"},{"$error":"#N/A"},null,null,0,{"$f":"H35","v":"2026-05-26"},{"$f":"I35","v":-10000},{"$f":"BK35","v":-10000},{"$f":"BL35","v":-10000},{"$f":"BM35","v":-10000},{"$f":"H35","v":"2026-05-26"},{"$f":"EDATE(BJ36,-1)","v":"2026-06-07"},{"$f":"-BJ35+BP35","v":12},{"$f":"-((-BN35)*BR33^BQ35)","v":-10073.593304151795},{"$f":"BN35","v":-10000},{"$f":"BM35","v":-10000},{"$f":"BN35","v":-10000},null,null,null,{"$f":"BN35","v":-10000},{"$f":"BY35","v":-10000},{"$f":"BZ35","v":-10000},-10000,-10000,-10000,-10000,-10000,-10000,-10000,-10000,-10000,-10000,-10000,-10000,-10000,-10000,-10000,-10000,-10000,-10000,-10000,-10000,-10000,-10000,{"$f":"CW35","v":-10000},-10000,-10000,-10000,-10000,-10000,-10000,-10000,-10000,-10000,-10000,-10000,-10000,-10000,-10000,-10000,-10000,-10000,-10000,-10000,-10000,-10000,-10000,-10000,-10000,-10000,-10000,-10000,-10000,-10000,-10000,-10000,-10000,-10000,-10000,-10000,-10000,-10000,-10000,-10000,-10000,-10000,-10000,-10000,-10000,-10000,-10000,-10000,-10000,-10000,-10000,-10000,-10000,{"$f":"EX35","v":-10000},{"$f":"EY35","v":-10000},{"$f":"EZ35","v":-10000},{"$f":"FA35","v":-10000},{"$f":"FB35","v":-10000},{"$f":"FC35","v":-10000},{"$f":"FD35","v":-10000},{"$f":"FE35","v":-10000},{"$f":"FF35","v":-10000},{"$f":"FG35","v":-10000},{"$f":"FH35","v":-10000},{"$f":"FI35","v":-10000},{"$f":"FJ35","v":-10000},{"$f":"FK35","v":-10000},{"$f":"FL35","v":-10000},{"$f":"FM35","v":-10000},{"$f":"FN35","v":-10000},{"$f":"FO35","v":-10000},-10000]
["2001-02-27","terça-feira","Carnaval",null,null,{"$f":"H36-$H$35","v":134},1,{"$f":"J31","v":"2026-10-07"},{"$f":"IF($G36>$I$10,0,$I$9)","v":270},{"$f":"I36/($J$32^(M36-$M$35))","v":263.73986390338524},{"$f":"I36/($I$32^(M36-$M$35))","v":263.73986390338524},{"$f":"J36*0.0082%*MIN(F36,365)","v":2.8979736245703971},{"$f":"M31","v":"2026-07-07"},null,null,null,null,null,1,{"$f":"IF($G36>$P$3,0,$J$9)","v":270},{"$f":"$T36/((U$29)^($H36-$H$35))","v":249.74739882540274},{"$f":"$T36/((V$29)^($H36-$H$35))","v":249.74739882540274},249.98834166218865,{"$f":"$T36/((X$29)^($H36-$H$35))","v":250.4278252722282},250.97851033191017,251.53067817216245,{"$error":"#N/A"},{"$error":"#N/A"},{"$error":"#N/A"},{"$error":"#N/A"},{"$error":"#N/A"},{"$error":"#N/A"},null,{"$f":"IF($I36<>0,0,U36*$B$1*MIN($F36,365))","v":0},{"$f":"IF($I36<>0,0,V36*$B$1*MIN($F36,365))","v":0},{"$f":"IF($I36<>0,0,W36*$B$1*MIN($F36,365))","v":0},{"$f":"IF($I36<>0,0,X36*$B$1*MIN($F36,365))","v":0},{"$f":"IF($I36<>0,0,Y36*$B$1*MIN($F36,365))","v":0},{"$f":"IF($I36<>0,0,Z36*$B$1*MIN($F36,365))","v":0},{"$f":"IF($I36<>0,0,AA36*$B$1*MIN($F36,365))","v":0},{"$f":"IF($I36<>0,0,AB36*$B$1*MIN($F36,365))","v":0},{"$f":"IF($I36<>0,0,AC36*$B$1*MIN($F36,365))","v":0},{"$f":"IF($I36<>0,0,AD36*$B$1*MIN($F36,365))","v":0},{"$f":"IF($I36<>0,0,AE36*$B$1*MIN($F36,365))","v":0},{"$f":"IF($I36<>0,0,AF36*$B$1*MIN($F36,365))","v":0},null,{"$f":"$T36","v":270},270,270,270,270,270,270,270,270,270,270,270,null,{"$f":"BJ36-$H$35","v":42},1,{"$f":"BL31","v":"2026-07-07"},{"$f":"I36","v":270},{"$f":"BK36","v":270},{"$f":"I37","v":270},{"$f":"BM37","v":270},{"$f":"M36","v":"2026-07-07"},{"$f":"BJ36","v":"2026-07-07"},null,{"$f":"IF(G36>$I$10-3,0,PMT($BR$31,$I$10,$BR$35))","v":281.01416656302337},{"$f":"MIN(BR36,$I$9)","v":270},{"$f":"IF(F36>$BU$31,0,$BU$32)","v":0},{"$f":"IF(G36>$BU$31,0,$BU$32)","v":270},null,null,null,{"$f":"IF($G36>BY$33,0,$I$9)","v":270},{"$f":"IF($G36>BZ$33,0,$I$9)","v":270},270,270,270,270,270,270,270,270,270,270,270,270,270,270,270,{"$f":"IF($G36>CP$33,0,$I$9)","v":270},270,270,270,270,270,270,270,270,270,270,270,270,270,270,270,{"$f":"IF($G36>DF$33,0,$I$9)","v":270},270,270,270,270,270,270,270,270,270,270,270,270,270,270,270,270,270,270,270,270,270,270,270,270,270,270,270,270,270,270,270,270,270,270,270,270,270,270,270,270,270,270,270,270,{"$f":"IF($G36>EY$33,0,$I$9)","v":270},270,270,270,270,270,270,270,270,270,270,270,270,270,270,270,270,270,{"$f":"IF($G36>FQ$33,0,$I$9)","v":270}]
["2001-04-13","sexta-feira","Paixão de Cristo",null,null,{"$f":"H37-$H$35","v":165},{"$f":"G36+1","v":2},{"$f":"EDATE(H36,1)","v":"2026-11-07"},{"$f":"IF($G37>$I$10,0,$I$9)","v":270},{"$f":"I37/($J$32^(M37-$M$35))","v":259.21257926760569},{"$f":"I37/($I$32^(M37-$M$35))","v":259.21257926760569},{"$f":"J37*0.0082%*MIN(F37,365)","v":3.5071461974907052},{"$f":"EDATE(M36,1)","v":"2026-08-07"},null,null,null,null,null,{"$f":"S36+1","v":2},270,245.28277137589933,245.28277137589933,245.57418354655687,{"$f":"$T37/((X$29)^($H37-$H$35))","v":246.10589136766495},246.7724406398622,247.44112446558725,{"$error":"#N/A"},{"$error":"#N/A"},{"$error":"#N/A"},{"$error":"#N/A"},{"$f":"$T37/((AE$29)^($H37-$H$35))","v":{"$error":"#N/A"}},{"$error":"#N/A"},null,{"$f":"IF($I37<>0,0,U37*$B$1*MIN($F37,365))","v":0},0,0,0,0,0,0,0,0,0,0,0,null,270,270,270,270,270,270,270,270,270,270,270,270,null,{"$f":"BJ37-$H$35","v":73},{"$f":"BI36+1","v":2},{"$f":"EDATE(BJ36,1)","v":"2026-08-07"},{"$f":"I36","v":270},{"$f":"BK36","v":270},{"$f":"I38","v":270},{"$f":"BM38","v":270},{"$f":"M37","v":"2026-08-07"},{"$f":"BJ37","v":"2026-08-07"},null,{"$f":"IF(I37=0,0,PMT($BR$31,$I$10,$BR$35))","v":281.01416656302337},{"$f":"MIN(BR37,$I$9)","v":270},{"$f":"IF(G37>$BT$31,0,$BT$32)","v":270},{"$f":"IF(G37>$BU$31,0,$BU$32)","v":270},null,null,null,270,270,270,270,270,270,270,270,270,270,270,270,270,270,270,270,270,270,270,270,270,270,270,270,270,270,270,270,270,270,270,270,270,270,270,270,270,270,270,270,270,270,270,270,270,270,270,270,270,270,270,270,270,270,270,270,270,270,270,270,270,270,270,270,270,270,270,270,270,270,270,270,270,270,270,270,270,270,270,270,270,270,270,270,270,270,270,270,270,270,270,270,270,270,270,270,270]
["2001-04-21","sábado","Tiradentes",null,null,195,{"$f":"G37+1","v":3},{"$f":"EDATE(H37,1)","v":"2026-12-07"},{"$f":"IF($G38>$I$10,0,$I$9)","v":270},254.76300873188674,254.76300873188674,4.0736605096228686,{"$f":"EDATE(M37,1)","v":"2026-09-07"},null,null,null,null,null,3,270,241.03817072078846,241.03817072078846,241.37664371239754,241.99440640288086,242.76917691257378,243.54681095836341,{"$error":"#N/A"},{"$error":"#N/A"},{"$error":"#N/A"},{"$error":"#N/A"},{"$error":"#N/A"},{"$error":"#N/A"},null,0,0,0,0,0,0,0,0,0,0,0,0,null,270,270,270,270,270,270,270,270,270,270,270,270,null,104,{"$f":"BI37+1","v":3},{"$f":"EDATE(BJ37,1)","v":"2026-09-07"},{"$f":"I37","v":270},{"$f":"BK37","v":270},270,270,"2026-09-07","2026-09-07",null,281.01416656302337,270,{"$f":"IF(G38>$BT$31,0,$BT$32)","v":270},270,null,null,null,270,270,270,270,270,270,270,270,270,270,270,270,270,270,270,270,270,270,270,270,270,270,270,270,270,270,270,270,270,270,270,270,270,270,270,270,270,270,270,270,270,270,270,270,270,270,270,270,270,270,270,270,270,270,270,270,270,270,270,270,270,270,270,270,270,270,270,270,270,270,270,270,270,270,270,270,270,270,270,270,270,270,270,270,270,270,270,270,270,270,270,270,270,270,270,270,270]
["2001-05-01","terça-feira","Dia do Trabalho",null,null,226,4,"2027-01-07",270,250.52971022376803,250.52971022376803,4.642816589866869,"2026-10-07",null,null,null,null,null,4,270,236.72923441779045,236.72923441779045,237.11454627344244,237.8180181416709,238.7006848499465,239.58706429558208,{"$error":"#N/A"},{"$error":"#N/A"},{"$error":"#N/A"},{"$error":"#N/A"},{"$error":"#N/A"},{"$error":"#N/A"},null,0,0,0,0,0,0,0,0,0,0,0,0,null,270,270,270,270,270,270,270,270,270,270,270,270,null,134,4,"2026-10-07",270,270,270,270,"2026-10-07","2026-10-07",null,281.01416656302337,270,270,270,null,null,null,270,270,270,270,270,270,270,270,270,270,270,270,270,270,270,270,270,270,270,270,270,270,270,270,270,270,270,270,270,270,270,270,270,270,270,270,270,270,270,270,270,270,270,270,270,270,270,270,270,270,270,270,270,270,270,270,270,270,270,270,270,270,270,270,270,270,270,270,270,270,270,270,270,270,270,270,270,270,270,270,270,270,270,270,270,270,270,270,270,270,270,270,270,270,270,270,270]
["2001-06-14","quinta-feira","Corpus Christi",null,null,257,5,"2027-02-07",270,246.22918738616676,246.22918738616676,5.1890338949760784,"2026-11-07",null,null,null,null,null,5,270,232.49732712645377,232.49732712645377,232.92770663200977,233.71370683119568,234.70037536252974,235.6916978378699,{"$error":"#N/A"},{"$error":"#N/A"},{"$error":"#N/A"},{"$error":"#N/A"},{"$error":"#N/A"},{"$error":"#N/A"},null,0,0,0,0,0,0,0,0,0,0,0,0,null,270,270,270,270,270,270,270,270,270,270,270,270,null,165,5,"2026-11-07",270,270,270,270,"2026-11-07","2026-11-07",null,281.01416656302337,270,270,270,null,null,null,270,270,270,270,270,270,270,270,270,270,270,270,270,270,270,270,270,270,270,270,270,270,270,270,270,270,270,270,270,270,270,270,270,270,270,270,270,270,270,270,270,270,270,270,270,270,270,270,270,270,270,270,270,270,270,270,270,270,270,270,270,270,270,270,270,270,270,270,270,270,270,270,270,270,270,270,{"$f":"IF($G40>EW$33,0,$I$9)","v":270},270,270,270,270,270,270,270,270,270,270,270,270,270,270,270,270,270,270,270,270]
["2001-09-07","sexta-feira","Independência do Brasil",null,null,285,6,"2027-03-07",270,242.13769209096827,242.13769209096827,5.6587578641659286,"2026-12-07",null,null,null,null,null,6,270,228.74002143805473,228.74002143805473,229.20962488880218,230.06750349586903,231.1448461401778,232.22776747367982,{"$error":"#N/A"},{"$error":"#N/A"},{"$error":"#N/A"},{"$error":"#N/A"},{"$error":"#N/A"},{"$error":"#N/A"},null,0,0,0,0,0,0,0,0,0,0,0,0,null,270,270,270,270,270,270,270,270,270,270,270,270,null,195,6,"2026-12-07",270,270,270,270,"2026-12-07","2026-12-07",null,281.01416656302337,270,270,270,null,null,null,270,270,270,270,270,270,270,270,270,270,270,270,270,270,270,270,270,270,270,270,270,270,270,270,270,270,270,270,270,270,270,270,270,270,270,270,270,270,270,270,270,270,270,270,270,270,270,270,270,270,270,270,270,270,270,270,270,270,270,270,270,270,270,270,270,270,270,270,270,270,270,270,270,270,270,270,270,270,270,270,270,270,270,270,270,270,270,270,270,270,270,270,270,270,270,270,270]
["2001-10-12","sexta-feira","Nossa Sr.a Aparecida - Padroeira do Brasil",null,null,316,7,"2027-04-07",270,237.98122428620692,237.98122428620692,6.166569483704194,"2027-01-07",null,null,null,null,null,7,270,224.6509338907355,224.6509338907355,225.16236604802376,226.09695212995695,227.27116257046669,228.45205337731971,{"$error":"#N/A"},{"$error":"#N/A"},{"$error":"#N/A"},{"$error":"#N/A"},{"$error":"#N/A"},{"$error":"#N/A"},null,0,0,0,0,0,0,0,0,0,0,0,0,null,270,270,270,270,270,270,270,270,270,270,270,270,null,226,7,"2027-01-07",270,270,270,270,"2027-01-07","2027-01-07",null,{"$f":"IF(I42=0,0,PMT($BR$31,$I$10,$BR$35))","v":281.01416656302337},270,270,270,null,null,null,270,270,270,270,270,270,270,270,270,270,270,270,270,270,270,270,270,270,270,270,270,270,270,270,270,270,270,270,270,270,270,270,270,270,270,270,270,270,270,270,270,270,270,270,270,270,270,270,270,270,270,270,270,270,270,270,270,270,270,270,270,270,270,270,270,270,270,270,270,270,270,270,270,270,270,270,270,270,270,270,270,270,270,270,270,270,270,270,270,270,270,270,270,270,270,270,270]
["2001-11-02","sexta-feira","Finados",null,null,346,8,"2027-05-07",270,233.89610524364286,233.89610524364286,6.6361002979726349,"2027-02-07",null,null,null,null,null,8,270,220.76336569418024,220.76336569418024,221.31372044940792,222.31973975157848,223.58425815351512,224.85659640087005,{"$error":"#N/A"},{"$error":"#N/A"},{"$error":"#N/A"},{"$error":"#N/A"},{"$error":"#N/A"},{"$error":"#N/A"},null,0,0,0,0,0,0,0,0,0,0,0,0,null,270,270,270,270,270,270,270,270,270,270,270,270,null,257,8,"2027-02-07",270,270,270,270,"2027-02-07","2027-02-07",null,281.01416656302337,270,270,270,null,null,null,270,270,270,270,270,270,270,270,270,270,270,270,270,270,270,270,270,270,270,270,270,270,270,270,270,270,270,270,270,270,270,270,270,270,270,270,270,270,270,270,270,270,270,270,270,270,270,270,270,270,270,270,270,270,270,270,270,270,270,270,270,270,270,270,270,270,270,270,270,270,270,270,270,270,270,270,270,270,270,270,270,270,270,270,270,270,270,270,270,270,270,270,270,270,270,270,270]
["2001-11-15","quinta-feira","Proclamação da República",null,null,377,9,"2027-06-07",270,230.2666269172891,230.2666269172891,6.891880143634463,"2027-03-07",null,null,null,null,null,9,270,216.81687341054271,216.81687341054271,217.40588319297095,218.48290085461673,219.83728009314305,221.20072772536147,{"$error":"#N/A"},{"$error":"#N/A"},{"$error":"#N/A"},{"$error":"#N/A"},{"$error":"#N/A"},{"$error":"#N/A"},null,0,0,0,0,0,0,0,0,0,0,0,0,null,270,270,270,270,270,270,270,270,270,270,270,270,null,285,9,"2027-03-07",270,270,270,270,"2027-03-07","2027-03-07",null,281.01416656302337,270,270,270,null,null,null,270,270,270,270,270,270,270,270,270,270,270,270,270,270,270,270,270,270,270,270,270,270,270,270,270,270,270,270,270,270,270,270,270,270,270,270,270,270,270,270,270,270,270,270,270,270,270,270,270,270,270,270,270,270,270,270,270,270,270,270,270,270,270,270,270,270,270,270,270,270,270,270,270,270,270,270,270,270,270,270,270,270,270,270,270,270,270,270,270,270,270,270,270,270,270,270,270]
["2001-12-25","terça-feira","Natal",null,null,407,10,"2027-07-07",270,226.31393449246366,226.31393449246366,6.7735760593594367,"2027-04-07",null,null,null,null,null,10,270,213.06487306516539,213.06487306516539,213.68981727063391,214.83289005262347,216.2709717686775,217.71939460561794,{"$error":"#N/A"},{"$error":"#N/A"},{"$error":"#N/A"},{"$error":"#N/A"},{"$error":"#N/A"},{"$error":"#N/A"},null,0,0,0,0,0,0,0,0,0,0,0,0,null,270,270,270,270,270,270,270,270,270,270,270,270,null,316,10,"2027-04-07",270,270,270,270,"2027-04-07","2027-04-07",null,281.01416656302337,270,270,270,null,null,null,270,270,270,270,270,270,270,270,270,270,270,270,270,270,270,270,270,270,270,270,270,270,270,270,270,270,270,270,270,270,270,270,270,270,270,270,270,270,270,270,270,270,270,270,270,270,270,270,270,270,270,270,270,270,270,270,270,270,270,270,270,270,270,270,270,270,{"$f":"IF($G45>EM$33,0,$I$9)","v":270},270,270,270,270,270,270,270,270,270,270,270,270,270,270,270,270,270,270,270,270,270,270,270,270,270,270,270,270,270,270]
["2002-01-01","terça-feira","Confraternização Universal",null,null,438,11,"2027-08-07",270,222.55336326188254,222.55336326188254,6.6610221624281447,"2027-05-07",null,null,null,null,null,11,270,209.25600344215604,209.25600344215604,209.91659874827704,211.12526071740714,212.64655476810231,214.17956732223078,{"$error":"#N/A"},{"$error":"#N/A"},{"$error":"#N/A"},{"$error":"#N/A"},{"$error":"#N/A"},{"$error":"#N/A"},null,0,0,0,0,0,0,0,0,0,0,0,0,null,270,270,270,270,270,270,270,270,270,270,270,270,null,346,11,"2027-05-07",270,270,270,270,"2027-05-07","2027-05-07",null,281.01416656302337,270,270,270,null,null,null,270,270,270,270,270,270,270,270,270,270,270,270,270,270,270,270,270,270,270,270,270,270,270,270,270,270,270,270,270,270,270,270,270,270,270,270,270,270,270,270,270,270,270,270,270,270,270,270,270,270,270,270,270,270,270,270,270,270,270,270,270,270,270,270,270,270,270,270,270,270,270,270,270,270,270,270,270,270,270,270,270,270,270,270,270,270,270,270,270,270,270,270,270,270,270,270,270]
["2002-02-11","segunda-feira","Carnaval",null,null,469,12,"2027-09-07",270,218.73307456064288,218.73307456064288,6.5466809216000419,"2027-06-07",null,null,null,null,null,12,270,205.51522335261302,205.51522335261302,206.21000566553778,207.48161839686054,209.08287822884117,210.69729291427254,{"$error":"#N/A"},{"$error":"#N/A"},{"$error":"#N/A"},{"$error":"#N/A"},{"$error":"#N/A"},{"$error":"#N/A"},null,0,0,0,0,0,0,0,0,0,0,0,0,null,270,270,270,270,270,270,270,270,270,270,270,270,null,377,12,"2027-06-07",270,270,270,270,"2027-06-07","2027-06-07",null,281.01416656302337,270,270,270,null,null,null,270,270,270,270,270,270,270,270,270,270,270,270,270,270,270,270,270,270,270,270,270,270,270,270,270,270,270,270,270,270,270,270,270,270,270,270,270,270,270,270,270,270,270,270,270,270,270,270,270,270,270,270,270,270,270,270,270,270,270,270,270,270,270,270,270,270,270,270,270,270,270,270,270,270,270,270,270,270,270,270,270,270,270,270,270,270,270,270,270,270,270,270,270,270,270,270,270]
["2002-02-12","terça-feira","Carnaval",null,null,499,13,"2027-10-07",270,215.09847155127008,215.09847155127008,6.4378972535295134,"2027-07-07",null,null,null,null,null,13,270,201.95879724577935,201.95879724577935,202.68530815669229,204.01539680514199,205.69103309313533,207.38126646352114,{"$error":"#N/A"},{"$error":"#N/A"},{"$error":"#N/A"},{"$error":"#N/A"},{"$error":"#N/A"},{"$error":"#N/A"},null,0,0,0,0,0,0,0,0,0,0,0,0,null,270,270,270,270,270,270,270,270,270,270,270,270,null,407,13,"2027-07-07",270,270,270,270,"2027-07-07","2027-07-07",null,281.01416656302337,270,270,270,null,null,null,270,270,270,270,270,270,270,270,270,270,270,270,270,270,270,270,270,270,270,270,270,270,270,270,270,270,270,270,270,270,270,270,270,270,270,270,270,270,270,270,270,270,270,270,270,270,270,270,270,270,270,270,270,270,270,270,270,270,270,270,270,270,270,270,270,270,270,270,270,270,270,270,270,270,270,270,270,270,270,270,270,270,270,270,270,270,270,270,270,270,270,270,270,270,270,270,0]
["2002-03-29","sexta-feira","Paixão de Cristo",null,null,530,14,"2027-11-07",270,211.40615143317643,211.40615143317643,6.3273861123949713,"2027-08-07",null,null,null,null,null,14,270,198.34846619090996,198.34846619090996,199.10640126859346,200.49445794961917,202.24392194774308,204.0095233699823,{"$error":"#N/A"},{"$error":"#N/A"},{"$error":"#N/A"},{"$error":"#N/A"},{"$error":"#N/A"},{"$error":"#N/A"},null,0,0,0,0,0,0,0,0,0,0,0,0,null,270,270,270,270,270,270,270,270,270,270,270,270,null,438,14,"2027-08-07",270,270,270,270,"2027-08-07","2027-08-07",null,281.01416656302337,270,270,270,null,null,null,270,270,270,270,270,270,270,270,270,270,270,270,270,270,270,270,270,270,270,270,270,270,270,270,270,270,270,270,270,270,270,270,270,270,270,270,270,270,270,270,270,270,270,270,270,270,270,270,270,270,270,270,270,270,270,270,270,270,270,270,270,270,270,270,270,270,270,270,270,270,270,270,270,270,270,270,270,270,270,270,270,270,270,270,270,270,270,270,270,270,270,270,270,270,270,0,0]
["2002-04-21","domingo","Tiradentes",null,null,560,15,"2027-12-07",270,207.77721264808895,207.77721264808895,6.2187719745573027,"2027-09-07",null,null,null,null,null,15,270,194.91606029949116,194.91606029949116,195.70312394322036,197.14496499436564,198.96302171958703,200.79875133611802,{"$error":"#N/A"},{"$error":"#N/A"},{"$error":"#N/A"},{"$error":"#N/A"},{"$error":"#N/A"},{"$error":"#N/A"},null,0,0,0,0,0,0,0,0,0,0,0,0,null,270,270,270,270,270,270,270,270,270,270,270,270,null,469,15,"2027-09-07",270,270,270,270,"2027-09-07","2027-09-07",null,281.01416656302337,270,270,270,null,null,null,270,270,270,270,270,270,270,270,270,270,270,270,270,270,270,270,270,270,270,270,270,270,270,270,270,270,270,270,270,270,270,270,270,270,270,270,270,270,270,270,270,270,270,270,270,270,270,270,270,270,270,270,270,270,270,270,{"$f":"IF($G50>EC$33,0,$I$9)","v":270},270,270,270,270,270,270,270,270,270,270,270,270,270,270,270,270,270,270,270,270,270,270,270,270,{"$f":"IF($G50>FB$33,0,$I$9)","v":270},270,270,270,270,270,270,270,270,270,270,270,270,0,0,0]
["2002-05-01","quarta-feira","Dia do Trabalho",null,null,591,16,"2028-01-07",270,204.32465896416741,204.32465896416741,6.1154370427975309,"2027-10-07",null,null,null,null,null,16,270,191.43162924133011,191.43162924133011,192.2475046648789,193.74259743638009,195.62866319468247,197.53403116850407,{"$error":"#N/A"},{"$error":"#N/A"},{"$error":"#N/A"},{"$error":"#N/A"},{"$error":"#N/A"},{"$error":"#N/A"},null,0,0,0,0,0,0,0,0,0,0,0,0,null,270,270,270,270,270,270,270,270,270,270,270,270,null,499,16,"2027-10-07",270,270,270,270,"2027-10-07","2027-10-07",null,281.01416656302337,270,270,270,null,null,null,270,270,270,270,270,270,270,270,270,270,270,270,270,270,270,270,{"$f":"IF($G51>CO$33,0,$I$9)","v":270},270,270,270,270,270,270,270,270,270,270,270,270,270,270,270,270,270,270,270,270,270,270,270,270,270,270,270,270,270,270,270,270,270,270,270,270,270,270,270,270,270,270,270,270,270,270,270,270,270,270,270,270,270,270,270,270,270,270,270,270,270,270,270,270,270,270,270,270,270,270,270,270,270,270,270,270,0,0,0,0]
["2002-05-30","quinta-feira","Corpus Christi",null,null,622,17,"2028-02-07",270,200.81727909542585,200.81727909542585,6.0104611633260951,"2027-11-07",null,null,null,null,null,17,270,{"$f":"$T52/((U$29)^($H52-$H$35))","v":188.00948786715117},188.00948786715117,188.85290283151352,190.3989486237603,192.3501841325872,194.3223910011485,{"$error":"#N/A"},{"$error":"#N/A"},{"$error":"#N/A"},{"$error":"#N/A"},{"$f":"$T52/((AE$29)^($H52-$H$35))","v":{"$error":"#N/A"}},{"$error":"#N/A"},null,0,0,0,0,0,0,0,0,0,0,0,0,null,{"$f":"$T52","v":270},270,270,270,270,270,270,270,270,270,270,270,null,530,17,"2027-11-07",270,270,270,270,"2027-11-07","2027-11-07",null,281.01416656302337,270,270,270,null,null,null,270,{"$f":"IF($G52>BZ$33,0,$I$9)","v":270},270,270,270,270,270,270,270,270,270,270,270,270,270,270,270,270,270,270,270,270,270,270,270,270,270,270,270,270,270,270,270,270,270,270,270,270,270,270,270,270,270,270,270,270,270,270,270,270,270,270,270,270,270,270,270,270,270,270,270,270,270,270,270,270,270,270,270,270,270,270,270,270,270,270,270,270,270,270,270,270,270,270,270,270,270,270,270,270,270,270,0,0,0,0,0]
["2002-09-07","sábado","Independência do Brasil",null,null,651,18,"2028-03-07",270,197.48037593891706,197.48037593891706,5.9105876518517881,"2027-12-07",null,null,null,null,null,18,270,184.86353440343245,184.86353440343245,185.73159240030122,187.32327963766127,189.33297813349242,191.36524243123245,{"$error":"#N/A"},{"$error":"#N/A"},{"$error":"#N/A"},{"$error":"#N/A"},{"$error":"#N/A"},{"$error":"#N/A"},null,0,0,0,0,0,0,0,0,0,0,0,0,null,270,270,270,270,270,270,270,270,270,270,270,270,null,560,18,"2027-12-07",270,270,270,270,"2027-12-07","2027-12-07",null,281.01416656302337,270,270,270,null,null,null,{"$f":"IF($G53>BY$33,0,$I$9)","v":270},270,270,270,270,270,270,270,270,270,270,270,270,270,270,270,270,270,270,270,270,270,270,270,270,270,270,270,270,270,270,270,270,270,270,270,270,270,270,270,270,270,270,270,270,270,270,270,270,270,270,270,270,270,270,270,270,270,270,270,270,270,270,270,270,270,270,270,270,270,270,270,270,270,270,270,270,270,270,270,270,270,270,270,270,270,270,270,270,270,270,0,0,0,0,0,0]
["2002-10-12","sábado","Nossa Sr.a Aparecida - Padroeira do Brasil",null,null,682,19,"2028-04-07",270,194.09048311564723,194.09048311564723,5.8091281596513218,"2028-01-07",null,null,null,null,null,19,270,181.55880805196091,181.55880805196091,182.45204500032335,184.09041670599657,186.16000647157875,188.2538985499161,{"$error":"#N/A"},{"$error":"#N/A"},{"$error":"#N/A"},{"$error":"#N/A"},{"$error":"#N/A"},{"$error":"#N/A"},null,0,0,0,0,0,0,0,0,0,0,0,0,null,270,270,270,270,270,270,270,270,270,270,270,270,null,591,19,"2028-01-07",270,270,270,270,"2028-01-07","2028-01-07",null,281.01416656302337,270,270,270,null,null,null,270,270,270,270,270,270,270,270,270,270,270,270,270,270,270,270,270,270,270,270,270,270,270,270,270,270,270,270,270,270,270,270,270,270,270,270,270,270,270,270,270,270,270,270,270,270,270,270,270,270,270,270,270,270,270,270,270,270,270,270,270,270,270,270,270,270,270,270,270,270,270,270,270,270,270,270,270,270,270,270,270,270,270,270,270,270,270,270,270,270,0,0,0,0,0,0,0]
["2002-11-02","sábado","Finados",null,null,712,20,"2028-05-07",270,190.75878024314403,190.75878024314403,5.7094102926773012,"2028-02-07",null,null,null,null,null,20,270,178.41694598282487,178.41694598282487,179.33343653891117,181.01497232617555,183.14002741943222,185.2910939575354,{"$error":"#N/A"},{"$error":"#N/A"},{"$error":"#N/A"},{"$error":"#N/A"},{"$error":"#N/A"},{"$error":"#N/A"},null,0,0,0,0,0,0,0,0,0,0,0,0,null,270,270,270,270,270,270,270,270,270,270,270,270,null,622,20,"2028-02-07",270,270,270,270,"2028-02-07","2028-02-07",null,281.01416656302337,270,270,270,null,null,null,270,270,270,270,270,270,270,270,270,270,270,270,270,270,270,270,270,270,270,270,270,270,270,270,270,270,270,270,270,270,270,270,270,270,270,270,270,270,270,270,270,270,270,270,270,270,270,270,270,270,270,270,270,{"$f":"IF($G55>DZ$33,0,$I$9)","v":270},270,270,270,270,270,270,270,270,270,270,270,270,270,270,270,270,270,270,270,270,270,270,270,270,270,270,270,270,270,270,270,270,270,270,270,0,0,0,0,0,0,0,0]
["2002-11-15","sexta-feira","Proclamação da República",null,null,743,21,"2028-06-07",270,187.69382062617004,187.69382062617004,5.6176760513412693,"2028-03-07",null,null,null,null,null,21,270,175.22746253579865,175.22746253579865,176.16686429382585,177.8909794340932,180.07084146518051,182.27850763766418,{"$error":"#N/A"},{"$error":"#N/A"},{"$error":"#N/A"},{"$error":"#N/A"},{"$error":"#N/A"},{"$error":"#N/A"},null,0,0,0,0,0,0,0,0,0,0,0,0,null,270,270,270,270,270,270,270,270,270,270,270,270,null,651,21,"2028-03-07",270,270,270,270,"2028-03-07","2028-03-07",null,281.01416656302337,270,270,270,null,null,null,270,270,270,270,270,270,270,270,270,270,270,270,270,270,270,270,270,270,270,270,270,270,270,270,270,270,270,270,270,270,270,270,270,270,270,270,270,270,270,270,270,270,270,270,270,270,270,270,270,270,270,270,270,270,270,270,270,270,270,270,270,270,270,270,270,270,270,270,270,270,270,270,270,270,270,270,270,270,270,270,270,270,270,270,270,270,270,270,0,0,0,0,0,0,0,0,0]
["2002-12-25","quarta-feira","Natal",null,null,773,22,"2028-07-07",270,184.47192107039066,184.47192107039066,5.5212445976367928,"2028-04-07",null,null,null,null,null,22,270,172.19516394384814,172.19516394384814,173.15568689865773,174.91910385952059,177.14964383828709,179.40974580228581,{"$error":"#N/A"},{"$error":"#N/A"},{"$error":"#N/A"},{"$error":"#N/A"},{"$error":"#N/A"},{"$error":"#N/A"},null,0,0,0,0,0,0,0,0,0,0,0,0,null,270,270,270,270,270,270,270,270,270,270,270,270,null,682,22,"2028-04-07",270,270,270,270,"2028-04-07","2028-04-07",null,281.01416656302337,270,270,270,null,null,null,270,270,270,270,270,270,270,270,270,270,270,270,270,270,270,270,270,270,270,270,270,270,270,270,270,270,270,270,270,270,270,270,270,270,270,270,270,270,270,270,270,270,270,270,270,270,270,270,270,270,270,270,270,270,270,270,270,270,270,270,270,270,270,270,270,270,270,270,270,270,270,270,270,270,270,270,270,270,270,270,270,270,270,270,270,270,270,0,0,0,0,0,0,0,0,0,0]
["2003-01-01","quarta-feira","Confraternização Universal",null,null,804,23,"2028-08-07",270,181.40662241441936,181.40662241441936,5.4295002088635718,"2028-05-07",null,null,null,null,null,23,270,169.11690463371653,169.11690463371653,170.09819799533776,171.90031469460058,174.1808488330098,176.49278236755421,{"$error":"#N/A"},{"$error":"#N/A"},{"$error":"#N/A"},{"$error":"#N/A"},{"$error":"#N/A"},{"$error":"#N/A"},null,0,0,0,0,0,0,0,0,0,0,0,0,null,270,270,270,270,270,270,270,270,270,270,270,270,null,712,23,"2028-05-07",270,270,270,270,"2028-05-07","2028-05-07",null,281.01416656302337,270,270,270,null,null,null,270,270,270,270,270,270,270,270,270,270,270,270,270,270,270,270,270,270,270,270,270,270,270,270,270,270,270,270,270,270,270,270,270,270,270,270,270,270,270,270,270,270,270,270,270,270,270,270,270,270,270,270,270,270,270,270,270,270,270,270,270,270,270,270,270,270,270,270,270,270,270,270,270,270,270,270,270,270,270,270,270,270,270,270,270,270,0,0,0,0,0,0,0,0,0,0,0]
["2003-03-03","segunda-feira","Carnaval",null,null,835,24,"2028-09-07",270,178.29264714223098,178.29264714223098,5.3362989289669729,"2028-06-07",null,null,null,null,null,24,270,166.09367404891839,166.09367404891839,167.09469656745881,168.93362440179436,171.26180692682084,173.62324487192933,{"$error":"#N/A"},{"$error":"#N/A"},{"$error":"#N/A"},{"$error":"#N/A"},{"$error":"#N/A"},{"$error":"#N/A"},null,0,0,0,0,0,0,0,0,0,0,0,0,null,270,270,270,270,270,270,270,270,270,270,270,270,null,743,24,"2028-06-07",270,270,270,270,"2028-06-07","2028-06-07",null,281.01416656302337,270,270,270,null,null,null,270,270,270,270,270,270,270,270,270,270,270,270,270,270,270,270,270,270,270,270,270,270,270,270,270,270,270,270,270,270,270,270,270,270,270,270,270,270,270,270,270,270,270,270,270,270,270,270,270,270,270,270,270,270,270,270,270,270,270,270,270,270,270,270,270,270,270,270,270,270,270,270,270,270,270,270,270,270,270,270,270,270,270,270,270,0,0,0,0,0,0,0,0,0,0,0,0]
["2003-03-04","terça-feira","Carnaval",null,null,865,25,"2028-10-07",270,175.33002709423943,175.33002709423943,5.247627710930586,"2028-07-07",null,null,null,null,null,25,270,163.21943500749225,163.21943500749225,164.23858753030635,166.11139185419225,168.48351378451414,170.89070253834143,{"$error":"#N/A"},{"$error":"#N/A"},{"$error":"#N/A"},{"$error":"#N/A"},{"$error":"#N/A"},{"$error":"#N/A"},null,0,0,0,0,0,0,0,0,0,0,0,0,null,270,270,270,270,270,270,270,270,270,270,270,270,null,773,25,"2028-07-07",270,270,270,270,"2028-07-07","2028-07-07",null,281.01416656302337,270,270,270,null,null,null,270,270,270,270,270,270,270,270,270,270,270,270,270,270,270,270,270,270,270,270,270,270,270,270,270,270,270,270,270,270,270,270,270,270,270,270,270,270,270,270,270,270,270,{"$f":"IF($G60>DP$33,0,$I$9)","v":270},270,270,270,270,270,270,270,270,270,270,270,270,270,270,270,270,270,270,270,270,270,270,270,270,270,270,270,270,270,270,270,270,270,270,270,270,270,270,270,270,0,0,0,0,0,0,0,0,0,0,0,0,0]
["2003-04-18","sexta-feira","Paixão de Cristo",null,null,896,26,"2028-11-07",270,172.32036095539075,172.32036095539075,5.1575484033948449,"2028-08-07",null,null,null,null,null,26,270,160.30163096527153,160.30163096527153,161.33855191573963,163.2446079590384,165.65995171937314,168.11224739695086,{"$error":"#N/A"},{"$error":"#N/A"},{"$error":"#N/A"},{"$error":"#N/A"},{"$error":"#N/A"},{"$error":"#N/A"},null,0,0,0,0,0,0,0,0,0,0,0,0,null,270,270,270,270,270,270,270,270,270,270,270,270,null,804,26,"2028-08-07",270,270,270,270,"2028-08-07","2028-08-07",null,281.01416656302337,270,270,270,null,null,null,270,270,270,270,270,270,270,270,270,270,270,270,270,270,270,270,270,270,270,270,270,270,270,270,270,270,270,270,270,270,270,270,270,270,270,270,270,270,270,270,270,270,270,270,270,270,270,270,270,270,270,270,270,270,270,270,270,270,270,270,270,270,270,270,270,270,270,270,270,270,270,270,270,270,270,270,270,270,270,270,270,270,270,0,0,0,0,0,0,0,0,0,0,0,0,0,0]
["2003-04-21","segunda-feira","Tiradentes",null,null,926,27,"2028-12-07",270,169.36235790253747,169.36235790253747,5.0690153720229469,"2028-09-07",null,null,null,null,null,27,270,157.52762281136097,157.52762281136097,158.58083126012562,160.51741704347049,162.97253462343264,165.4664390367534,{"$error":"#N/A"},{"$f":"$T62/((AB$29)^($H62-$H$35))","v":{"$error":"#N/A"}},{"$error":"#N/A"},{"$error":"#N/A"},{"$error":"#N/A"},{"$error":"#N/A"},null,0,0,0,0,0,0,0,0,0,0,0,0,null,270,270,270,270,270,270,270,270,270,270,270,270,null,835,27,"2028-09-07",270,270,270,270,"2028-09-07","2028-09-07",null,281.01416656302337,270,270,270,null,null,null,270,270,270,270,270,270,270,270,270,270,270,270,270,270,270,270,270,270,270,270,270,270,270,270,270,270,270,270,270,270,270,270,270,270,270,270,270,270,270,270,270,270,270,270,270,270,270,270,270,270,270,270,270,270,270,270,270,270,270,270,270,270,270,270,270,270,270,270,270,270,270,270,270,270,270,270,270,270,270,270,270,270,0,0,0,0,0,0,0,0,0,0,0,0,0,0,0]
["2003-05-01","quinta-feira","Dia do Trabalho",null,null,957,28,"2029-01-07",270,166.54812902131553,166.54812902131553,4.9847855016079743,"2028-10-07",null,null,null,null,null,28,270,154.71156886178488,154.71156886178488,155.78069722732965,157.7471750935635,160.24132931980188,162.77617519301904,{"$error":"#N/A"},{"$error":"#N/A"},{"$error":"#N/A"},{"$error":"#N/A"},{"$error":"#N/A"},{"$error":"#N/A"},null,0,0,0,0,0,0,0,0,0,0,0,0,null,270,270,270,270,270,270,270,270,270,270,270,270,null,865,28,"2028-10-07",270,270,270,270,"2028-10-07","2028-10-07",null,281.01416656302337,270,270,270,null,null,null,270,270,270,270,270,270,270,270,270,270,270,270,270,270,270,270,270,270,270,270,270,270,270,270,270,270,270,270,270,270,270,270,270,270,270,270,270,270,270,270,270,270,270,270,270,270,270,270,270,270,270,270,270,270,270,270,270,270,270,270,270,270,270,270,270,270,270,270,270,270,270,270,270,270,270,270,270,270,270,270,270,0,0,0,0,0,0,0,0,0,0,0,0,0,0,0,0]
["2003-06-19","quinta-feira","Corpus Christi",null,null,988,29,"2029-02-07",270,163.68921048516185,163.68921048516185,4.8992180698208943,"2028-11-07",null,null,null,null,null,29,270,151.94585630443831,151.94585630443831,153.03000643770071,155.02474253781682,157.55589542438915,160.12965145507923,{"$error":"#N/A"},{"$error":"#N/A"},{"$error":"#N/A"},{"$error":"#N/A"},{"$error":"#N/A"},{"$error":"#N/A"},null,0,0,0,0,0,0,0,0,0,0,0,0,null,270,270,270,270,270,270,270,270,270,270,270,270,null,896,29,"2028-11-07",270,270,270,270,"2028-11-07","2028-11-07",null,281.01416656302337,270,270,270,null,null,null,270,270,270,270,270,270,270,270,270,270,270,270,270,270,270,270,270,270,270,270,270,270,270,270,270,270,270,270,270,270,270,270,270,270,270,270,270,270,270,270,270,270,270,270,270,270,270,270,270,270,270,270,270,270,270,270,270,270,270,270,270,270,270,270,270,270,270,270,270,270,270,270,270,270,270,270,270,270,270,270,0,0,0,0,{"$f":"IF($G64>FE$33,0,$I$9)","v":0},0,0,0,0,0,0,0,0,0,0,0,0]
["2003-09-07","domingo","Independência do Brasil",null,null,1016,30,"2029-03-07",270,160.96925010319279,160.96925010319279,4.8178096555885608,"2028-12-07",null,null,null,null,null,30,270,149.49031396647925,149.49031396647925,150.58728254999315,152.60617778625175,155.16904542694061,157.77624670229923,{"$error":"#N/A"},{"$error":"#N/A"},{"$error":"#N/A"},{"$error":"#N/A"},{"$error":"#N/A"},{"$error":"#N/A"},null,0,0,0,0,0,0,0,0,0,0,0,0,null,270,270,270,270,270,270,270,270,270,270,270,270,null,926,30,"2028-12-07",270,270,270,270,"2028-12-07","2028-12-07",null,281.01416656302337,270,270,270,null,null,null,270,270,270,270,270,270,270,270,270,270,270,270,270,270,270,270,270,270,270,270,270,270,270,270,270,270,270,270,270,270,270,270,270,{"$f":"IF($G65>DF$33,0,$I$9)","v":270},270,270,270,270,270,270,270,270,270,270,270,270,270,270,270,270,270,270,270,270,270,270,270,270,270,270,270,270,270,270,270,270,270,270,270,270,270,270,270,270,270,270,270,270,{"$f":"IF($G65>EY$33,0,$I$9)","v":270},0,0,0,0,0,0,0,0,0,0,0,0,0,0,0,0,0,0]
["2003-10-12","domingo","Nossa Sr.a Aparecida - Padroeira do Brasil",null,null,1047,31,"2029-04-07",270,158.20609704002101,158.20609704002101,4.7351084844078288,"2029-01-07",null,null,null,null,null,31,270,146.81793955013464,146.81793955013464,147.9282942509418,149.97246959866021,152.56861633740954,155.21101514009095,{"$error":"#N/A"},{"$error":"#N/A"},{"$error":"#N/A"},{"$error":"#N/A"},{"$error":"#N/A"},{"$error":"#N/A"},null,0,0,0,0,0,0,0,0,0,0,0,0,null,270,270,270,270,270,270,270,270,270,270,270,270,null,957,31,"2029-01-07",270,270,270,270,"2029-01-07","2029-01-07",null,281.01416656302337,270,270,270,null,null,null,270,270,270,270,270,270,270,270,270,270,270,270,270,270,270,270,270,270,270,270,270,270,270,270,270,270,270,270,270,270,270,270,270,270,270,270,270,270,270,270,270,270,270,270,270,270,270,270,270,270,270,270,270,270,270,270,270,270,270,270,270,270,270,270,270,270,270,270,270,270,270,270,270,270,270,270,270,270,0,0,0,0,0,0,0,0,0,0,0,0,0,0,0,0,0,0,0]
["2003-11-02","domingo","Finados",null,null,1077,32,"2029-05-07",270,155.49037548843069,155.49037548843069,4.6538269383687298,"2029-02-07",null,null,null,null,null,32,270,144.27726570296301,144.27726570296301,145.39979187031662,147.46700518064165,150.09357331347033,152.76825080964488,{"$error":"#N/A"},{"$error":"#N/A"},{"$error":"#N/A"},{"$error":"#N/A"},{"$error":"#N/A"},{"$error":"#N/A"},null,0,0,0,0,0,0,0,0,0,0,0,0,null,270,270,270,270,270,270,270,270,270,270,270,270,null,988,32,"2029-02-07",270,270,270,270,"2029-02-07","2029-02-07",null,281.01416656302337,270,270,270,null,null,null,270,270,270,270,270,270,270,270,270,270,270,270,270,270,270,270,{"$f":"IF($G67>CO$33,0,$I$9)","v":270},270,270,270,270,270,270,270,270,270,270,270,270,270,270,270,270,270,270,270,270,270,270,270,270,270,270,270,270,270,270,270,270,270,270,270,270,270,270,270,270,270,270,270,270,270,270,270,270,270,270,270,270,270,270,270,270,270,270,270,270,0,0,0,0,0,0,0,0,0,0,0,0,0,0,0,0,0,0,0,0]
["2003-11-15","sábado","Proclamação da República",null,null,1108,33,"2029-06-07",270,153.07755656951804,153.07755656951804,4.5816112681256751,"2029-03-07",null,null,null,null,null,33,270,{"$f":"$T68/((U$29)^($H68-$H$35))","v":141.69808272117322},141.69808272117322,142.8324014591156,144.92198987013532,147.57820246020449,150.28444258837513,{"$error":"#N/A"},{"$error":"#N/A"},{"$error":"#N/A"},{"$error":"#N/A"},{"$error":"#N/A"},{"$error":"#N/A"},null,0,0,0,0,0,0,0,0,0,0,0,0,null,{"$f":"$T68","v":270},270,270,270,270,270,270,270,270,270,270,270,null,1016,33,"2029-03-07",270,270,270,270,"2029-03-07","2029-03-07",null,281.01416656302337,270,270,270,null,null,null,270,270,270,270,270,270,270,270,270,270,270,270,270,270,270,{"$f":"IF($G68>CN$33,0,$I$9)","v":270},270,270,270,270,270,270,270,270,270,270,270,270,270,270,270,270,270,270,270,270,270,270,270,270,270,270,270,270,270,270,270,270,270,270,270,270,270,270,270,270,270,270,270,270,270,270,270,270,270,270,270,270,270,270,270,270,270,270,270,270,0,0,0,0,0,0,0,0,0,0,0,0,0,0,0,0,0,0,0,0,0]
["2003-12-25","quinta-feira","Natal",null,null,1138,34,"2029-07-07",270,150.44987010724799,150.44987010724799,4.5029646123099321,"2029-04-07",null,null,null,null,null,34,270,139.24600762689556,139.24600762689556,140.39100193545761,142.5008995861669,145.18411638108043,147.91921435090435,{"$error":"#N/A"},{"$error":"#N/A"},{"$error":"#N/A"},{"$error":"#N/A"},{"$error":"#N/A"},{"$error":"#N/A"},null,0,0,0,0,0,0,0,0,0,0,0,0,null,270,270,270,270,270,270,270,270,270,270,270,270,null,1047,34,"2029-04-07",270,270,270,270,"2029-04-07","2029-04-07",null,281.01416656302337,270,270,{"$f":"IF(G69>$BU$31,0,$BU$32)","v":270},null,null,null,{"$f":"IF($G69>BY$33,0,$I$9)","v":270},270,270,270,270,270,270,270,270,270,270,270,270,270,270,270,270,270,270,270,270,270,270,270,270,270,270,270,270,270,270,270,270,270,270,270,270,270,270,270,270,270,270,270,270,270,270,270,270,270,270,270,270,270,270,270,270,270,270,270,270,270,270,270,270,270,270,270,270,270,270,270,270,270,270,0,0,0,0,0,0,0,0,0,0,0,0,0,0,0,0,0,0,0,0,0,0]
["2004-01-01","quinta-feira","Confraternização Universal",null,null,1169,35,"2029-08-07",270,147.94990273034387,147.94990273034387,4.4281405887191916,"2029-05-07",null,null,null,null,null,35,270,136.75676629421841,136.75676629421841,137.91205401158805,140.04159032737056,142.75102156802387,145.51424500196322,{"$error":"#N/A"},{"$error":"#N/A"},{"$error":"#N/A"},{"$error":"#N/A"},{"$error":"#N/A"},{"$error":"#N/A"},null,0,0,0,0,0,0,0,0,0,0,0,0,null,270,270,270,270,270,270,270,270,270,270,270,270,null,1077,35,"2029-05-07",270,270,270,270,"2029-05-07","2029-05-07",null,281.01416656302337,270,270,270,null,null,null,270,270,270,270,270,270,270,270,270,270,270,270,270,270,270,270,270,270,270,270,270,270,270,270,270,270,270,270,270,270,{"$f":"IF($G70>DC$33,0,$I$9)","v":270},270,270,270,270,270,270,270,270,270,270,270,270,270,270,270,270,270,270,270,270,270,270,270,270,270,270,270,270,270,270,270,270,270,270,270,270,270,270,270,270,270,270,270,0,0,0,0,0,0,0,0,0,0,0,0,0,0,0,0,0,0,0,0,0,0,0]
["2004-02-23","segunda-feira","Carnaval",null,null,1200,36,"2029-09-07",270,145.41023613772919,145.41023613772919,4.3521283676022344,"2029-06-07",null,null,null,null,null,36,270,134.31202406437308,134.31202406437308,135.47687800133502,137.62472432365519,140.35870222350263,143.14837725043611,{"$error":"#N/A"},{"$error":"#N/A"},{"$error":"#N/A"},{"$error":"#N/A"},{"$error":"#N/A"},{"$error":"#N/A"},null,0,0,0,0,0,0,0,0,0,0,0,0,null,270,270,270,270,270,270,270,270,270,270,270,270,null,1108,36,"2029-06-07",270,270,270,270,"2029-06-07","2029-06-07",null,281.01416656302337,270,270,270,null,null,null,270,270,270,270,270,270,270,270,270,270,270,270,270,270,270,270,270,270,270,270,270,270,270,270,270,270,270,270,270,270,270,270,270,270,270,270,270,270,270,270,270,270,270,270,270,270,270,270,270,270,270,270,270,270,270,270,270,270,270,270,270,270,270,270,270,270,270,270,270,270,270,270,270,0,0,0,0,0,0,0,0,0,0,0,0,0,0,0,0,0,0,0,0,0,0,0,0]
["2004-02-24","terça-feira","Carnaval",null,null,1230,37,"2029-10-07",270,142.99401041182384,142.99401041182384,4.2798107316258873,"2029-07-07",null,null,null,null,null,37,270,131.9877641820546,131.9877641820546,133.16120465242886,135.32554334227049,138.08173442286943,140.89545886321355,{"$error":"#N/A"},{"$error":"#N/A"},{"$error":"#N/A"},{"$error":"#N/A"},{"$error":"#N/A"},{"$error":"#N/A"},null,0,0,0,0,0,0,0,0,0,0,0,0,null,270,270,270,270,270,270,270,270,270,270,270,270,null,1138,37,"2029-07-07",270,270,270,270,"2029-07-07","2029-07-07",null,281.01416656302337,270,270,270,null,null,null,270,270,270,270,270,270,270,270,270,270,270,270,270,270,270,270,270,270,270,270,270,270,270,270,270,270,270,270,270,270,270,270,270,270,270,270,270,270,270,270,270,270,270,270,270,270,270,270,270,270,270,270,270,270,270,270,270,270,270,270,270,270,270,270,270,270,270,270,270,270,270,270,0,0,0,0,0,0,0,0,0,0,0,0,0,0,0,0,0,0,0,0,0,0,0,0,0]
["2004-04-09","sexta-feira","Paixão de Cristo",null,null,1261,38,"2029-11-07",270,140.53941527870774,140.53941527870774,4.2063446992917228,"2029-08-07",null,null,null,null,null,38,270,129.62827536360351,129.62827536360351,130.80991655516985,132.99006782836301,135.76766618884656,138.60468642058021,{"$error":"#N/A"},{"$error":"#N/A"},{"$error":"#N/A"},{"$error":"#N/A"},{"$error":"#N/A"},{"$error":"#N/A"},null,0,0,0,0,0,0,0,0,0,0,0,0,null,270,270,270,270,270,270,270,270,270,270,270,270,null,1169,38,"2029-08-07",270,270,270,270,"2029-08-07","2029-08-07",null,281.01416656302337,270,270,270,null,null,null,270,270,270,270,270,270,270,270,270,270,270,270,270,270,270,270,270,270,270,270,270,270,270,270,270,270,270,270,270,270,270,270,270,270,270,270,270,270,270,270,270,270,270,270,270,270,270,270,270,270,270,270,270,270,270,270,270,270,270,270,270,270,270,270,270,270,270,270,270,270,270,0,0,0,0,0,0,0,0,0,0,0,0,0,0,0,0,0,0,0,0,0,0,0,0,0,0]
["2004-04-21","quarta-feira","Tiradentes",null,null,1291,39,"2029-12-07",270,138.12695503816627,138.12695503816627,4.1341397642923159,"2029-09-07",null,null,null,null,null,39,270,127.38506741449719,127.38506741449719,128.57401444398849,130.76831417060487,133.56517642952375,136.42327820212842,{"$error":"#N/A"},{"$error":"#N/A"},{"$error":"#N/A"},{"$error":"#N/A"},{"$error":"#N/A"},{"$error":"#N/A"},null,0,0,0,0,0,0,0,0,0,0,0,0,null,270,270,270,270,270,270,270,270,270,270,270,270,null,1200,39,"2029-09-07",270,270,270,270,"2029-09-07","2029-09-07",null,281.01416656302337,270,270,270,null,null,null,270,270,270,270,270,270,270,270,270,270,270,270,270,270,270,270,270,270,270,270,270,270,270,270,270,270,270,270,270,270,270,270,270,270,270,270,270,270,270,270,270,270,270,270,270,270,270,270,270,270,270,270,270,270,270,270,270,270,270,270,270,270,270,270,270,270,270,270,270,270,0,0,0,{"$f":"IF($G74>ET$33,0,$I$9)","v":0},0,0,0,0,0,0,0,0,0,0,0,0,0,0,0,0,0,0,0,0,0,0,0]
["2004-05-01","sábado","Dia do Trabalho",null,null,1322,40,"2030-01-07",270,135.83175278096016,135.83175278096016,4.0654443607341371,"2029-10-07",null,null,null,null,null,40,270,125.10785903791188,125.10785903791188,126.30372445548889,128.5114882366571,131.32679976631729,134.20521745864809,{"$error":"#N/A"},{"$error":"#N/A"},{"$error":"#N/A"},{"$error":"#N/A"},{"$error":"#N/A"},{"$error":"#N/A"},null,0,0,0,0,0,0,0,0,0,0,0,0,null,270,270,270,270,270,270,270,270,270,270,270,270,null,1230,40,"2029-10-07",270,270,270,270,"2029-10-07","2029-10-07",null,281.01416656302337,270,270,270,null,null,null,270,270,270,270,270,270,270,270,270,270,270,270,270,270,270,270,270,270,270,270,270,270,270,270,270,270,270,270,270,270,270,270,270,270,270,270,270,270,270,270,270,270,270,270,270,270,270,270,270,270,270,270,270,270,270,270,270,270,270,270,270,270,270,270,270,270,270,270,270,0,0,0,0,0,0,0,0,0,0,0,0,0,0,0,0,0,0,0,0,0,0,0,0,0,0,0,0]
["2004-06-10","quinta-feira","Corpus Christi",null,null,1353,41,"2030-02-07",270,133.5001029563378,133.5001029563378,3.9956580814831901,"2029-11-07",null,null,null,null,null,41,270,122.87135934167382,122.87135934167382,124.07352201231612,126.29361105974141,129.12593535158999,132.02321942767998,{"$error":"#N/A"},{"$error":"#N/A"},{"$error":"#N/A"},{"$error":"#N/A"},{"$error":"#N/A"},{"$error":"#N/A"},null,0,0,0,0,0,0,0,0,0,0,0,0,null,270,270,270,270,270,270,270,270,270,270,270,270,null,1261,41,"2029-11-07",270,270,270,270,"2029-11-07","2029-11-07",null,281.01416656302337,270,270,270,null,null,null,270,270,270,270,270,270,270,270,270,270,270,270,270,270,270,270,270,270,270,270,270,270,270,270,270,270,270,270,270,270,270,270,270,270,270,270,270,270,270,270,270,270,270,270,270,270,270,270,270,270,270,270,270,270,270,270,270,270,270,270,270,270,270,270,270,270,270,270,0,0,0,0,0,0,0,0,0,0,0,0,0,0,0,0,0,0,0,0,0,0,0,0,0,0,0,0,0]
["2004-09-07","terça-feira","Independência do Brasil",null,null,1381,42,"2030-03-07",270,131.28178331294907,131.28178331294907,3.9292637745565657,"2029-12-07",null,null,null,null,null,42,270,120.88567949278378,120.88567949278378,122.09301267884182,124.32328509075973,127.16977726791873,130.08289126699839,{"$error":"#N/A"},{"$error":"#N/A"},{"$error":"#N/A"},{"$error":"#N/A"},{"$error":"#N/A"},{"$error":"#N/A"},null,0,0,0,0,0,0,0,0,0,0,0,0,null,270,270,270,270,270,270,270,270,270,270,270,270,null,1291,42,"2029-12-07",270,270,270,270,"2029-12-07","2029-12-07",null,281.01416656302337,270,270,270,null,null,null,270,270,270,270,270,270,270,270,270,270,270,270,270,270,270,270,270,270,270,270,270,270,270,270,270,270,270,270,270,270,270,270,270,270,270,270,270,270,270,270,270,270,270,270,270,270,270,270,270,270,270,270,270,270,270,270,270,270,270,270,270,270,270,270,270,270,270,0,0,0,0,0,0,0,0,0,0,0,0,0,0,0,0,0,0,0,0,0,0,0,0,0,0,0,0,0,0]
["2004-10-12","terça-feira","Nossa Sr.a Aparecida - Padroeira do Brasil",null,null,1412,43,"2030-04-07",270,129.02823698986393,129.02823698986393,3.8618151331066275,"2030-01-07",null,null,null,null,null,43,270,118.72465789474643,118.72465789474643,119.93716069312593,122.17768876824108,125.03857908205123,{"$f":"$T78/((Z$29)^($H78-$H$35))","v":127.96791676763004},{"$error":"#N/A"},{"$error":"#N/A"},{"$error":"#N/A"},{"$error":"#N/A"},{"$error":"#N/A"},{"$error":"#N/A"},null,0,0,0,0,0,0,0,0,0,0,0,0,null,270,270,270,270,270,270,270,270,270,270,270,270,null,1322,43,"2030-01-07",270,270,270,270,"2030-01-07","2030-01-07",null,281.01416656302337,270,270,270,null,null,null,270,270,270,270,270,270,270,270,270,270,270,270,270,270,270,270,270,270,270,270,270,270,270,270,270,270,270,270,270,270,270,270,270,270,270,270,270,270,270,270,270,270,270,270,270,270,270,270,270,270,270,270,270,270,270,270,270,270,270,270,270,270,270,270,270,270,0,0,0,0,0,0,0,0,0,0,0,0,0,0,0,0,0,0,0,0,0,0,0,0,0,0,0,0,0,0,0]
["2004-11-02","terça-feira","Finados",null,null,1442,44,"2030-05-07",270,126.81337441178994,126.81337441178994,3.795524296144873,"2030-02-07",null,null,null,null,null,44,270,116.67013625895829,116.67013625895829,117.88710395534221,120.1365684699373,123.0101418430592,125.95391368776286,{"$error":"#N/A"},{"$error":"#N/A"},{"$error":"#N/A"},{"$error":"#N/A"},{"$error":"#N/A"},{"$error":"#N/A"},null,0,0,0,0,0,0,0,0,0,0,0,0,null,270,270,270,270,270,270,270,270,270,270,270,270,null,1353,44,"2030-02-07",270,270,270,270,"2030-02-07","2030-02-07",null,281.01416656302337,270,270,270,null,null,null,270,270,270,270,270,270,270,270,270,270,270,270,270,270,270,270,270,270,270,270,270,270,270,270,270,270,270,270,270,270,270,270,270,270,270,270,270,270,270,270,270,270,270,270,270,270,270,270,270,270,270,270,270,270,270,270,270,270,270,270,270,270,270,{"$f":"IF($G79>EJ$33,0,$I$9)","v":270},270,0,0,0,0,0,0,0,0,0,0,0,0,0,0,0,0,{"$f":"IF($G79>FB$33,0,$I$9)","v":0},0,0,0,0,0,0,0,0,0,0,0,0,0,0,0]
["2004-11-15","segunda-feira","Proclamação da República",null,null,1473,45,"2030-06-07",270,124.84555030698101,124.84555030698101,3.7366273206879419,"2030-03-07",null,null,null,null,null,45,270,114.58447412462232,114.58447412462232,115.80551761738414,118.06322734706612,120.94865367526189,123.90607086269452,{"$error":"#N/A"},{"$error":"#N/A"},{"$error":"#N/A"},{"$error":"#N/A"},{"$error":"#N/A"},{"$error":"#N/A"},null,0,0,0,0,0,0,0,0,0,0,0,0,null,270,270,270,270,270,270,270,270,270,270,270,270,null,1381,45,"2030-03-07",270,270,270,270,"2030-03-07","2030-03-07",null,281.01416656302337,270,270,270,null,null,null,270,270,270,270,270,270,270,270,270,270,270,270,270,270,270,270,270,270,270,270,270,270,270,270,270,270,270,270,270,270,270,270,270,270,270,270,270,270,270,270,270,270,270,270,270,270,270,270,270,270,270,270,270,270,270,270,270,270,270,270,270,270,270,270,0,0,0,0,0,0,0,0,0,0,0,0,0,0,0,0,0,0,0,0,0,0,0,0,0,0,0,0,0,0,0,0,0]
["2004-12-25","sábado","Natal",null,null,1503,46,"2030-07-07",270,122.70248655702282,122.70248655702282,3.6724854226516932,"2030-04-07",null,null,null,null,null,46,270,112.60159807015397,112.60159807015397,113.82608205052517,116.09084390905174,118.98656521486866,121.95599451047225,{"$error":"#N/A"},{"$error":"#N/A"},{"$error":"#N/A"},{"$error":"#N/A"},{"$error":"#N/A"},{"$error":"#N/A"},null,0,0,0,0,0,0,0,0,0,0,0,0,null,270,270,270,270,270,270,270,270,270,270,270,270,null,1412,46,"2030-04-07",270,270,270,270,"2030-04-07","2030-04-07",null,281.01416656302337,270,270,270,null,null,null,270,270,270,270,270,270,270,270,270,270,270,270,270,270,270,270,270,270,270,270,270,270,270,270,270,270,270,270,270,270,270,270,270,270,270,270,270,270,270,270,270,270,270,270,270,270,270,270,270,270,270,270,270,270,270,270,270,270,270,270,270,270,270,0,0,0,0,0,0,0,0,0,0,0,0,0,0,0,0,0,0,0,0,0,0,0,0,0,0,0,0,0,0,0,0,0,0]
["2005-01-01","sábado","Confraternização Universal",null,null,1534,47,"2030-08-07",270,120.66358673451781,120.66358673451781,3.6114611509641179,"2030-05-07",null,null,null,null,null,47,270,110.58866745319328,110.58866745319328,111.81620302771515,114.0873247164282,116.9925068986833,119.97315252470068,{"$error":"#N/A"},{"$error":"#N/A"},{"$error":"#N/A"},{"$error":"#N/A"},{"$error":"#N/A"},{"$error":"#N/A"},null,0,0,0,0,0,0,0,0,0,0,0,0,null,270,270,270,270,270,270,270,270,270,270,270,270,null,1442,47,"2030-05-07",270,270,270,270,"2030-05-07","2030-05-07",null,281.01416656302337,270,270,270,null,null,null,270,270,270,270,270,270,270,270,270,270,270,270,270,270,270,270,270,270,270,270,270,270,270,270,270,270,270,270,270,270,270,270,270,270,270,270,270,270,270,270,270,270,270,270,270,270,270,270,270,270,270,270,270,270,270,270,270,270,270,270,270,270,0,0,0,0,0,0,0,0,0,0,0,0,0,0,0,0,0,0,0,0,0,0,0,0,0,0,0,0,0,0,0,0,0,0,0]
["2005-02-07","segunda-feira","Carnaval",null,null,1565,48,"2030-09-07",270,118.59230939996453,118.59230939996453,3.5494678203409382,"2030-06-07",null,null,null,null,null,48,270,108.61172113608387,108.61172113608387,109.84181335509236,112.11838266201852,115.03186637686129,118.02254890782865,{"$error":"#N/A"},{"$error":"#N/A"},{"$error":"#N/A"},{"$error":"#N/A"},{"$error":"#N/A"},{"$error":"#N/A"},null,0,0,0,0,0,0,0,0,0,0,0,0,null,270,270,270,270,270,270,270,270,270,270,270,270,null,1473,48,"2030-06-07",270,270,270,270,"2030-06-07","2030-06-07",null,281.01416656302337,270,270,270,null,null,null,270,270,270,270,270,270,270,270,270,270,270,270,270,270,270,270,{"$f":"IF($G83>CO$33,0,$I$9)","v":270},270,270,270,270,270,270,270,270,270,270,270,270,270,270,270,270,270,270,270,270,270,270,270,270,270,270,270,270,270,270,270,270,270,270,270,270,270,270,270,270,270,270,270,270,0,0,0,0,0,0,0,0,0,0,0,0,0,0,0,0,0,0,0,0,0,0,0,0,0,0,0,0,0,0,0,0,0,0,0,0]
["2005-02-08","terça-feira","Carnaval",null,null,1595,49,"2030-10-07",270,116.62170680362937,116.62170680362937,3.4904876846326269,"2030-07-07",null,null,null,null,null,49,270,{"$f":"$T84/((U$29)^($H84-$H$35))","v":106.73220314099227},106.73220314099227,107.96431393574936,110.24531476417556,113.16576294588366,116.16506944736544,{"$error":"#N/A"},{"$error":"#N/A"},{"$error":"#N/A"},{"$error":"#N/A"},{"$error":"#N/A"},{"$error":"#N/A"},null,0,0,0,0,0,0,0,0,0,0,0,0,null,{"$f":"$T84","v":270},270,270,270,270,270,270,270,270,270,270,270,null,1503,49,"2030-07-07",270,270,270,270,"2030-07-07","2030-07-07",null,281.01416656302337,270,270,270,null,null,null,270,270,270,270,270,270,270,270,270,270,270,270,270,270,270,270,{"$f":"IF($G84>CO$33,0,$I$9)","v":270},270,270,270,270,270,270,270,270,270,270,270,270,270,270,270,270,270,270,270,270,270,270,270,270,270,270,270,270,270,270,270,270,270,270,270,270,270,270,270,270,270,270,270,0,0,0,0,0,0,{"$f":"IF($G84>EM$33,0,$I$9)","v":0},0,0,0,0,0,0,0,0,0,0,0,0,0,0,0,0,0,0,0,0,0,0,0,0,0,0,0,0,0,0]
["2005-03-25","sexta-feira","Paixão de Cristo",null,null,1626,50,"2030-11-07",270,114.61981124792425,114.61981124792425,3.430570950650373,"2030-08-07",null,null,null,null,null,50,270,104.82419718725509,104.82419718725509,106.05793882485678,108.3426788922209,111.26925361895084,114.27638018772818,{"$error":"#N/A"},{"$error":"#N/A"},{"$error":"#N/A"},{"$error":"#N/A"},{"$error":"#N/A"},{"$error":"#N/A"},null,0,0,0,0,0,0,0,0,0,0,0,0,null,270,270,270,270,270,270,270,270,270,270,270,270,null,1534,50,"2030-08-07",270,270,270,270,"2030-08-07","2030-08-07",null,281.01416656302337,270,270,270,null,null,null,{"$f":"IF($G85>BY$33,0,$I$9)","v":270},270,270,270,270,270,270,270,270,270,270,270,270,270,270,270,270,270,270,270,270,270,270,270,270,270,270,270,270,270,270,270,270,270,270,270,270,270,270,270,270,270,270,270,270,270,270,270,270,270,270,270,270,270,270,270,270,270,270,0,0,0,0,0,0,0,0,0,0,0,0,0,0,0,0,0,0,0,0,0,0,0,0,0,0,0,0,0,0,0,0,0,0,0,0,0,0]
["2005-04-21","quinta-feira","Tiradentes",null,null,1656,51,"2030-12-07",270,112.65227967063952,112.65227967063952,3.3716827305422408,"2030-09-07",null,null,null,null,null,51,270,103.01022202072933,103.01022202072933,104.24511625321313,106.53268851436226,109.46418914003169,112.47785921881942,{"$error":"#N/A"},{"$error":"#N/A"},{"$error":"#N/A"},{"$error":"#N/A"},{"$error":"#N/A"},{"$error":"#N/A"},null,0,0,0,0,0,0,0,0,0,0,0,0,null,270,270,270,270,270,270,270,270,270,270,270,270,null,1565,51,"2030-09-07",270,270,270,270,"2030-09-07","2030-09-07",null,281.01416656302337,270,270,270,null,null,null,270,270,270,270,270,270,270,270,270,270,270,270,270,270,270,270,270,270,270,270,270,270,270,270,270,270,270,270,270,270,270,270,270,270,270,270,270,270,270,270,270,270,270,270,270,270,270,270,270,270,270,270,270,270,270,270,270,270,0,0,0,0,0,0,0,0,0,0,0,0,0,0,0,0,0,0,0,0,0,0,0,0,0,0,0,0,0,0,0,0,0,0,0,0,0,0,0]
["2005-05-01","domingo","Dia do Trabalho",null,null,1687,52,"2031-01-07",270,110.78038025384561,110.78038025384561,3.3156567809975992,"2030-10-07",null,null,null,null,null,52,270,101.16875233185101,101.16875233185101,102.40441271134188,104.69412589483713,107.62971332097604,110.64911908493758,{"$error":"#N/A"},{"$error":"#N/A"},{"$error":"#N/A"},{"$error":"#N/A"},{"$error":"#N/A"},{"$error":"#N/A"},null,0,0,0,0,0,0,0,0,0,0,0,0,null,270,270,270,270,270,270,270,270,270,270,270,270,null,1595,52,"2030-10-07",270,270,270,270,"2030-10-07","2030-10-07",null,281.01416656302337,270,270,270,null,null,null,270,270,270,270,270,270,270,270,270,270,270,270,270,270,270,270,270,270,270,270,270,270,270,270,270,270,270,270,270,270,270,270,270,270,270,270,270,270,270,270,270,270,270,270,270,270,270,270,270,270,270,270,270,270,270,270,270,0,0,0,0,0,0,0,0,0,0,0,0,0,0,0,0,0,0,0,0,0,0,0,0,0,0,0,0,0,0,0,0,0,0,0,0,0,0,0,0]
["2005-05-26","quinta-feira","Corpus Christi",null,null,1718,53,"2031-02-07",270,108.87875527366144,108.87875527366144,3.2587411453406867,"2030-11-07",null,null,null,null,null,53,270,99.360201809134438,99.360201809134438,100.59621131106576,102.88729355972563,105.82598090354917,108.8501118291572,{"$error":"#N/A"},{"$error":"#N/A"},{"$error":"#N/A"},{"$error":"#N/A"},{"$error":"#N/A"},{"$error":"#N/A"},null,0,0,0,0,0,0,0,0,0,0,0,0,null,270,270,270,270,270,270,270,270,270,270,270,270,null,1626,53,"2030-11-07",270,270,270,270,"2030-11-07","2030-11-07",null,281.01416656302337,270,270,270,null,null,null,270,270,270,270,270,270,270,270,270,270,270,270,270,270,270,270,270,270,270,270,270,270,270,270,270,270,270,270,270,270,270,270,270,270,270,270,270,270,270,270,270,270,270,270,270,270,270,270,270,270,270,270,270,270,270,270,0,0,0,0,0,0,0,0,0,0,0,0,0,0,0,0,0,0,0,0,0,0,0,0,0,0,0,0,0,0,0,0,0,0,0,0,0,0,0,0,0]
["2005-09-07","quarta-feira","Independência do Brasil",null,null,1746,54,"2031-03-07",270,107.06955905416291,107.06955905416291,3.2045919024910954,"2030-12-07",null,null,null,null,null,54,270,97.754477321579841,97.754477321579841,98.990455851057604,101.28213313491936,104.22279911483061,107.2503558302426,{"$error":"#N/A"},{"$error":"#N/A"},{"$error":"#N/A"},{"$error":"#N/A"},{"$error":"#N/A"},{"$error":"#N/A"},null,0,0,0,0,0,0,0,0,0,0,0,0,null,270,270,270,270,270,270,270,270,270,270,270,270,null,1656,54,"2030-12-07",270,270,270,270,"2030-12-07","2030-12-07",null,281.01416656302337,270,270,270,null,null,null,270,270,270,270,270,270,270,270,270,270,270,270,270,270,270,270,270,270,270,270,270,270,270,270,270,270,270,270,270,270,270,270,270,270,270,270,270,270,270,270,270,270,270,270,270,270,270,270,270,270,270,270,270,270,270,0,{"$f":"IF($G89>EC$33,0,$I$9)","v":0},0,0,0,0,0,0,0,0,0,0,0,0,0,0,0,0,0,0,0,0,0,0,0,0,0,0,0,0,0,0,0,0,0,0,0,0,0,0,0,0]
["2005-10-12","quarta-feira","Nossa Sr.a Aparecida - Padroeira do Brasil",null,null,1777,55,"2031-04-07",270,105.23163299136951,105.23163299136951,3.1495827754316892,"2031-01-07",null,null,null,null,null,55,270,96.006962333177896,96.006962333177896,97.24253624344847,99.53418565884931,102.47616209798971,105.50660793672769,{"$error":"#N/A"},{"$error":"#N/A"},{"$error":"#N/A"},{"$error":"#N/A"},{"$error":"#N/A"},{"$error":"#N/A"},null,0,0,0,0,0,0,0,0,0,0,0,0,null,270,270,270,270,270,270,270,270,270,270,270,270,null,1687,55,"2031-01-07",270,270,270,270,"2031-01-07","2031-01-07",null,281.01416656302337,270,270,270,null,null,null,270,270,270,270,270,270,270,270,270,270,270,270,270,270,270,270,270,270,270,270,270,270,270,270,270,270,270,270,270,270,270,270,270,270,270,270,270,270,270,270,270,270,270,270,270,270,270,270,270,270,270,270,270,270,0,0,0,0,0,0,0,0,0,0,0,0,0,0,0,0,0,0,0,0,0,0,0,0,0,0,0,0,0,0,0,0,0,0,0,0,0,0,0,0,0,0,0]
["2005-11-02","quarta-feira","Finados",null,null,1807,56,"2031-05-07",270,103.42525625260564,103.42525625260564,3.0955179196404869,"2031-02-07",null,null,null,null,null,56,270,94.345568779408538,94.345568779408538,95.580393205602732,97.871351398587706,100.81374346819909,103.84610865926622,{"$error":"#N/A"},{"$error":"#N/A"},{"$error":"#N/A"},{"$error":"#N/A"},{"$error":"#N/A"},{"$error":"#N/A"},null,0,0,0,0,0,0,0,0,0,0,0,0,null,270,270,270,270,270,270,270,270,270,270,270,270,null,1718,56,"2031-02-07",270,270,270,270,"2031-02-07","2031-02-07",null,281.01416656302337,270,270,270,null,null,null,270,270,270,270,270,270,270,270,270,270,270,270,270,270,270,270,270,270,270,270,270,270,270,270,270,270,270,270,270,270,270,270,270,270,270,270,270,270,270,270,270,270,270,270,270,270,270,270,270,270,270,270,270,0,0,0,0,0,0,0,0,0,0,0,0,0,0,0,0,0,0,0,0,0,0,0,0,0,0,0,0,0,0,0,0,0,0,0,0,0,0,0,0,0,0,0,0]
["2005-11-15","terça-feira","Proclamação da República",null,null,1838,57,"2031-06-07",270,101.82035682268403,101.82035682268403,3.047483279702933,"2031-03-07",null,null,null,null,null,57,270,92.658993391265966,92.658993391265966,93.892686628733969,96.182267881469869,99.124237739669852,102.15770928918926,{"$error":"#N/A"},{"$error":"#N/A"},{"$error":"#N/A"},{"$error":"#N/A"},{"$error":"#N/A"},{"$error":"#N/A"},null,0,0,0,0,0,0,0,0,0,0,0,0,null,270,270,270,270,270,270,270,270,270,270,270,270,null,1746,57,"2031-03-07",270,270,270,270,"2031-03-07","2031-03-07",null,281.01416656302337,270,270,270,null,null,null,270,270,270,270,270,270,270,270,270,270,270,270,270,270,270,270,270,270,270,270,270,270,270,270,270,270,270,270,270,270,270,270,270,270,270,270,270,270,270,270,270,270,270,270,270,270,270,270,270,270,270,270,0,0,0,0,0,0,0,0,0,0,0,0,0,0,0,0,0,0,0,0,0,0,0,0,0,0,0,0,0,0,0,0,0,0,0,0,0,0,0,0,0,0,0,0,0]
["2005-12-25","domingo","Natal",null,null,1868,58,"2031-07-07",270,100.07253709520519,100.07253709520519,2.9951710352594918,"2031-04-07",null,null,null,null,null,58,270,91.055536198393057,91.055536198393057,92.287801756193502,94.575431303621698,97.516195673021699,100.54991613026644,{"$error":"#N/A"},{"$error":"#N/A"},{"$error":"#N/A"},{"$error":"#N/A"},{"$error":"#N/A"},{"$error":"#N/A"},null,0,0,0,0,0,0,0,0,0,0,0,0,null,270,270,270,270,270,270,270,270,270,270,270,270,null,1777,58,"2031-04-07",270,270,270,270,"2031-04-07","2031-04-07",null,281.01416656302337,270,270,270,null,null,null,270,270,270,270,270,270,270,270,270,270,270,270,270,270,270,270,270,270,270,270,270,270,270,270,270,270,270,270,270,270,270,270,270,270,270,270,270,270,270,270,270,270,270,270,270,270,270,270,270,270,270,0,0,0,0,0,0,0,0,0,0,0,0,0,0,0,0,0,0,0,0,0,0,0,0,0,0,0,0,0,0,0,0,0,{"$f":"IF($G93>FE$33,0,$I$9)","v":0},0,0,0,0,0,0,0,0,0,0,0,0]
["2006-01-01","domingo","Confraternização Universal",null,null,1899,59,"2031-08-07",270,98.409670401576861,98.409670401576861,2.9454014351191957,"2031-05-07",null,null,null,null,null,59,270,89.427775315787031,89.427775315787031,90.658233967602769,92.943229440088828,95.881952507892947,{"$f":"$T94/((Z$29)^($H94-$H$35))","v":98.915108459112716},{"$error":"#N/A"},{"$error":"#N/A"},{"$error":"#N/A"},{"$error":"#N/A"},{"$error":"#N/A"},{"$error":"#N/A"},null,0,0,0,0,0,0,0,0,0,0,0,0,null,270,270,270,270,270,270,270,270,270,270,270,270,null,1807,59,"2031-05-07",270,270,270,0,"2031-05-07","2031-05-07",null,281.01416656302337,270,270,270,null,null,null,270,270,270,270,270,270,270,270,270,270,270,270,270,270,270,270,270,270,270,270,270,270,270,270,270,270,270,270,270,270,270,270,270,270,270,270,270,270,270,270,270,270,270,270,270,270,{"$f":"IF($G94>DS$33,0,$I$9)","v":270},270,270,270,0,0,0,0,0,0,0,0,0,0,0,0,0,0,0,0,0,0,0,0,0,0,0,0,0,0,0,0,{"$f":"IF($G94>EY$33,0,$I$9)","v":0},0,0,0,0,0,0,0,0,0,0,0,0,0,0,0,0,0,0]
["2006-02-27","segunda-feira","Carnaval",null,null,1930,60,"2031-09-07",270,96.72039756194124,96.72039756194124,2.8948414990289013,"2031-06-07",null,null,null,null,null,60,270,87.82911321840119,87.82911321840119,89.057440200356965,91.33919644543235,94.275097108502393,97.306880582597529,{"$error":"#N/A"},{"$error":"#N/A"},{"$error":"#N/A"},{"$error":"#N/A"},{"$error":"#N/A"},{"$error":"#N/A"},null,0,0,0,0,0,0,0,0,0,0,0,0,null,270,270,270,270,270,270,270,270,270,270,270,270,null,1838,60,"2031-06-07",270,270,0,0,"2031-06-07","2031-06-07",null,281.01416656302337,270,270,270,null,null,null,270,270,270,270,270,270,270,270,270,270,270,270,270,270,270,270,270,270,270,270,270,270,270,270,270,270,270,270,270,270,270,270,270,270,270,270,270,270,270,270,270,270,270,270,270,270,270,270,270,0,0,0,0,0,0,0,0,0,0,0,0,0,0,0,0,0,0,0,0,0,0,0,0,0,0,0,0,0,0,0,0,0,0,0,0,0,0,0,0,0,0,0,0,0,0,0,0]
["2006-02-28","terça-feira","Carnaval",null,null,1960,61,"2031-10-07",0,0,0,0,"2031-07-07",null,null,null,null,null,61,270,86.309236753317904,86.309236753317904,87.53520301984166,89.813269005037085,92.745720182689823,95.775431433968478,{"$error":"#N/A"},{"$error":"#N/A"},{"$error":"#N/A"},{"$error":"#N/A"},{"$error":"#N/A"},{"$error":"#N/A"},null,2.5832354560268049,2.5832354560268049,2.6199286263838606,2.6881111413207601,2.7758794050679065,2.8665586628186768,{"$error":"#N/A"},{"$error":"#N/A"},{"$error":"#N/A"},{"$error":"#N/A"},{"$error":"#N/A"},{"$error":"#N/A"},null,270,270,270,270,270,270,270,270,270,270,270,270,null,1868,61,"2031-07-07",270,270,0,0,"2031-07-07","2031-07-07",null,0,0,0,0,null,null,null,270,270,270,270,270,270,270,270,270,270,270,270,270,270,270,270,270,270,270,270,270,270,270,270,270,270,270,270,270,270,270,270,270,270,270,270,270,270,270,270,270,270,270,270,270,270,270,270,0,0,0,0,0,0,0,0,0,0,0,0,0,0,0,0,0,0,0,0,0,0,0,0,0,0,0,0,0,0,0,0,0,0,0,0,0,0,0,0,0,0,0,0,0,0,0,0,0]
["2006-04-14","sexta-feira","Paixão de Cristo",null,null,1991,62,"2031-11-07",0,0,0,0,"2031-08-07",null,null,null,null,null,62,270,84.766323436234913,84.766323436234913,85.989554033795542,88.263253498690815,91.19142391161985,94.218250522813278,{"$error":"#N/A"},{"$error":"#N/A"},{"$error":"#N/A"},{"$error":"#N/A"},{"$error":"#N/A"},{"$error":"#N/A"},null,2.5370560604465111,2.5370560604465111,2.5736673522315008,2.6417191772158164,2.7293593176747821,2.8199522381478013,{"$error":"#N/A"},{"$error":"#N/A"},{"$error":"#N/A"},{"$error":"#N/A"},{"$error":"#N/A"},{"$error":"#N/A"},null,270,270,270,270,270,270,270,270,270,270,270,270,null,1899,62,"2031-08-07",0,270,0,0,"2031-08-07","2031-08-07",null,0,0,0,0,null,null,null,270,270,270,270,270,270,270,270,270,270,270,270,270,270,270,270,270,270,270,270,270,270,270,270,270,270,270,270,270,270,270,270,270,270,270,270,270,270,270,270,270,270,270,270,270,270,270,0,0,0,0,0,0,0,0,0,0,0,0,0,0,0,0,0,0,0,0,0,0,0,0,0,0,0,0,0,0,0,0,0,0,0,0,0,0,0,0,0,0,0,0,0,0,0,0,0,0]
["2006-04-21","sexta-feira","Tiradentes",null,null,2021,63,"2031-12-07",0,0,0,0,"2031-09-07",null,null,null,null,null,63,270,83.299448327271875,83.299448327271875,84.519755485895573,86.788713260397003,89.712071846865015,92.735411296187351,{"$error":"#N/A"},{"$error":"#N/A"},{"$error":"#N/A"},{"$error":"#N/A"},{"$error":"#N/A"},{"$error":"#N/A"},null,2.4931524884352472,2.4931524884352472,2.5296762816928546,2.5975861878836821,2.6850823103766701,2.7755708600948874,{"$error":"#N/A"},{"$error":"#N/A"},{"$error":"#N/A"},{"$error":"#N/A"},{"$error":"#N/A"},{"$error":"#N/A"},null,270,270,270,270,270,270,270,270,270,270,270,270,null,1930,63,"2031-09-07",0,0,0,0,"2031-09-07","2031-09-07",null,0,0,0,0,null,null,null,270,270,270,270,270,270,270,270,270,270,270,270,270,270,270,270,270,270,270,270,270,270,270,270,270,270,270,270,270,270,270,270,270,270,270,270,270,270,270,270,270,270,270,270,270,270,0,0,0,0,0,0,0,0,0,0,0,0,0,0,0,0,0,0,0,0,0,0,0,0,0,0,0,0,0,0,0,0,0,0,0,0,0,0,0,0,0,0,0,0,0,0,0,0,0,0,0]
["2006-05-01","segunda-feira","Dia do Trabalho",null,null,2052,64,"2032-01-07",0,0,0,0,"2031-10-07",null,null,null,null,null,{"$f":"S98+1","v":64},270,81.810339710807668,81.810339710807668,83.027351631665297,85.290896146960094,88.208615531394344,91.22765706217892,{"$error":"#N/A"},{"$error":"#N/A"},{"$error":"#N/A"},{"$error":"#N/A"},{"$error":"#N/A"},{"$error":"#N/A"},null,2.4485834675444735,2.4485834675444735,2.4850086343357423,2.5527565216785155,2.6400838628546328,2.7304437758710152,{"$error":"#N/A"},{"$error":"#N/A"},{"$error":"#N/A"},{"$error":"#N/A"},{"$error":"#N/A"},{"$error":"#N/A"},null,270,270,270,270,270,270,270,270,270,270,270,270,null,1960,64,"2031-10-07",0,0,0,0,"2031-10-07","2031-10-07",null,0,0,0,0,null,null,null,270,270,270,270,270,270,270,270,270,270,270,270,270,270,270,270,270,270,270,270,270,270,270,270,270,270,270,270,270,270,270,270,270,270,270,270,{"$f":"IF($G99>DI$33,0,$I$9)","v":270},270,270,270,270,270,270,270,270,0,0,0,0,0,0,0,0,0,0,0,0,0,0,0,0,0,0,0,0,0,0,0,0,0,0,0,0,0,0,0,0,0,0,0,0,0,0,0,0,0,0,0,0,0,0,0,0,0,0,0,0]
["2006-06-15","quinta-feira","Corpus Christi",null,null,2083,65,"2032-02-07",{"$f":"IF($G100>$I$10,0,$I$9)","v":0},0,0,{"$f":"J100*0.0082%*MIN(F100,365)","v":0},"2031-11-07",null,null,null,null,null,65,{"$f":"IF($G100>$P$3,0,$J$9)","v":270},{"$f":"$T100/((U$29)^($H100-$H$35))","v":80.34785125229358},80.34785125229358,81.561299832659486,83.81892866328522,86.730355166100665,89.744416903197447,{"$error":"#N/A"},{"$error":"#N/A"},{"$error":"#N/A"},{"$error":"#N/A"},{"$error":"#N/A"},{"$error":"#N/A"},null,2.4048111879811471,{"$f":"IF($I100<>0,0,V100*$B$1*MIN($F100,365))","v":2.4048111879811471},{"$f":"IF($I100<>0,0,W100*$B$1*MIN($F100,365))","v":2.4411297039914985},{"$f":"IF($I100<>0,0,X100*$B$1*MIN($F100,365))","v":2.5087005348921267},{"$f":"IF($I100<>0,0,Y100*$B$1*MIN($F100,365))","v":2.5958395301213928},{"$f":"IF($I100<>0,0,Z100*$B$1*MIN($F100,365))","v":2.6860503979126995},{"$f":"IF($I100<>0,0,AA100*$B$1*MIN($F100,365))","v":{"$error":"#N/A"}},{"$f":"IF($I100<>0,0,AB100*$B$1*MIN($F100,365))","v":{"$error":"#N/A"}},{"$f":"IF($I100<>0,0,AC100*$B$1*MIN($F100,365))","v":{"$error":"#N/A"}},{"$f":"IF($I100<>0,0,AD100*$B$1*MIN($F100,365))","v":{"$error":"#N/A"}},{"$f":"IF($I100<>0,0,AE100*$B$1*MIN($F100,365))","v":{"$error":"#N/A"}},{"$f":"IF($I100<>0,0,AF100*$B$1*MIN($F100,365))","v":{"$error":"#N/A"}},null,{"$f":"$T100","v":270},270,270,270,270,270,270,270,270,270,270,270,null,1991,65,"2031-11-07",0,0,0,0,"2031-11-07","2031-11-07",null,0,0,0,0,null,null,null,270,270,270,270,270,270,270,270,270,270,270,270,270,270,270,{"$f":"IF($G100>CN$33,0,$I$9)","v":270},270,270,270,270,270,270,270,270,270,270,270,270,270,270,270,{"$f":"IF($G100>DD$33,0,$I$9)","v":270},270,270,270,270,270,270,270,270,270,270,270,270,0,0,0,0,0,0,0,0,0,0,0,0,0,0,0,0,0,0,0,0,0,0,0,0,0,0,0,0,0,0,0,0,0,0,0,0,0,0,0,0,0,0,0,0,0,0,0,0,0,0,0,0,{"$f":"IF($G100>FQ$33,0,$I$9)","v":0}]
["2006-09-07","quinta-feira","Independência do Brasil",null,null,{"$f":"H101-$H$35","v":2112},66,"2032-03-07",0,{"$f":"I101/($J$32^(M101-$M$35))","v":0},{"$f":"I101/($I$32^(M101-$M$35))","v":0},0,"2031-12-07",null,null,null,null,null,66,270,79.003394630359068,79.003394630359068,80.213276412664541,{"$f":"$T101/((X$29)^($H101-$H$35))","v":82.4649333749649},85.369902359201333,88.378709262734745,{"$error":"#N/A"},{"$error":"#N/A"},{"$error":"#N/A"},{"$error":"#N/A"},{"$error":"#N/A"},{"$error":"#N/A"},null,{"$f":"IF($I101<>0,0,U101*$B$1*MIN($F101,365))","v":2.3645716012866469},2.3645716012866469,2.4007833630310498,2.4681754559126996,2.555121177610896,2.6451747682336513,{"$error":"#N/A"},{"$error":"#N/A"},{"$error":"#N/A"},{"$error":"#N/A"},{"$error":"#N/A"},{"$error":"#N/A"},null,270,270,270,270,270,270,270,270,270,270,270,270,null,{"$f":"BJ101-$H$35","v":2021},66,"2031-12-07",0,0,{"$f":"I102","v":0},{"$f":"BM102","v":0},{"$f":"M101","v":"2031-12-07"},{"$f":"BJ101","v":"2031-12-07"},null,{"$f":"IF(I101=0,0,PMT($BR$31,$I$10,$BR$35))","v":0},{"$f":"MIN(BR101,$I$9)","v":0},0,{"$f":"IF(G101>$BU$31,0,$BU$32)","v":0},null,null,null,{"$f":"IF($G101>BY$33,0,$I$9)","v":270},270,270,270,270,270,270,270,270,270,270,270,270,270,270,270,270,270,270,270,270,270,270,270,270,270,270,270,270,270,270,270,270,270,270,270,270,270,270,270,270,270,270,0,0,0,0,0,0,0,0,0,0,0,0,0,0,0,0,0,0,0,0,0,0,0,0,0,0,0,0,0,0,0,0,0,0,0,0,0,0,0,0,0,0,0,0,0,0,0,0,0,0,0,0,0,0]
["2006-10-12","quinta-feira","Nossa Sr.a Aparecida - Padroeira do Brasil",null,null,2143,{"$f":"G101+1","v":67},{"$f":"EDATE(H101,1)","v":"2032-04-07"},0,0,0,0,{"$f":"EDATE(M101,1)","v":"2032-01-07"},null,null,null,null,null,67,270,77.591084728716282,77.591084728716282,78.79691402270619,81.041736926633419,83.939215092585258,86.941789199249072,{"$error":"#N/A"},{"$error":"#N/A"},{"$error":"#N/A"},{"$error":"#N/A"},{"$error":"#N/A"},{"$error":"#N/A"},null,2.3223011659304786,2.3223011659304786,2.3583916366995963,2.4255791862141383,2.5123007077210771,2.6021677507335248,{"$error":"#N/A"},{"$error":"#N/A"},{"$error":"#N/A"},{"$error":"#N/A"},{"$error":"#N/A"},{"$error":"#N/A"},null,270,270,270,270,270,270,270,270,270,270,270,270,null,2052,{"$f":"BI101+1","v":67},{"$f":"EDATE(BJ101,1)","v":"2032-01-07"},{"$f":"I101","v":0},{"$f":"BK101","v":0},0,0,"2032-01-07","2032-01-07",null,0,0,{"$f":"IF(G102>$BT$31,0,$BT$32)","v":0},0,null,null,null,270,270,270,270,270,270,270,270,270,270,270,270,270,270,270,270,270,270,270,270,270,270,270,270,270,270,270,270,270,270,270,270,270,270,270,270,270,270,270,270,270,270,0,0,0,0,0,0,0,0,0,0,0,0,0,0,0,0,0,0,0,0,0,0,0,0,0,0,0,0,0,0,0,0,0,0,0,0,0,0,0,0,0,0,0,0,0,0,0,0,0,0,0,0,0,0,0]
["2006-11-02","quinta-feira","Finados",null,null,2173,68,"2032-05-07",0,0,0,0,"2032-02-07",null,null,null,null,null,68,270,76.248376607706206,76.248376607706206,77.450057522391589,79.687840516262412,82.577511921007797,85.573469423172639,{"$error":"#N/A"},{"$error":"#N/A"},{"$error":"#N/A"},{"$error":"#N/A"},{"$error":"#N/A"},{"$error":"#N/A"},null,2.2821139118686466,2.2821139118686466,2.3180802216451801,2.3850570666517341,2.4715449317957634,2.5612139398355573,{"$error":"#N/A"},{"$error":"#N/A"},{"$error":"#N/A"},{"$error":"#N/A"},{"$error":"#N/A"},{"$error":"#N/A"},null,270,270,270,270,270,270,270,270,270,270,270,270,null,2083,68,"2032-02-07",0,0,0,0,"2032-02-07","2032-02-07",null,0,0,0,0,null,null,null,270,270,270,270,270,270,270,270,270,270,270,270,270,270,270,270,270,270,270,270,270,270,270,270,270,270,270,270,270,270,270,270,270,270,270,270,270,270,270,270,270,0,0,0,0,0,0,0,0,0,0,0,0,0,0,0,0,0,0,0,0,0,0,0,0,0,0,0,0,0,0,0,0,0,0,0,0,0,0,0,0,0,0,0,0,0,0,0,0,0,0,0,0,0,0,0,0]
["2006-11-15","quarta-feira","Proclamação da República",null,null,2204,69,"2032-06-07",0,0,0,0,"2032-03-07",null,null,null,null,null,69,270,74.885316985128043,74.885316985128043,76.082486548099524,78.312571696456644,81.193621444981176,84.182158821988253,{"$error":"#N/A"},{"$error":"#N/A"},{"$error":"#N/A"},{"$error":"#N/A"},{"$error":"#N/A"},{"$error":"#N/A"},null,2.2413175373648824,2.2413175373648824,2.2771488223846186,2.3438952708749476,2.4301250898482865,2.5195720135421085,{"$error":"#N/A"},{"$error":"#N/A"},{"$error":"#N/A"},{"$error":"#N/A"},{"$error":"#N/A"},{"$error":"#N/A"},null,270,270,270,270,270,270,270,270,270,270,270,270,null,2112,69,"2032-03-07",0,0,0,0,"2032-03-07","2032-03-07",null,0,0,0,0,null,null,null,270,270,270,270,270,270,270,270,270,270,270,270,270,270,270,270,270,270,270,270,270,270,270,270,270,270,270,270,270,270,270,270,270,270,270,270,270,270,270,270,0,0,0,0,0,0,0,0,0,0,0,0,0,0,0,0,0,0,0,0,0,0,0,0,0,0,0,0,0,0,0,0,0,0,{"$f":"IF($G104>EU$33,0,$I$9)","v":0},0,0,0,0,0,0,0,0,0,0,0,0,0,0,0,0,0,0,0,0,0,0]
["2006-12-25","segunda-feira","Natal",null,null,2234,70,"2032-07-07",0,0,0,0,"2032-04-07",null,null,null,null,null,70,270,73.589431979629069,73.589431979629069,74.782027096884477,77.004269163371262,79.876458641974963,82.857271057774511,{"$error":"#N/A"},{"$error":"#N/A"},{"$error":"#N/A"},{"$error":"#N/A"},{"$error":"#N/A"},{"$error":"#N/A"},null,2.2025316991502981,2.2025316991502981,2.2382260710097523,2.3047377760597016,2.3907024071543108,2.4799181227591909,{"$error":"#N/A"},{"$error":"#N/A"},{"$error":"#N/A"},{"$error":"#N/A"},{"$error":"#N/A"},{"$error":"#N/A"},null,270,270,270,270,270,270,270,270,270,270,270,270,null,2143,70,"2032-04-07",0,0,0,0,"2032-04-07","2032-04-07",null,0,0,0,0,null,null,null,270,270,270,270,270,270,270,270,270,270,270,270,270,270,270,270,270,270,270,270,270,270,270,270,270,270,270,270,270,270,270,270,270,270,270,270,270,270,270,0,0,0,0,0,0,0,0,0,0,0,0,0,0,0,0,0,0,0,0,0,0,0,0,0,0,0,0,0,0,0,0,0,0,0,0,0,0,0,0,0,0,0,0,0,0,0,0,0,0,0,0,0,0,0,0,0,0]
["2007-01-01","segunda-feira","Confraternização Universal",null,null,2265,71,"2032-08-07",0,0,0,0,"2032-05-07",null,null,null,null,null,71,270,72.273905173124476,72.273905173124476,73.461566752140996,75.675313959086296,78.537834265896606,81.510122223153658,{"$error":"#N/A"},{"$error":"#N/A"},{"$error":"#N/A"},{"$error":"#N/A"},{"$error":"#N/A"},{"$error":"#N/A"},null,2.1631579818316156,2.1631579818316156,2.1987046928915799,2.2649621467954528,2.3506373795782856,2.4395979581389891,{"$error":"#N/A"},{"$error":"#N/A"},{"$error":"#N/A"},{"$error":"#N/A"},{"$error":"#N/A"},{"$error":"#N/A"},null,270,270,270,270,270,270,270,270,270,270,270,270,null,2173,71,"2032-05-07",0,0,0,0,"2032-05-07","2032-05-07",null,0,0,0,0,null,null,null,270,270,270,270,270,270,270,270,270,270,270,270,270,270,270,270,270,270,270,270,270,270,270,270,270,270,270,270,270,270,270,270,270,270,270,270,270,270,0,0,0,0,0,0,0,0,0,0,0,0,0,0,0,0,0,0,0,0,0,0,0,0,0,0,0,0,0,0,0,0,0,0,0,0,0,0,0,0,0,0,0,0,0,0,0,0,0,0,0,0,0,0,0,0,0,0,0]
["2007-02-19","segunda-feira","Carnaval",null,null,2296,72,"2032-09-07",0,0,0,0,"2032-06-07",null,null,null,null,null,72,270,70.981895476781972,70.981895476781972,72.164422377687799,74.369294131686104,77.221643473513538,80.184876233744234,{"$error":"#N/A"},{"$error":"#N/A"},{"$error":"#N/A"},{"$error":"#N/A"},{"$error":"#N/A"},{"$error":"#N/A"},null,2.1244881316200845,2.1244881316200845,2.1598811617641962,2.2258729733613651,2.3112437891622601,2.3999333456759651,{"$error":"#N/A"},{"$error":"#N/A"},{"$error":"#N/A"},{"$error":"#N/A"},{"$error":"#N/A"},{"$error":"#N/A"},null,270,270,270,270,270,270,270,270,270,270,270,270,null,2204,72,"2032-06-07",0,0,0,0,"2032-06-07","2032-06-07",null,0,0,0,0,null,null,null,270,270,270,270,270,270,270,270,270,270,270,270,270,270,270,270,270,270,270,270,270,270,270,270,270,270,270,270,270,270,270,270,270,270,270,270,270,0,0,0,0,0,0,0,0,0,0,0,0,0,0,0,0,0,0,0,0,0,0,0,0,0,0,0,0,0,0,0,0,0,0,0,0,0,0,0,0,0,0,0,0,0,0,0,0,0,0,0,0,0,0,0,0,0,0,0,0]
["2007-02-20","terça-feira","Carnaval",null,null,2326,73,"2032-10-07",0,0,0,0,"2032-07-07",null,null,null,null,null,73,270,69.75355889875128,69.75355889875128,70.93093344507767,73.126868633601504,75.968916047883894,78.922899077495231,{"$error":"#N/A"},{"$error":"#N/A"},{"$error":"#N/A"},{"$error":"#N/A"},{"$error":"#N/A"},{"$f":"$T108/((AF$29)^($H108-$H$35))","v":{"$error":"#N/A"}},null,2.0877240178396259,2.0877240178396259,2.1229628380111749,2.188687178203693,2.2737496573131653,2.362162369389432,{"$error":"#N/A"},{"$error":"#N/A"},{"$error":"#N/A"},{"$error":"#N/A"},{"$error":"#N/A"},{"$error":"#N/A"},null,270,270,270,270,270,270,270,270,270,270,270,270,null,2234,73,"2032-07-07",0,0,0,0,"2032-07-07","2032-07-07",null,0,0,0,0,null,null,null,270,270,270,270,270,270,270,270,270,270,270,270,270,270,270,270,270,270,270,270,270,270,270,270,270,270,270,270,270,270,270,270,270,270,270,270,0,0,0,0,0,0,0,0,0,0,0,0,0,0,0,0,0,0,0,0,0,0,0,0,0,0,0,0,0,0,0,0,0,0,0,0,0,0,0,0,0,0,0,0,0,0,0,0,0,0,0,0,0,0,0,0,0,0,0,0,0]
["2007-04-06","sexta-feira","Paixão de Cristo",null,null,2357,74,"2032-11-07",0,0,0,0,"2032-08-07",null,null,null,null,null,74,270,68.506604354981917,68.506604354981917,69.67847361661488,71.864830389494443,74.695776945638954,77.639717889413205,{"$error":"#N/A"},{"$error":"#N/A"},{"$error":"#N/A"},{"$error":"#N/A"},{"$error":"#N/A"},{"$error":"#N/A"},null,2.050402668344609,2.050402668344609,2.0854767153452833,2.1509143735575686,2.235644603982974,2.3237567564301371,{"$error":"#N/A"},{"$error":"#N/A"},{"$error":"#N/A"},{"$error":"#N/A"},{"$error":"#N/A"},{"$error":"#N/A"},null,270,270,270,270,270,270,270,270,270,270,270,270,null,2265,74,"2032-08-07",0,0,0,0,"2032-08-07","2032-08-07",null,0,0,0,0,null,null,null,270,270,270,270,270,270,270,270,270,270,270,270,270,270,270,270,270,270,270,270,270,270,270,270,270,270,270,270,270,270,270,270,270,270,270,0,0,0,0,0,0,0,0,0,0,0,0,0,0,0,0,0,0,0,0,0,0,0,0,0,0,0,0,0,{"$f":"IF($G109>EK$33,0,$I$9)","v":0},0,0,0,0,0,0,0,0,0,0,0,0,0,0,0,0,0,0,0,0,0,0,0,0,0,0,0,0,0,0,0,0]
["2007-04-21","sábado","Tiradentes",null,null,2387,75,"2032-12-07",0,0,0,0,"2032-09-07",null,null,null,null,null,75,270,67.321102511157136,67.321102511157136,68.487476401984154,70.664244869167575,73.484025367331611,76.417797310419715,{"$error":"#N/A"},{"$error":"#N/A"},{"$error":"#N/A"},{"$error":"#N/A"},{"$error":"#N/A"},{"$error":"#N/A"},null,2.0149205981589331,2.0149205981589331,2.0498301687113858,2.1149808489341857,2.1993768792442352,2.2871846735008621,{"$error":"#N/A"},{"$error":"#N/A"},{"$error":"#N/A"},{"$error":"#N/A"},{"$error":"#N/A"},{"$error":"#N/A"},null,270,270,270,270,270,270,270,270,270,270,270,270,null,2296,75,"2032-09-07",0,0,0,0,"2032-09-07","2032-09-07",null,0,0,0,0,null,null,null,270,270,270,270,270,270,270,270,270,270,270,270,270,270,270,270,270,270,270,270,270,270,270,270,270,270,270,270,270,270,270,270,270,270,0,0,0,0,0,0,0,0,0,0,0,0,0,0,0,0,0,0,0,0,0,0,0,0,0,0,0,0,0,0,0,0,0,0,0,0,0,0,0,0,0,0,0,0,0,0,0,0,0,0,0,0,0,0,0,0,0,0,0,{"$f":"IF($G110>FN$33,0,$I$9)","v":0},0,0,0]
["2007-05-01","terça-feira","Dia do Trabalho",null,null,2418,76,"2033-01-07",0,0,0,0,"2032-10-07",null,null,null,null,null,76,270,66.117631950039254,66.117631950039254,67.278161808476113,69.444707082548121,72.252529764228115,75.175345739461704,{"$error":"#N/A"},{"$error":"#N/A"},{"$error":"#N/A"},{"$error":"#N/A"},{"$error":"#N/A"},{"$error":"#N/A"},null,1.978900724264675,1.978900724264675,2.0136353829276903,2.0784800829806653,2.1625182158433476,2.2499980979820888,{"$error":"#N/A"},{"$error":"#N/A"},{"$error":"#N/A"},{"$error":"#N/A"},{"$error":"#N/A"},{"$error":"#N/A"},null,270,270,270,270,270,270,270,270,270,270,270,270,null,2326,76,"2032-10-07",0,0,0,0,"2032-10-07","2032-10-07",null,0,0,0,0,null,null,null,270,270,270,270,270,270,270,270,270,270,270,270,270,270,270,270,270,270,270,270,270,270,270,270,270,270,270,270,270,270,270,270,270,0,0,0,0,0,0,0,0,0,0,0,0,0,0,0,0,0,0,0,0,0,0,0,0,0,0,0,0,0,0,0,0,0,0,0,0,0,0,0,0,0,0,0,0,0,0,0,0,0,0,0,0,0,0,0,0,0,0,0,0,0,0,0,0]
["2007-06-07","quinta-feira","Corpus Christi",null,null,2449,77,"2033-02-07",0,0,0,0,"2032-11-07",null,null,null,null,null,77,270,64.935675317503211,64.935675317503211,66.090200634058704,68.246216324956507,71.041672407503754,73.953094775698716,{"$error":"#N/A"},{"$error":"#N/A"},{"$error":"#N/A"},{"$error":"#N/A"},{"$error":"#N/A"},{"$error":"#N/A"},null,1.9435247622528711,1.9435247622528711,1.9780797049773771,2.0426092546059484,2.1262772551565874,2.2134161266366625,{"$error":"#N/A"},{"$error":"#N/A"},{"$error":"#N/A"},{"$error":"#N/A"},{"$error":"#N/A"},{"$error":"#N/A"},null,270,270,270,270,270,270,270,270,270,270,270,270,null,2357,77,"2032-11-07",0,0,0,0,"2032-11-07","2032-11-07",null,0,0,0,0,null,null,null,270,270,270,270,270,270,270,270,270,270,270,270,270,270,270,270,270,270,270,270,270,270,270,270,270,270,270,270,270,270,270,270,0,0,0,0,0,0,0,0,0,0,0,0,0,0,0,0,0,0,0,0,0,0,0,0,0,0,0,0,0,0,0,0,0,0,0,0,0,0,0,0,0,0,0,0,0,0,0,0,0,0,0,0,0,0,0,0,0,0,0,0,0,0,0,0,0]
["2007-09-07","sexta-feira","Independência do Brasil",null,null,2477,78,"2033-03-07",0,0,0,0,"2032-12-07",null,null,null,null,null,78,270,63.886273222150152,63.886273222150152,65.035243403184353,67.181496651637516,69.965445998153228,72.866215717720252,{"$error":"#N/A"},{"$error":"#N/A"},{"$error":"#N/A"},{"$error":"#N/A"},{"$error":"#N/A"},{"$error":"#N/A"},null,1.9121161575389543,1.9121161575389543,1.9465048350573078,2.0107421947835111,2.0940657987247264,2.1808858364313668,{"$error":"#N/A"},{"$error":"#N/A"},{"$error":"#N/A"},{"$error":"#N/A"},{"$error":"#N/A"},{"$error":"#N/A"},null,270,270,270,270,270,270,270,270,270,270,270,270,null,2387,78,"2032-12-07",0,0,0,0,"2032-12-07","2032-12-07",null,0,0,0,0,null,null,null,270,270,270,270,270,270,270,270,270,270,270,270,270,270,270,270,270,270,270,270,270,270,270,270,270,270,270,270,270,270,270,0,0,0,0,0,0,0,0,0,0,0,0,0,0,0,0,0,0,0,0,0,0,0,0,0,0,0,0,0,0,0,0,0,0,0,0,0,0,0,0,0,0,0,0,0,0,0,0,0,0,0,0,0,0,0,0,0,0,0,0,0,0,0,0,0,0]
["2007-10-12","sexta-feira","Nossa Sr.a Aparecida - Padroeira do Brasil",null,null,2508,79,"2033-04-07",0,0,0,0,"2033-01-07",null,null,null,null,null,79,270,62.744205635398295,62.744205635398295,63.886886461570697,66.022064836014039,68.792917156882012,71.681508131600111,{"$error":"#N/A"},{"$error":"#N/A"},{"$error":"#N/A"},{"$error":"#N/A"},{"$error":"#N/A"},{"$error":"#N/A"},null,1.8779340746674709,1.8779340746674709,1.912134511794811,1.9760404005419001,2.0589720105054785,2.1454275383787915,{"$error":"#N/A"},{"$error":"#N/A"},{"$error":"#N/A"},{"$error":"#N/A"},{"$error":"#N/A"},{"$error":"#N/A"},null,270,270,270,270,270,270,270,270,270,270,270,270,null,2418,79,"2033-01-07",0,0,0,0,"2033-01-07","2033-01-07",null,0,0,0,0,null,null,null,270,270,270,270,270,270,270,270,270,270,270,270,270,270,270,270,270,270,270,270,270,270,270,270,270,270,270,270,270,270,0,0,0,0,0,0,0,0,0,0,0,0,0,0,0,0,0,0,0,0,0,0,0,0,{"$f":"IF($G114>EA$33,0,$I$9)","v":0},0,0,0,0,0,0,0,0,0,0,0,0,0,0,0,0,0,0,0,0,0,0,0,0,0,0,0,0,0,0,0,0,0,0,0,0,0,0,0,0,0,0]
["2007-11-02","sexta-feira","Finados",null,null,2538,80,"2033-05-07",0,0,0,0,"2033-02-07",null,null,null,null,null,80,270,61.658421685508536,61.658421685508536,62.794883438573734,64.919089505318937,67.676924669088734,70.553359906692194,{"$error":"#N/A"},{"$error":"#N/A"},{"$error":"#N/A"},{"$error":"#N/A"},{"$error":"#N/A"},{"$error":"#N/A"},null,1.8454365610472703,1.8454365610472703,1.879450861316512,1.9430283488941957,2.0255703553458257,2.1116620620072974,{"$error":"#N/A"},{"$error":"#N/A"},{"$error":"#N/A"},{"$error":"#N/A"},{"$error":"#N/A"},{"$error":"#N/A"},null,270,270,270,270,270,270,270,270,270,270,270,270,null,2449,80,"2033-02-07",0,0,0,0,"2033-02-07","2033-02-07",null,0,0,0,0,null,null,null,270,270,270,270,270,270,270,270,270,270,270,270,270,270,270,270,270,270,270,270,270,270,270,270,270,270,270,270,270,0,0,0,0,0,0,0,0,0,0,0,0,0,0,0,0,0,0,0,0,0,0,0,0,0,0,0,0,0,0,0,0,0,0,0,0,0,0,0,0,0,0,0,0,0,0,0,0,0,0,0,0,0,0,0,0,0,0,0,0,0,0,0,0,0,0,0,0]
["2007-11-15","quinta-feira","Proclamação da República",null,null,2569,81,"2033-06-07",0,0,0,0,"2033-03-07",null,null,null,null,null,81,270,{"$f":"$T116/((U$29)^($H116-$H$35))","v":60.556180447982705},60.556180447982705,61.686085554210393,63.798702768416121,66.542748434935362,69.406256274584734,{"$error":"#N/A"},{"$error":"#N/A"},{"$error":"#N/A"},{"$error":"#N/A"},{"$error":"#N/A"},{"$error":"#N/A"},null,1.8124464808081224,1.8124464808081224,1.8462645406375171,1.9094951738586945,1.9916244606576152,2.0773292502983209,{"$error":"#N/A"},{"$error":"#N/A"},{"$error":"#N/A"},{"$error":"#N/A"},{"$error":"#N/A"},{"$error":"#N/A"},null,{"$f":"$T116","v":270},270,270,270,270,270,270,270,270,270,270,270,null,2477,81,"2033-03-07",0,0,0,0,"2033-03-07","2033-03-07",null,0,0,0,0,null,null,null,270,270,270,270,270,270,270,270,270,270,270,270,270,270,270,270,{"$f":"IF($G116>CO$33,0,$I$9)","v":270},270,270,270,270,270,270,270,270,270,270,270,0,0,0,0,0,0,0,0,0,0,0,0,0,0,0,0,0,0,0,0,0,0,0,0,0,0,0,0,0,0,0,0,0,0,0,0,0,0,0,0,0,0,0,0,0,0,0,0,0,0,0,0,0,0,0,0,0,0,0,0,0,0,0,0,0,0,0,0,0]
["2007-12-25","terça-feira","Natal",null,null,2599,82,"2033-07-07",0,0,0,0,"2033-04-07",null,null,null,null,null,82,270,59.508260116038109,59.508260116038109,60.631700286232608,62.732871285279465,65.463259289255504,68.313916745819199,{"$error":"#N/A"},{"$error":"#N/A"},{"$error":"#N/A"},{"$error":"#N/A"},{"$error":"#N/A"},{"$error":"#N/A"},null,1.7810822252730207,1.7810822252730207,1.814706789566942,1.8775948375684146,1.9593153505274172,2.0446355282023689,{"$error":"#N/A"},{"$error":"#N/A"},{"$error":"#N/A"},{"$error":"#N/A"},{"$error":"#N/A"},{"$error":"#N/A"},null,270,270,270,270,270,270,270,270,270,270,270,270,null,2508,82,"2033-04-07",0,0,0,0,"2033-04-07","2033-04-07",null,0,0,0,0,null,null,null,{"$f":"IF($G117>BY$33,0,$I$9)","v":270},270,270,270,270,270,270,270,270,270,270,270,270,270,270,270,270,270,270,270,270,270,270,270,270,270,270,0,0,0,0,0,0,0,0,0,0,0,0,0,0,0,0,0,0,0,0,0,0,0,0,0,0,0,0,0,0,0,0,0,0,0,0,0,0,0,0,0,0,0,0,0,0,0,0,0,0,0,0,0,0,0,0,0,0,0,0,0,0,0,0,0,0,0,0,0,0]
["2008-01-01","terça-feira","Confraternização Universal",null,null,2630,83,"2033-08-07",0,0,0,0,"2033-05-07",null,null,null,null,null,83,270,58.444456397417653,58.444456397417653,59.561098712961289,61.650214743244952,64.366181174977569,67.20322347584235,{"$error":"#N/A"},{"$error":"#N/A"},{"$error":"#N/A"},{"$error":"#N/A"},{"$error":"#N/A"},{"$error":"#N/A"},null,1.7492425799747104,1.7492425799747104,1.7826636844789314,1.8451909272653215,1.9264798025670786,2.0113924786319615,{"$error":"#N/A"},{"$error":"#N/A"},{"$error":"#N/A"},{"$error":"#N/A"},{"$error":"#N/A"},{"$error":"#N/A"},null,270,270,270,270,270,270,270,270,270,270,270,270,null,2538,83,"2033-05-07",0,0,0,0,"2033-05-07","2033-05-07",null,0,0,0,0,null,null,null,270,270,270,270,270,270,270,270,270,270,270,270,270,270,270,270,270,270,270,270,270,270,270,270,270,270,0,0,0,0,0,0,0,0,0,0,0,0,0,0,0,0,0,0,0,0,0,0,0,0,0,0,0,0,0,0,0,0,0,0,0,0,0,0,0,0,0,0,0,0,0,0,0,0,0,0,0,0,0,0,0,0,0,0,0,0,0,0,0,0,0,0,0,0,0,0,0]
["2008-02-04","segunda-feira","Carnaval",null,null,2661,84,"2033-09-07",0,0,0,0,"2033-06-07",null,null,null,null,null,84,270,57.399669842961366,57.399669842961366,58.509401239744555,60.586242906118649,63.287488646780986,66.110588598631395,{"$error":"#N/A"},{"$error":"#N/A"},{"$error":"#N/A"},{"$error":"#N/A"},{"$error":"#N/A"},{"$error":"#N/A"},null,1.7179721183998338,1.7179721183998338,1.7511863791055546,1.8133462501801312,1.8941945351981548,1.9786899167570375,{"$error":"#N/A"},{"$error":"#N/A"},{"$error":"#N/A"},{"$error":"#N/A"},{"$error":"#N/A"},{"$error":"#N/A"},null,270,270,270,270,270,270,270,270,270,270,270,270,null,2569,84,"2033-06-07",0,0,0,0,"2033-06-07","2033-06-07",null,0,0,0,0,null,null,null,270,270,270,270,270,270,270,270,270,270,270,270,270,270,270,270,270,270,270,270,270,270,270,270,270,0,0,0,0,0,0,0,0,0,0,0,0,0,0,0,0,0,0,0,0,0,0,0,0,0,0,{"$f":"IF($G119>DX$33,0,$I$9)","v":0},0,0,0,0,0,0,0,0,0,0,0,0,0,0,0,0,0,0,0,0,0,0,0,0,0,0,0,0,0,0,0,0,0,0,0,0,0,0,0,0,0,0,0,0,0]
["2008-02-05","terça-feira","Carnaval",null,null,2691,85,"2033-10-07",0,0,0,0,"2033-07-07",null,null,null,null,null,85,270,56.406372699212106,56.406372699212106,57.509314264681578,59.57407929883172,62.260807924112349,65.070117421068602,{"$error":"#N/A"},{"$error":"#N/A"},{"$error":"#N/A"},{"$error":"#N/A"},{"$error":"#N/A"},{"$error":"#N/A"},null,1.6882427348874183,1.6882427348874183,1.7212537759419198,1.7830521934140333,1.8634659811686827,1.9475486144125833,{"$error":"#N/A"},{"$error":"#N/A"},{"$error":"#N/A"},{"$error":"#N/A"},{"$error":"#N/A"},{"$error":"#N/A"},null,270,270,270,270,270,270,270,270,270,270,270,270,null,2599,85,"2033-07-07",0,0,0,0,"2033-07-07","2033-07-07",null,0,0,0,0,null,null,null,270,270,270,270,270,270,270,270,270,270,270,270,270,270,270,270,270,270,270,270,270,270,270,270,0,0,0,0,0,0,0,0,0,0,0,0,0,0,0,0,0,0,0,0,0,0,0,0,0,0,0,0,0,0,0,0,0,0,0,0,0,0,0,0,0,0,0,0,0,0,0,0,0,0,0,0,0,0,0,0,0,0,0,0,0,0,0,0,0,0,0,0,0,0,0,0,0]
["2008-03-21","sexta-feira","Paixão de Cristo",null,null,2722,86,"2033-11-07",0,0,0,0,"2033-08-07",null,null,null,null,null,86,270,55.398020095484384,55.398020095484384,56.493846084853814,58.545937825834969,61.21739868215888,64.012164006318642,{"$error":"#N/A"},{"$error":"#N/A"},{"$error":"#N/A"},{"$error":"#N/A"},{"$error":"#N/A"},{"$error":"#N/A"},null,1.6580627414578475,1.6580627414578475,1.6908608133196747,1.7522799191272407,1.8322367425570154,1.915884068709117,{"$error":"#N/A"},{"$error":"#N/A"},{"$error":"#N/A"},{"$error":"#N/A"},{"$error":"#N/A"},{"$error":"#N/A"},null,270,270,270,270,270,270,270,270,270,270,270,270,null,2630,86,"2033-08-07",0,0,0,0,"2033-08-07","2033-08-07",null,0,0,0,0,null,null,null,270,270,270,270,270,270,270,270,270,270,270,270,270,270,270,270,270,270,270,270,270,270,270,0,0,0,0,0,0,0,0,0,0,0,0,0,0,0,0,0,0,0,0,0,0,0,0,0,0,0,0,0,0,0,0,0,0,0,0,0,0,0,0,0,0,0,0,0,0,0,0,0,0,0,0,0,0,0,0,0,0,0,0,0,0,0,0,0,0,0,0,0,0,0,0,0,0]
["2008-04-21","segunda-feira","Tiradentes",null,null,2752,87,"2033-12-07",0,0,0,0,"2033-09-07",null,null,null,null,null,87,270,54.439361356143991,54.439361356143991,55.528210504185871,57.567859886365831,60.224299975561841,63.004718556598718,{"$error":"#N/A"},{"$error":"#N/A"},{"$error":"#N/A"},{"$error":"#N/A"},{"$error":"#N/A"},{"$error":"#N/A"},null,1.6293700853893895,1.6293700853893895,1.661959340390283,1.7230060463989294,1.8025132982685659,1.8857312263989998,{"$error":"#N/A"},{"$error":"#N/A"},{"$error":"#N/A"},{"$error":"#N/A"},{"$error":"#N/A"},{"$error":"#N/A"},null,270,270,270,270,270,270,270,270,270,270,270,270,null,2661,87,"2033-09-07",0,0,0,0,"2033-09-07","2033-09-07",null,0,0,0,0,null,null,null,270,270,270,270,270,270,270,270,270,270,270,270,270,270,270,270,270,270,270,270,270,270,0,0,0,0,0,0,0,0,0,0,0,0,0,0,0,0,0,0,0,0,0,0,0,0,0,0,0,0,0,0,0,0,0,0,0,0,0,0,0,0,0,0,0,0,0,0,0,0,0,0,0,0,0,0,0,0,0,0,0,0,0,0,0,0,0,0,0,0,0,0,0,0,0,0,0]
["2008-05-01","quinta-feira","Dia do Trabalho",null,null,2783,88,"2034-01-07",0,0,0,0,"2033-10-07",null,null,null,null,null,88,270,53.466172173044676,53.466172173044676,54.547723576620328,56.574342152521488,59.215019927971206,61.980345775603389,{"$error":"#N/A"},{"$error":"#N/A"},{"$error":"#N/A"},{"$error":"#N/A"},{"$error":"#N/A"},{"$error":"#N/A"},null,1.6002425331392272,1.6002425331392272,1.6326133666482463,1.6932700606249682,1.7723055464441781,1.8550717490638096,{"$error":"#N/A"},{"$error":"#N/A"},{"$error":"#N/A"},{"$error":"#N/A"},{"$error":"#N/A"},{"$error":"#N/A"},null,270,270,270,270,270,270,270,270,270,270,270,270,null,2691,88,"2033-10-07",0,0,0,0,"2033-10-07","2033-10-07",null,0,0,0,0,null,null,null,270,270,270,270,270,270,270,270,270,270,270,270,270,270,270,270,270,270,270,270,270,0,0,0,0,0,0,0,0,0,0,0,0,0,0,0,0,0,0,0,0,0,0,0,0,0,0,0,0,0,0,0,0,0,0,0,0,0,0,0,0,0,0,0,0,0,0,0,0,0,0,0,0,0,0,0,0,0,0,0,0,0,0,0,0,0,0,0,0,0,0,0,0,0,0,0,0]
["2008-05-22","quinta-feira","Corpus Christi",null,null,2814,89,"2034-02-07",0,0,0,0,"2033-11-07",null,null,null,null,null,89,270,52.510380276807453,52.510380276807453,53.584549553727868,55.597970748059737,58.22265408635517,60.972627931229987,{"$error":"#N/A"},{"$error":"#N/A"},{"$error":"#N/A"},{"$error":"#N/A"},{"$error":"#N/A"},{"$error":"#N/A"},null,1.5716356816848471,1.5716356816848471,1.603785568143075,1.664047264489428,1.7426040368046101,1.8249107539817138,{"$error":"#N/A"},{"$error":"#N/A"},{"$error":"#N/A"},{"$error":"#N/A"},{"$error":"#N/A"},{"$error":"#N/A"},null,270,270,270,270,270,270,270,270,270,270,270,270,null,2722,89,"2033-11-07",0,0,0,0,"2033-11-07","2033-11-07",null,0,0,0,0,null,null,null,270,270,270,270,270,270,270,270,270,270,270,270,270,270,270,270,270,270,270,270,0,0,0,0,0,0,0,0,0,0,0,0,0,0,0,0,0,0,0,0,0,{"$f":"IF($G124>DN$33,0,$I$9)","v":0},0,0,0,0,0,0,0,0,0,0,0,0,0,0,0,0,0,0,0,0,0,0,0,0,0,0,0,0,0,0,0,0,0,0,0,0,0,0,0,0,0,0,0,0,0,0,0,0,0,0,0,0,0,0,0]
["2008-09-07","domingo","Independência do Brasil",null,null,2842,90,"2034-03-07",0,0,0,0,"2033-12-07",null,null,null,null,null,90,270,51.661778905976476,51.661778905976476,52.729212340759602,54.730578291162089,57.340625893229557,60.076521113667262,{"$error":"#N/A"},{"$error":"#N/A"},{"$error":"#N/A"},{"$error":"#N/A"},{"$error":"#N/A"},{"$error":"#N/A"},null,1.546237042655876,1.546237042655876,1.5781853253589351,1.6380862082544811,1.7162049329843607,1.798090276932061,{"$error":"#N/A"},{"$error":"#N/A"},{"$error":"#N/A"},{"$error":"#N/A"},{"$error":"#N/A"},{"$error":"#N/A"},null,270,270,270,270,270,270,270,270,270,270,270,270,null,2752,90,"2033-12-07",0,0,0,0,"2033-12-07","2033-12-07",null,0,0,0,0,null,null,null,270,270,270,270,270,270,270,270,270,270,270,270,270,270,270,270,270,270,270,0,0,0,0,0,0,0,0,0,0,0,0,0,0,0,0,0,0,0,0,0,0,0,0,0,0,0,0,0,0,0,0,0,0,0,0,0,0,0,0,0,0,0,0,0,0,0,0,0,0,0,0,0,0,0,0,0,0,0,{"$f":"IF($G125>EY$33,0,$I$9)","v":0},0,0,0,0,0,0,0,0,0,0,0,0,0,0,0,0,0,0]
["2008-10-12","domingo","Nossa Sr.a Aparecida - Padroeira do Brasil",null,null,2873,91,"2034-04-07",0,0,0,0,"2034-01-07",null,null,null,null,null,91,270,50.73824337656324,50.73824337656324,51.798148599797813,53.786026935194378,56.379672430028158,59.099756921784575,{"$error":"#N/A"},{"$error":"#N/A"},{"$error":"#N/A"},{"$error":"#N/A"},{"$error":"#N/A"},{"$error":"#N/A"},null,1.5185956242605378,1.5185956242605378,1.5503185875919485,1.6098157861703679,1.6874435958307428,1.7688557246690124,{"$error":"#N/A"},{"$error":"#N/A"},{"$error":"#N/A"},{"$error":"#N/A"},{"$error":"#N/A"},{"$error":"#N/A"},null,270,270,270,270,270,270,270,270,270,270,270,270,null,2783,91,"2034-01-07",0,0,0,0,"2034-01-07","2034-01-07",null,0,0,0,0,null,null,null,270,270,270,270,270,270,270,270,270,270,270,270,270,270,270,270,270,270,0,0,0,0,0,0,0,0,0,0,0,0,0,0,0,0,0,0,0,0,0,0,0,0,0,0,0,0,0,0,0,0,0,0,0,0,0,0,0,0,0,0,0,0,0,0,0,0,0,0,0,0,0,0,0,0,0,0,0,0,0,0,0,0,0,0,0,0,0,0,0,0,0,0,0,0,0,0,0]
["2008-11-02","domingo","Finados",null,null,2903,92,"2034-05-07",0,0,0,0,"2034-02-07",null,null,null,null,null,92,270,49.860221737019351,49.860221737019351,50.912775434983281,52.887468839609618,55.465053694604116,58.169624624046151,{"$error":"#N/A"},{"$error":"#N/A"},{"$error":"#N/A"},{"$error":"#N/A"},{"$error":"#N/A"},{"$error":"#N/A"},null,1.4923164365889892,1.4923164365889892,1.5238193687690496,1.5829219423695158,1.6600690570795011,1.7410168649977011,{"$error":"#N/A"},{"$error":"#N/A"},{"$error":"#N/A"},{"$error":"#N/A"},{"$error":"#N/A"},{"$error":"#N/A"},null,270,270,270,270,270,270,270,270,270,270,270,270,null,2814,92,"2034-02-07",0,0,0,0,"2034-02-07","2034-02-07",null,0,0,0,0,null,null,null,270,270,270,270,270,270,270,270,270,270,270,270,270,270,270,270,270,0,0,0,0,0,0,0,0,0,0,0,0,0,0,0,0,0,0,0,0,0,0,0,0,0,0,0,0,0,0,0,0,0,0,0,0,0,0,0,0,0,0,0,0,0,0,0,0,0,0,0,0,0,0,0,0,0,0,0,0,0,0,0,0,0,0,0,0,0,0,0,0,0,0,0,0,0,0,0,0]
["2008-11-15","sábado","Proclamação da República",null,null,2934,93,"2034-06-07",0,0,0,0,"2034-03-07",null,null,null,null,null,93,270,48.968891874716988,48.968891874716988,50.013785348560127,51.974726238199544,54.535532354294254,57.223864028479653,{"$error":"#N/A"},{"$error":"#N/A"},{"$error":"#N/A"},{"$error":"#N/A"},{"$error":"#N/A"},{"$error":"#N/A"},null,1.4656389338102795,1.4656389338102795,1.4969125954824045,1.5556035563093125,1.6322484833640272,1.7127102503723961,{"$error":"#N/A"},{"$error":"#N/A"},{"$error":"#N/A"},{"$error":"#N/A"},{"$error":"#N/A"},{"$error":"#N/A"},null,270,270,270,270,270,270,270,270,270,270,270,270,null,2842,93,"2034-03-07",0,0,0,0,"2034-03-07","2034-03-07",null,0,0,0,0,null,null,null,270,270,270,270,270,270,270,270,270,270,270,270,270,270,270,270,0,0,0,0,0,0,0,0,0,0,0,0,0,0,0,0,0,0,0,0,0,0,0,0,0,0,0,0,0,0,0,0,0,0,0,0,0,0,0,0,0,0,0,0,0,0,0,0,0,0,0,0,0,0,0,0,0,0,0,0,0,0,0,0,0,0,0,0,0,0,0,0,0,0,0,0,0,0,0,0,0]
["2008-12-25","quinta-feira","Natal",null,null,2964,94,"2034-07-07",0,0,0,0,"2034-04-07",null,null,null,null,null,94,270,48.121488735207691,48.121488735207691,49.158911871121184,51.106428026037349,53.650830164875465,56.323255178180617,{"$error":"#N/A"},{"$error":"#N/A"},{"$error":"#N/A"},{"$error":"#N/A"},{"$error":"#N/A"},{"$error":"#N/A"},null,1.440276157844766,1.440276157844766,1.471326232302657,1.5296153908192978,1.6057693468347227,1.6857550274829458,{"$error":"#N/A"},{"$error":"#N/A"},{"$error":"#N/A"},{"$error":"#N/A"},{"$error":"#N/A"},{"$error":"#N/A"},null,270,270,270,270,270,270,270,270,270,270,270,270,null,2873,94,"2034-04-07",0,0,0,0,"2034-04-07","2034-04-07",null,0,0,0,0,null,null,null,270,270,270,270,270,270,270,270,270,270,270,270,270,270,270,0,0,0,0,0,0,0,0,0,0,0,0,0,0,0,0,{"$f":"IF($G129>DD$33,0,$I$9)","v":0},0,0,0,0,0,0,0,0,0,0,0,0,0,0,0,0,0,0,0,0,0,0,0,0,0,0,0,0,0,0,0,0,0,0,0,0,0,0,0,0,0,0,0,0,0,0,0,0,0,0,0,0,0,0,0,0,0,0,0,0,0,0,0,0,0]
["2009-01-01","quinta-feira","Confraternização Universal",null,null,2995,95,"2034-08-07",0,0,0,0,"2034-05-07",null,null,null,null,null,95,270,47.261241459245568,47.261241459245568,48.290890553212037,50.224422986115187,52.751712824465429,55.40751408984049,{"$error":"#N/A"},{"$error":"#N/A"},{"$error":"#N/A"},{"$error":"#N/A"},{"$error":"#N/A"},{"$error":"#N/A"},null,1.41452895687522,1.41452895687522,1.4453463542576361,1.5032169799744277,1.5788587648362502,1.6583468967089259,{"$error":"#N/A"},{"$error":"#N/A"},{"$error":"#N/A"},{"$error":"#N/A"},{"$error":"#N/A"},{"$error":"#N/A"},null,270,270,270,270,270,270,270,270,270,270,270,270,null,2903,95,"2034-05-07",0,0,0,0,"2034-05-07","2034-05-07",null,0,0,0,0,null,null,null,270,270,270,270,270,270,270,270,270,270,270,270,270,270,0,0,0,0,0,0,0,0,0,0,0,0,0,0,0,0,0,0,0,0,0,0,0,0,0,0,0,0,0,0,0,0,0,0,0,0,0,0,0,0,0,0,0,0,0,0,0,0,0,0,0,0,0,0,0,0,0,0,0,0,0,0,0,0,0,0,0,0,0,0,0,0,0,0,0,0,0,0,0,0,0,0,0]
["2009-02-23","segunda-feira","Carnaval",null,null,3026,96,"2034-09-07",0,0,0,0,"2034-06-07",null,null,null,null,null,{"$f":"S130+1","v":96},270,46.416372455968919,46.416372455968919,47.438196283434436,49.357639767018597,51.867663507967464,54.506661731532432,{"$error":"#N/A"},{"$error":"#N/A"},{"$error":"#N/A"},{"$error":"#N/A"},{"$error":"#N/A"},{"$error":"#N/A"},null,1.3892420276071498,1.3892420276071498,1.4198252147631927,1.4772741582268667,1.5523991687934662,1.6313843856247656,{"$error":"#N/A"},{"$error":"#N/A"},{"$error":"#N/A"},{"$error":"#N/A"},{"$error":"#N/A"},{"$error":"#N/A"},null,270,270,270,270,270,270,270,270,270,270,270,270,null,2934,96,"2034-06-07",0,0,0,0,"2034-06-07","2034-06-07",null,0,0,0,0,null,null,null,270,270,270,270,270,270,270,270,270,270,270,270,270,0,0,0,0,0,0,0,0,0,0,0,0,0,0,0,0,0,0,0,0,0,0,0,0,0,0,0,0,0,0,0,0,0,0,0,0,0,0,0,0,0,0,0,0,0,0,0,0,0,0,0,0,0,0,0,0,0,0,0,0,0,0,0,0,0,0,0,0,0,0,0,0,0,0,0,0,0,0,0,0,0,0,0,0]
["2009-02-24","terça-feira","Carnaval",null,null,{"$f":"H132-$H$35","v":3056},97,"2034-10-07",0,0,0,{"$f":"J132*0.0082%*MIN(F132,365)","v":0},"2034-07-07",null,null,null,null,null,{"$f":"S131+1","v":97},270,45.613140480770227,45.613140480770227,46.627346723905603,48.533063026203592,51.02624079722127,53.648817145377883,{"$error":"#N/A"},{"$error":"#N/A"},{"$error":"#N/A"},{"$error":"#N/A"},{"$error":"#N/A"},{"$error":"#N/A"},null,{"$f":"IF($I132<>0,0,U132*$B$1*MIN($F132,365))","v":1.3652012945894529},{"$f":"IF($I132<>0,0,V132*$B$1*MIN($F132,365))","v":1.3652012945894529},{"$f":"IF($I132<>0,0,W132*$B$1*MIN($F132,365))","v":1.3955564874464947},{"$f":"IF($I132<>0,0,X132*$B$1*MIN($F132,365))","v":1.4525945763742736},{"$f":"IF($I132<>0,0,Y132*$B$1*MIN($F132,365))","v":1.5272153870608325},{"$f":"IF($I132<>0,0,Z132*$B$1*MIN($F132,365))","v":1.6057090971611601},{"$f":"IF($I132<>0,0,AA132*$B$1*MIN($F132,365))","v":{"$error":"#N/A"}},{"$f":"IF($I132<>0,0,AB132*$B$1*MIN($F132,365))","v":{"$error":"#N/A"}},{"$f":"IF($I132<>0,0,AC132*$B$1*MIN($F132,365))","v":{"$error":"#N/A"}},{"$f":"IF($I132<>0,0,AD132*$B$1*MIN($F132,365))","v":{"$error":"#N/A"}},{"$f":"IF($I132<>0,0,AE132*$B$1*MIN($F132,365))","v":{"$error":"#N/A"}},{"$f":"IF($I132<>0,0,AF132*$B$1*MIN($F132,365))","v":{"$error":"#N/A"}},null,270,270,270,270,270,270,270,270,270,270,270,270,null,{"$f":"BJ132-$H$35","v":2964},97,"2034-07-07",{"$f":"I131","v":0},{"$f":"BK131","v":0},{"$f":"I133","v":0},{"$f":"BM133","v":0},"2034-07-07",{"$f":"BJ132","v":"2034-07-07"},null,{"$f":"IF(I132=0,0,PMT($BR$31,$I$10,$BR$35))","v":0},{"$f":"MIN(BR132,$I$9)","v":0},{"$f":"IF(G132>$BT$31,0,$BT$32)","v":0},{"$f":"IF(G132>$BU$31,0,$BU$32)","v":0},null,null,null,270,270,270,270,270,270,270,270,270,270,270,270,0,0,0,{"$f":"IF($G132>CN$33,0,$I$9)","v":0},0,0,0,0,0,0,0,0,0,0,0,0,0,0,0,0,0,0,0,0,0,0,0,0,0,0,0,0,0,0,0,0,0,0,0,0,0,0,0,0,0,0,0,0,0,0,0,0,0,0,0,0,0,0,0,0,0,0,0,0,0,0,0,0,0,0,0,0,0,0,0,0,0,0,0,0,0,0,0,0,0]
["2009-04-10","sexta-feira","Paixão de Cristo",null,null,3087,98,"2034-11-07",0,0,0,0,"2034-08-07",null,null,null,null,null,98,270,{"$f":"$T133/((U$29)^($H133-$H$35))","v":44.79773387390955},44.79773387390955,45.804026405913191,47.695469638339276,50.171108122186624,52.776558856231631,{"$error":"#N/A"},{"$error":"#N/A"},{"$error":"#N/A"},{"$error":"#N/A"},{"$error":"#N/A"},{"$error":"#N/A"},null,1.3407961748461128,1.3407961748461128,1.3709145103289819,1.4275254062754945,1.5016212660970458,1.5796024065670129,{"$error":"#N/A"},{"$error":"#N/A"},{"$error":"#N/A"},{"$error":"#N/A"},{"$error":"#N/A"},{"$error":"#N/A"},null,{"$f":"$T133","v":270},270,270,270,270,270,270,270,270,270,270,270,null,2995,98,"2034-08-07",0,0,0,0,"2034-08-07","2034-08-07",null,0,0,0,0,null,null,null,270,270,270,270,270,270,270,270,270,270,270,0,0,0,0,0,{"$f":"IF($G133>CO$33,0,$I$9)","v":0},0,0,0,0,0,0,0,0,0,0,0,0,0,0,0,0,0,0,0,0,0,0,0,0,0,0,0,0,0,0,0,0,0,0,0,0,0,0,0,0,0,0,0,0,0,0,0,0,0,0,0,0,0,0,0,0,0,{"$f":"IF($G133>EU$33,0,$I$9)","v":0},0,0,0,0,0,0,0,0,0,0,0,0,0,0,0,0,0,0,0,0,0,0]
["2009-04-21","terça-feira","Tiradentes",null,null,3117,99,"2034-12-07",0,0,0,0,"2034-09-07",null,null,null,null,null,99,270,44.02251232254639,44.02251232254639,45.021109314926498,46.898661381468308,49.357207766123224,51.945943224078668,{"$error":"#N/A"},{"$error":"#N/A"},{"$error":"#N/A"},{"$error":"#N/A"},{"$error":"#N/A"},{"$error":"#N/A"},null,1.3175937938138134,1.3175937938138134,1.3474818017957499,1.4036769351473464,1.4772612284400679,1.5547420806966745,{"$error":"#N/A"},{"$error":"#N/A"},{"$error":"#N/A"},{"$error":"#N/A"},{"$error":"#N/A"},{"$error":"#N/A"},null,270,270,270,270,270,270,270,270,270,270,270,270,null,3026,99,"2034-09-07",0,0,0,0,"2034-09-07","2034-09-07",null,0,0,0,0,null,null,null,270,270,270,270,270,270,270,270,270,270,0,0,0,0,0,0,0,0,0,0,0,0,0,0,0,0,0,0,0,0,0,0,{"$f":"IF($G134>DE$33,0,$I$9)","v":0},0,0,0,0,0,0,0,0,0,0,0,0,0,0,0,{"$f":"IF($G134>DU$33,0,$I$9)","v":0},0,0,0,0,0,0,0,0,0,0,0,0,0,0,0,{"$f":"IF($G134>EK$33,0,$I$9)","v":0},0,0,0,0,0,0,0,0,0,0,0,0,0,0,0,0,0,0,0,0,0,0,0,0,0,0,0,0,0,0,0,0]
["2009-05-01","sexta-feira","Dia do Trabalho",null,null,3148,100,"2035-01-07",0,0,0,0,"2034-10-07",null,null,null,null,null,100,270,43.23554069507113,43.23554069507113,44.226151063130189,46.089274826747953,48.530045889217256,51.101371396111965,{"$error":"#N/A"},{"$error":"#N/A"},{"$error":"#N/A"},{"$error":"#N/A"},{"$error":"#N/A"},{"$error":"#N/A"},null,1.294039733003479,1.294039733003479,1.3236887013194865,1.3794519955645661,1.4525042734642724,1.529464045885631,{"$error":"#N/A"},{"$error":"#N/A"},{"$error":"#N/A"},{"$error":"#N/A"},{"$error":"#N/A"},{"$error":"#N/A"},null,270,270,270,270,270,270,270,270,270,270,270,270,null,3056,100,"2034-10-07",0,0,0,0,"2034-10-07","2034-10-07",null,0,0,0,0,null,null,null,270,270,270,270,270,270,270,270,270,0,0,0,0,0,0,0,0,0,0,0,0,0,0,0,0,0,0,0,0,0,0,0,0,0,0,0,0,0,0,0,0,0,0,0,0,0,0,0,0,0,0,0,0,0,0,0,0,0,0,0,0,0,0,0,0,0,0,0,0,0,0,0,0,0,0,0,0,0,0,0,0,0,0,0,0,0,0,0,0,0,0,0,0,0,0,0,0]
["2009-06-11","quinta-feira","Corpus Christi",null,null,3179,101,"2035-02-07",0,0,0,0,"2034-11-07",null,null,null,null,null,101,270,42.462637422848132,42.462637422848132,43.445229751598482,45.293856828392848,47.716746157306375,50.270531180824172,{"$error":"#N/A"},{"$error":"#N/A"},{"$error":"#N/A"},{"$error":"#N/A"},{"$error":"#N/A"},{"$error":"#N/A"},null,1.2709067380658448,1.2709067380658448,1.3003157264653424,1.3556451348737979,1.4281622124881796,1.5045969982420675,{"$error":"#N/A"},{"$error":"#N/A"},{"$error":"#N/A"},{"$error":"#N/A"},{"$error":"#N/A"},{"$error":"#N/A"},null,270,270,270,270,270,270,270,270,270,270,270,270,null,3087,101,"2034-11-07",0,0,0,0,"2034-11-07","2034-11-07",null,0,0,0,0,null,null,null,270,270,270,270,270,270,270,270,0,0,0,0,0,0,0,0,0,0,0,0,0,0,0,0,0,0,0,0,0,0,0,0,0,0,0,0,0,0,0,0,0,0,0,0,0,0,0,0,0,0,0,0,0,0,0,0,0,0,0,0,0,0,0,0,0,0,0,0,0,0,0,0,0,0,0,0,0,0,0,0,0,0,0,0,0,0,0,0,0,0,0,0,0,0,0,0,0]
["2009-09-07","segunda-feira","Independência do Brasil",null,null,3207,102,"2035-03-07",0,0,0,0,"2034-12-07",null,null,null,null,null,102,270,41.776414010711797,41.776414010711797,42.751740265506228,44.587220430910278,46.993874346403715,49.531711693423297,{"$error":"#N/A"},{"$error":"#N/A"},{"$error":"#N/A"},{"$error":"#N/A"},{"$error":"#N/A"},{"$error":"#N/A"},null,1.250368071340604,1.250368071340604,1.2795595861466016,1.3344955074971445,1.4065266591878631,1.4824841309841594,{"$error":"#N/A"},{"$error":"#N/A"},{"$error":"#N/A"},{"$error":"#N/A"},{"$error":"#N/A"},{"$error":"#N/A"},null,270,270,270,270,270,270,270,270,270,270,270,270,null,3117,102,"2034-12-07",0,0,0,0,"2034-12-07","2034-12-07",null,0,0,0,0,null,null,null,270,270,270,270,270,270,270,0,0,0,0,0,0,0,0,0,0,0,0,0,0,0,0,0,0,0,0,0,0,0,0,0,0,0,0,0,0,0,0,0,0,0,0,0,0,0,0,0,0,0,0,0,0,0,0,0,0,0,0,0,0,0,0,0,0,0,0,0,0,0,0,0,0,0,0,0,0,0,0,0,0,0,0,0,0,0,0,0,0,0,0,0,0,0,0,0,0]
["2009-10-12","segunda-feira","Nossa Sr.a Aparecida - Padroeira do Brasil",null,null,3238,103,"2035-04-07",0,0,0,0,"2035-01-07",null,null,null,null,null,103,270,41.029594922259811,41.029594922259811,41.996853297595642,43.817725190191283,46.206318828845959,48.726392053605032,{"$error":"#N/A"},{"$error":"#N/A"},{"$error":"#N/A"},{"$error":"#N/A"},{"$error":"#N/A"},{"$error":"#N/A"},null,1.2280157760232362,1.2280157760232362,1.2569658191970376,1.3114645149424251,1.3829551225473595,1.4583809141643986,{"$error":"#N/A"},{"$error":"#N/A"},{"$error":"#N/A"},{"$error":"#N/A"},{"$error":"#N/A"},{"$error":"#N/A"},null,270,270,270,270,270,270,270,270,270,270,270,270,null,3148,103,"2035-01-07",0,0,0,0,"2035-01-07","2035-01-07",null,0,0,0,0,null,null,null,270,270,270,270,270,270,0,0,0,0,0,0,0,0,0,0,0,0,0,0,0,0,0,0,0,0,0,0,0,0,0,0,0,0,0,0,0,0,0,0,0,0,0,0,0,0,0,0,0,0,0,0,0,0,0,0,0,0,0,0,0,0,0,0,0,0,0,0,0,0,0,0,0,0,0,0,0,0,0,0,0,0,0,0,0,0,0,0,0,0,0,0,0,0,0,0,0]
["2009-11-02","segunda-feira","Finados",null,null,3268,104,"2035-05-07",0,0,0,0,"2035-02-07",null,null,null,null,null,104,270,40.31958074348546,40.31958074348546,41.279011291240849,43.085699161438612,45.456737231892049,47.959519339368576,{"$error":"#N/A"},{"$error":"#N/A"},{"$error":"#N/A"},{"$error":"#N/A"},{"$error":"#N/A"},{"$error":"#N/A"},null,1.2067650516525199,1.2067650516525199,1.2354808079468387,1.2895549759018576,1.3605201453505291,1.4354284138273017,{"$error":"#N/A"},{"$error":"#N/A"},{"$error":"#N/A"},{"$error":"#N/A"},{"$error":"#N/A"},{"$error":"#N/A"},null,270,270,270,270,270,270,270,270,270,270,270,270,null,3179,104,"2035-02-07",0,0,0,0,"2035-02-07","2035-02-07",null,0,0,0,0,null,null,null,270,270,270,270,270,0,0,0,0,0,0,0,0,0,0,0,0,0,0,0,0,0,0,0,0,0,0,0,0,0,0,0,0,0,0,0,0,0,0,0,0,0,0,0,0,0,0,0,0,0,0,0,0,0,0,0,0,0,0,0,0,0,0,0,0,0,0,0,0,0,0,0,0,0,0,0,0,0,0,0,0,0,0,0,0,0,0,0,0,0,0,0,0,0,0,0,0]
["2009-11-15","domingo","Proclamação da República",null,null,3299,105,"2035-06-07",0,0,0,0,"2035-03-07",null,null,null,null,null,105,270,39.59880484036713,39.59880484036713,40.550128970229601,42.34211747755338,44.694942110398955,47.17976145255674,{"$error":"#N/A"},{"$error":"#N/A"},{"$error":"#N/A"},{"$error":"#N/A"},{"$error":"#N/A"},{"$error":"#N/A"},null,1.1851922288721883,1.1851922288721883,1.213665360078972,1.2672995761031727,1.3377196173642407,1.4120902602750232,{"$error":"#N/A"},{"$error":"#N/A"},{"$error":"#N/A"},{"$error":"#N/A"},{"$error":"#N/A"},{"$error":"#N/A"},null,270,270,270,270,270,270,270,270,270,270,270,270,null,3207,105,"2035-03-07",0,0,0,0,"2035-03-07","2035-03-07",null,0,0,0,0,null,null,null,270,270,270,270,0,0,0,0,0,0,0,0,0,0,0,0,0,0,0,0,0,0,0,0,0,0,0,0,0,0,0,0,0,0,0,0,0,0,0,0,0,0,0,0,0,0,0,0,0,0,0,0,0,0,0,0,0,0,0,0,0,0,0,0,0,0,0,0,0,0,0,0,0,0,0,0,0,0,0,0,0,0,0,0,0,0,0,0,0,0,0,0,0,0,0,0,0]
["2009-12-25","sexta-feira","Natal",null,null,3329,106,"2035-07-07",0,0,0,0,"2035-04-07",null,null,null,null,null,106,270,38.913550380691106,38.913550380691106,39.857015471185569,41.634743190742832,43.969878808841166,46.437230142576993,{"$error":"#N/A"},{"$error":"#N/A"},{"$error":"#N/A"},{"$error":"#N/A"},{"$error":"#N/A"},{"$error":"#N/A"},null,1.1646825628940847,1.1646825628940847,1.1929204730525842,1.246127863698933,1.3160184727486162,1.3898662981673293,{"$error":"#N/A"},{"$error":"#N/A"},{"$error":"#N/A"},{"$error":"#N/A"},{"$error":"#N/A"},{"$error":"#N/A"},null,270,270,270,270,270,270,270,270,270,270,270,270,null,3238,106,"2035-04-07",0,0,0,0,"2035-04-07","2035-04-07",null,0,0,0,0,null,null,null,270,270,270,0,0,0,0,0,0,0,0,0,0,0,0,0,0,0,0,0,0,0,0,0,0,0,0,0,0,0,0,0,0,0,0,0,0,0,0,0,0,0,0,0,0,0,0,0,0,0,0,0,0,0,0,0,0,0,0,0,0,0,0,0,0,0,0,0,0,0,0,0,0,0,0,0,0,0,0,0,0,0,0,0,0,0,0,0,0,0,0,0,0,0,0,0,0]
["2010-01-01","sexta-feira","Confraternização Universal",null,null,3360,107,"2035-08-07",0,0,0,0,"2035-05-07",null,null,null,null,null,107,270,38.217909481108713,38.217909481108713,39.153241978641098,40.916202397569187,43.233001478681246,45.68222264992167,{"$error":"#N/A"},{"$error":"#N/A"},{"$error":"#N/A"},{"$error":"#N/A"},{"$error":"#N/A"},{"$error":"#N/A"},null,1.1438620307695837,1.1438620307695837,1.1718565324207282,1.2246219377592458,1.2939637342569297,1.3672689239121556,{"$error":"#N/A"},{"$error":"#N/A"},{"$error":"#N/A"},{"$error":"#N/A"},{"$error":"#N/A"},{"$error":"#N/A"},null,270,270,270,270,270,270,270,270,270,270,270,270,null,3268,107,"2035-05-07",0,0,0,0,"2035-05-07","2035-05-07",null,0,0,0,0,null,null,null,270,270,0,0,0,0,0,0,0,0,0,0,0,0,0,0,0,0,0,0,0,0,0,0,0,0,0,0,0,0,0,0,0,0,0,0,0,0,0,0,0,0,0,0,0,0,0,0,0,0,0,0,0,0,0,0,0,0,0,0,0,0,0,0,0,0,0,0,0,0,0,0,0,0,0,0,0,0,0,0,0,0,0,0,0,0,0,0,0,0,0,0,0,0,0,0,0]
["2010-02-15","segunda-feira","Carnaval",null,null,3391,108,"2035-09-07",0,0,0,0,"2035-06-07",null,null,null,null,null,108,270,37.53470425641175,37.53470425641175,38.461895335497005,40.210062326289993,42.508473243274686,44.939490573181885,{"$error":"#N/A"},{"$error":"#N/A"},{"$error":"#N/A"},{"$error":"#N/A"},{"$error":"#N/A"},{"$error":"#N/A"},null,1.1234136983944036,1.1234136983944036,1.1511645273914253,1.2034871654258594,1.2722786041712113,1.3450389528553337,{"$error":"#N/A"},{"$error":"#N/A"},{"$error":"#N/A"},{"$error":"#N/A"},{"$error":"#N/A"},{"$error":"#N/A"},null,270,270,270,270,270,270,270,270,270,270,270,270,null,3299,108,"2035-06-07",0,0,0,0,"2035-06-07","2035-06-07",null,0,0,0,0,null,null,null,270,0,0,0,0,0,0,0,0,0,0,0,0,0,0,0,0,0,0,0,0,0,0,0,0,0,0,0,0,0,0,0,0,0,0,0,0,0,0,0,0,0,0,0,0,0,0,0,0,0,0,0,0,0,0,0,0,0,0,0,0,0,0,0,0,0,0,0,0,0,0,0,0,0,0,0,0,0,0,0,0,0,0,0,0,0,0,0,0,0,0,0,0,0,0,0,0]
["2010-02-16","terça-feira","Carnaval"]
["2010-04-02","sexta-feira","Paixão de Cristo"]
["2010-04-21","quarta-feira","Tiradentes"]
["2010-05-01","sábado","Dia do Trabalho"]
["2010-06-03","quinta-feira","Corpus Christi"]
["2010-09-07","terça-feira","Independência do Brasil"]
["2010-10-12","terça-feira","Nossa Sr.a Aparecida - Padroeira do Brasil"]
["2010-11-02","terça-feira","Finados"]
["2010-11-15","segunda-feira","Proclamação da República"]
["2010-12-25","sábado","Natal"]
["2011-01-01","sábado","Confraternização Universal"]
["2011-03-07","segunda-feira","Carnaval"]
["2011-03-08","terça-feira","Carnaval"]
["2011-04-21","quinta-feira","Tiradentes"]
["2011-04-22","sexta-feira","Paixão de Cristo"]
["2011-05-01","domingo","Dia do Trabalho"]
["2011-06-23","quinta-feira","Corpus Christi"]
["2011-09-07","quarta-feira","Independência do Brasil"]
["2011-10-12","quarta-feira","Nossa Sr.a Aparecida - Padroeira do Brasil"]
["2011-11-02","quarta-feira","Finados"]
["2011-11-15","terça-feira","Proclamação da República"]
["2011-12-25","domingo","Natal"]
["2012-01-01","domingo","Confraternização Universal"]
["2012-02-20","segunda-feira","Carnaval"]
["2012-02-21","terça-feira","Carnaval"]
["2012-04-06","sexta-feira","Paixão de Cristo"]
["2012-04-21","sábado","Tiradentes"]
["2012-05-01","terça-feira","Dia do Trabalho"]
["2012-06-07","quinta-feira","Corpus Christi"]
["2012-09-07","sexta-feira","Independência do Brasil"]
["2012-10-12","sexta-feira","Nossa Sr.a Aparecida - Padroeira do Brasil"]
["2012-11-02","sexta-feira","Finados"]
["2012-11-15","quinta-feira","Proclamação da República"]
["2012-12-25","terça-feira","Natal"]
["2013-01-01","terça-feira","Confraternização Universal"]
["2013-02-11","segunda-feira","Carnaval"]
["2013-02-12","terça-feira","Carnaval"]
["2013-03-29","sexta-feira","Paixão de Cristo"]
["2013-04-21","domingo","Tiradentes"]
["2013-05-01","quarta-feira","Dia do Trabalho"]
["2013-05-30","quinta-feira","Corpus Christi"]
["2013-09-07","sábado","Independência do Brasil"]
["2013-10-12","sábado","Nossa Sr.a Aparecida - Padroeira do Brasil"]
["2013-11-02","sábado","Finados"]
["2013-11-15","sexta-feira","Proclamação da República"]
["2013-12-25","quarta-feira","Natal"]
["2014-01-01","quarta-feira","Confraternização Universal"]
["2014-03-03","segunda-feira","Carnaval"]
["2014-03-04","terça-feira","Carnaval"]
["2014-04-18","sexta-feira","Paixão de Cristo"]
["2014-04-21","segunda-feira","Tiradentes"]
["2014-05-01","quinta-feira","Dia do Trabalho"]
["2014-06-19","quinta-feira","Corpus Christi"]
["2014-09-07","domingo","Independência do Brasil"]
["2014-10-12","domingo","Nossa Sr.a Aparecida - Padroeira do Brasil"]
["2014-11-02","domingo","Finados"]
["2014-11-15","sábado","Proclamação da República"]
["2014-12-25","quinta-feira","Natal"]
["2015-01-01","quinta-feira","Confraternização Universal"]
["2015-02-16","segunda-feira","Carnaval"]
["2015-02-17","terça-feira","Carnaval"]
["2015-04-03","sexta-feira","Paixão de Cristo"]
["2015-04-21","terça-feira","Tiradentes"]
["2015-05-01","sexta-feira","Dia do Trabalho"]
["2015-06-04","quinta-feira","Corpus Christi"]
["2015-09-07","segunda-feira","Independência do Brasil"]
["2015-10-12","segunda-feira","Nossa Sr.a Aparecida - Padroeira do Brasil"]
["2015-11-02","segunda-feira","Finados"]
["2015-11-15","domingo","Proclamação da República"]
["2015-12-25","sexta-feira","Natal"]
["2016-01-01","sexta-feira","Confraternização Universal"]
["2016-02-08","segunda-feira","Carnaval"]
["2016-02-09","terça-feira","Carnaval"]
["2016-03-25","sexta-feira","Paixão de Cristo"]
["2016-04-21","quinta-feira","Tiradentes"]
["2016-05-01","domingo","Dia do Trabalho"]
["2016-05-26","quinta-feira","Corpus Christi"]
["2016-09-07","quarta-feira","Independência do Brasil"]
["2016-10-12","quarta-feira","Nossa Sr.a Aparecida - Padroeira do Brasil"]
["2016-11-02","quarta-feira","Finados"]
["2016-11-15","terça-feira","Proclamação da República"]
["2016-12-25","domingo","Natal"]
["2017-01-01","domingo","Confraternização Universal"]
["2017-02-27","segunda-feira","Carnaval"]
["2017-02-28","terça-feira","Carnaval"]
["2017-04-14","sexta-feira","Paixão de Cristo"]
["2017-04-21","sexta-feira","Tiradentes"]
["2017-05-01","segunda-feira","Dia do Trabalho"]
["2017-06-15","quinta-feira","Corpus Christi"]
["2017-09-07","quinta-feira","Independência do Brasil"]
["2017-10-12","quinta-feira","Nossa Sr.a Aparecida - Padroeira do Brasil"]
["2017-11-02","quinta-feira","Finados"]
["2017-11-15","quarta-feira","Proclamação da República"]
["2017-12-25","segunda-feira","Natal"]
["2018-01-01","segunda-feira","Confraternização Universal"]
["2018-02-12","segunda-feira","Carnaval"]
["2018-02-13","terça-feira","Carnaval"]
["2018-03-30","sexta-feira","Paixão de Cristo"]
["2018-04-21","sábado","Tiradentes"]
["2018-05-01","terça-feira","Dia do Trabalho"]
["2018-05-31","quinta-feira","Corpus Christi"]
["2018-09-07","sexta-feira","Independência do Brasil"]
["2018-10-12","sexta-feira","Nossa Sr.a Aparecida - Padroeira do Brasil"]
["2018-11-02","sexta-feira","Finados"]
["2018-11-15","quinta-feira","Proclamação da República"]
["2018-12-25","terça-feira","Natal"]
["2019-01-01","terça-feira","Confraternização Universal"]
["2019-03-04","segunda-feira","Carnaval"]
["2019-03-05","terça-feira","Carnaval"]
["2019-04-19","sexta-feira","Paixão de Cristo"]
["2019-04-21","domingo","Tiradentes"]
["2019-05-01","quarta-feira","Dia do Trabalho"]
["2019-06-20","quinta-feira","Corpus Christi"]
["2019-09-07","sábado","Independência do Brasil"]
["2019-10-12","sábado","Nossa Sr.a Aparecida - Padroeira do Brasil"]
["2019-11-02","sábado","Finados"]
["2019-11-15","sexta-feira","Proclamação da República"]
["2019-12-25","quarta-feira","Natal"]
["2020-01-01","quarta-feira","Confraternização Universal"]
["2020-02-24","segunda-feira","Carnaval"]
["2020-02-25","terça-feira","Carnaval"]
["2020-04-10","sexta-feira","Paixão de Cristo"]
["2020-04-21","terça-feira","Tiradentes"]
["2020-05-01","sexta-feira","Dia do Trabalho"]
["2020-06-11","quinta-feira","Corpus Christi"]
["2020-09-07","segunda-feira","Independência do Brasil"]
["2020-10-12","segunda-feira","Nossa Sr.a Aparecida - Padroeira do Brasil"]
["2020-11-02","segunda-feira","Finados"]
["2020-11-15","domingo","Proclamação da República"]
["2020-12-25","sexta-feira","Natal"]
["2021-01-01","sexta-feira","Confraternização Universal"]
["2021-02-15","segunda-feira","Carnaval"]
["2021-02-16","terça-feira","Carnaval"]
["2021-04-02","sexta-feira","Paixão de Cristo"]
["2021-04-21","quarta-feira","Tiradentes"]
["2021-05-01","sábado","Dia do Trabalho"]
["2021-06-03","quinta-feira","Corpus Christi"]
["2021-09-07","terça-feira","Independência do Brasil"]
["2021-10-12","terça-feira","Nossa Sr.a Aparecida - Padroeira do Brasil"]
["2021-11-02","terça-feira","Finados"]
["2021-11-15","segunda-feira","Proclamação da República"]
["2021-12-25","sábado","Natal"]
["2022-01-01","sábado","Confraternização Universal"]
["2022-02-28","segunda-feira","Carnaval"]
["2022-03-01","terça-feira","Carnaval"]
["2022-04-15","sexta-feira","Paixão de Cristo"]
["2022-04-21","quinta-feira","Tiradentes"]
["2022-05-01","domingo","Dia do Trabalho"]
["2022-06-16","quinta-feira","Corpus Christi"]
["2022-09-07","quarta-feira","Independência do Brasil"]
["2022-10-12","quarta-feira","Nossa Sr.a Aparecida - Padroeira do Brasil"]
["2022-11-02","quarta-feira","Finados"]
["2022-11-15","terça-feira","Proclamação da República"]
["2022-12-25","domingo","Natal"]
["2023-01-01","domingo","Confraternização Universal"]
["2023-02-20","segunda-feira","Carnaval"]
["2023-02-21","terça-feira","Carnaval"]
["2023-04-07","sexta-feira","Paixão de Cristo"]
["2023-04-21","sexta-feira","Tiradentes"]
["2023-05-01","segunda-feira","Dia do Trabalho"]
["2023-06-08","quinta-feira","Corpus Christi"]
["2023-09-07","quinta-feira","Independência do Brasil"]
["2023-10-12","quinta-feira","Nossa Sr.a Aparecida - Padroeira do Brasil"]
["2023-11-02","quinta-feira","Finados"]
["2023-11-15","quarta-feira","Proclamação da República"]
["2023-12-25","segunda-feira","Natal"]
["2024-01-01","segunda-feira","Confraternização Universal"]
["2024-02-12","segunda-feira","Carnaval"]
["2024-02-13","terça-feira","Carnaval"]
["2024-03-29","sexta-feira","Paixão de Cristo"]
["2024-04-21","domingo","Tiradentes"]
["2024-05-01","quarta-feira","Dia do Trabalho"]
["2024-05-30","quinta-feira","Corpus Christi"]
["2024-09-07","sábado","Independência do Brasil"]
["2024-10-12","sábado","Nossa Sr.a Aparecida - Padroeira do Brasil"]
["2024-11-02","sábado","Finados"]
["2024-11-15","sexta-feira","Proclamação da República"]
["2024-11-20","quarta-feira","Dia Nacional de Zumbi e da Consciência Negra"]
["2024-12-25","quarta-feira","Natal"]
["2025-01-01","quarta-feira","Confraternização Universal"]
["2025-03-03","segunda-feira","Carnaval"]
["2025-03-04","terça-feira","Carnaval"]
["2025-04-18","sexta-feira","Paixão de Cristo"]
["2025-04-21","segunda-feira","Tiradentes"]
["2025-05-01","quinta-feira","Dia do Trabalho"]
["2025-06-19","quinta-feira","Corpus Christi"]
["2025-09-07","domingo","Independência do Brasil"]
["2025-10-12","domingo","Nossa Sr.a Aparecida - Padroeira do Brasil"]
["2025-11-02","domingo","Finados"]
["2025-11-15","sábado","Proclamação da República"]
["2025-11-20","quinta-feira","Dia Nacional de Zumbi e da Consciência Negra"]
["2025-12-25","quinta-feira","Natal"]
["2026-01-01","quinta-feira","Confraternização Universal"]
["2026-02-16","segunda-feira","Carnaval"]
["2026-02-17","terça-feira","Carnaval"]
["2026-04-03","sexta-feira","Paixão de Cristo"]
["2026-04-21","terça-feira","Tiradentes"]
["2026-05-01","sexta-feira","Dia do Trabalho"]
["2026-06-04","quinta-feira","Corpus Christi"]
["2026-09-07","segunda-feira","Independência do Brasil"]
["2026-10-12","segunda-feira","Nossa Sr.a Aparecida - Padroeira do Brasil"]
["2026-11-02","segunda-feira","Finados"]
["2026-11-15","domingo","Proclamação da República"]
["2026-11-20","sexta-feira","Dia Nacional de Zumbi e da Consciência Negra"]
["2026-12-25","sexta-feira","Natal"]
["2027-01-01","sexta-feira","Confraternização Universal"]
["2027-02-08","segunda-feira","Carnaval"]
["2027-02-09","terça-feira","Carnaval"]
["2027-03-26","sexta-feira","Paixão de Cristo"]
["2027-04-21","quarta-feira","Tiradentes"]
["2027-05-01","sábado","Dia do Trabalho"]
["2027-05-27","quinta-feira","Corpus Christi"]
["2027-09-07","terça-feira","Independência do Brasil"]
["2027-10-12","terça-feira","Nossa Sr.a Aparecida - Padroeira do Brasil"]
["2027-11-02","terça-feira","Finados"]
["2027-11-15","segunda-feira","Proclamação da República"]
["2027-11-20","sábado","Dia Nacional de Zumbi e da Consciência Negra"]
["2027-12-25","sábado","Natal"]
["2028-01-01","sábado","Confraternização Universal"]
["2028-02-28","segunda-feira","Carnaval"]
["2028-02-29","terça-feira","Carnaval"]
["2028-04-14","sexta-feira","Paixão de Cristo"]
["2028-04-21","sexta-feira","Tiradentes"]
["2028-05-01","segunda-feira","Dia do Trabalho"]
["2028-06-15","quinta-feira","Corpus Christi"]
["2028-09-07","quinta-feira","Independência do Brasil"]
["2028-10-12","quinta-feira","Nossa Sr.a Aparecida - Padroeira do Brasil"]
["2028-11-02","quinta-feira","Finados"]
["2028-11-15","quarta-feira","Proclamação da República"]
["2028-11-20","segunda-feira","Dia Nacional de Zumbi e da Consciência Negra"]
["2028-12-25","segunda-feira","Natal"]
["2029-01-01","segunda-feira","Confraternização Universal"]
["2029-02-12","segunda-feira","Carnaval"]
["2029-02-13","terça-feira","Carnaval"]
["2029-03-30","sexta-feira","Paixão de Cristo"]
["2029-04-21","sábado","Tiradentes"]
["2029-05-01","terça-feira","Dia do Trabalho"]
["2029-05-31","quinta-feira","Corpus Christi"]
["2029-09-07","sexta-feira","Independência do Brasil"]
["2029-10-12","sexta-feira","Nossa Sr.a Aparecida - Padroeira do Brasil"]
["2029-11-02","sexta-feira","Finados"]
["2029-11-15","quinta-feira","Proclamação da República"]
["2029-11-20","terça-feira","Dia Nacional de Zumbi e da Consciência Negra"]
["2029-12-25","terça-feira","Natal"]
["2030-01-01","terça-feira","Confraternização Universal"]
["2030-03-04","segunda-feira","Carnaval"]
["2030-03-05","terça-feira","Carnaval"]
["2030-04-19","sexta-feira","Paixão de Cristo"]
["2030-04-21","domingo","Tiradentes"]
["2030-05-01","quarta-feira","Dia do Trabalho"]
["2030-06-20","quinta-feira","Corpus Christi"]
["2030-09-07","sábado","Independência do Brasil"]
["2030-10-12","sábado","Nossa Sr.a Aparecida - Padroeira do Brasil"]
["2030-11-02","sábado","Finados"]
["2030-11-15","sexta-feira","Proclamação da República"]
["2030-11-20","quarta-feira","Dia Nacional de Zumbi e da Consciência Negra"]
["2030-12-25","quarta-feira","Natal"]
["2031-01-01","quarta-feira","Confraternização Universal"]
["2031-02-24","segunda-feira","Carnaval"]
["2031-02-25","terça-feira","Carnaval"]
["2031-04-11","sexta-feira","Paixão de Cristo"]
["2031-04-21","segunda-feira","Tiradentes"]
["2031-05-01","quinta-feira","Dia do Trabalho"]
["2031-06-12","quinta-feira","Corpus Christi"]
["2031-09-07","domingo","Independência do Brasil"]
["2031-10-12","domingo","Nossa Sr.a Aparecida - Padroeira do Brasil"]
["2031-11-02","domingo","Finados"]
["2031-11-15","sábado","Proclamação da República"]
["2031-11-20","quinta-feira","Dia Nacional de Zumbi e da Consciência Negra"]
["2031-12-25","quinta-feira","Natal"]
["2032-01-01","quinta-feira","Confraternização Universal"]
["2032-02-09","segunda-feira","Carnaval"]
["2032-02-10","terça-feira","Carnaval"]
["2032-03-26","sexta-feira","Paixão de Cristo"]
["2032-04-21","quarta-feira","Tiradentes"]
["2032-05-01","sábado","Dia do Trabalho"]
["2032-05-27","quinta-feira","Corpus Christi"]
["2032-09-07","terça-feira","Independência do Brasil"]
["2032-10-12","terça-feira","Nossa Sr.a Aparecida - Padroeira do Brasil"]
["2032-11-02","terça-feira","Finados"]
["2032-11-15","segunda-feira","Proclamação da República"]
["2032-11-20","sábado","Dia Nacional de Zumbi e da Consciência Negra"]
["2032-12-25","sábado","Natal"]
["2033-01-01","sábado","Confraternização Universal"]
["2033-02-28","segunda-feira","Carnaval"]
["2033-03-01","terça-feira","Carnaval"]
["2033-04-15","sexta-feira","Paixão de Cristo"]
["2033-04-21","quinta-feira","Tiradentes"]
["2033-05-01","domingo","Dia do Trabalho"]
["2033-06-16","quinta-feira","Corpus Christi"]
["2033-09-07","quarta-feira","Independência do Brasil"]
["2033-10-12","quarta-feira","Nossa Sr.a Aparecida - Padroeira do Brasil"]
["2033-11-02","quarta-feira","Finados"]
["2033-11-15","terça-feira","Proclamação da República"]
["2033-11-20","domingo","Dia Nacional de Zumbi e da Consciência Negra"]
["2033-12-25","domingo","Natal"]
["2034-01-01","domingo","Confraternização Universal"]
["2034-02-20","segunda-feira","Carnaval"]
["2034-02-21","terça-feira","Carnaval"]
["2034-04-07","sexta-feira","Paixão de Cristo"]
["2034-04-21","sexta-feira","Tiradentes"]
["2034-05-01","segunda-feira","Dia do Trabalho"]
["2034-06-08","quinta-feira","Corpus Christi"]
["2034-09-07","quinta-feira","Independência do Brasil"]
["2034-10-12","quinta-feira","Nossa Sr.a Aparecida - Padroeira do Brasil"]
["2034-11-02","quinta-feira","Finados"]
["2034-11-15","quarta-feira","Proclamação da República"]
["2034-11-20","segunda-feira","Dia Nacional de Zumbi e da Consciência Negra"]
["2034-12-25","segunda-feira","Natal"]
["2035-01-01","segunda-feira","Confraternização Universal"]
["2035-02-05","segunda-feira","Carnaval"]
["2035-02-06","terça-feira","Carnaval"]
["2035-03-23","sexta-feira","Paixão de Cristo"]
["2035-04-21","sábado","Tiradentes"]
["2035-05-01","terça-feira","Dia do Trabalho"]
["2035-05-24","quinta-feira","Corpus Christi"]
["2035-09-07","sexta-feira","Independência do Brasil"]
["2035-10-12","sexta-feira","Nossa Sr.a Aparecida - Padroeira do Brasil"]
["2035-11-02","sexta-feira","Finados"]
["2035-11-15","quinta-feira","Proclamação da República"]
["2035-11-20","terça-feira","Dia Nacional de Zumbi e da Consciência Negra"]
["2035-12-25","terça-feira","Natal"]
["2036-01-01","terça-feira","Confraternização Universal"]
["2036-02-25","segunda-feira","Carnaval"]
["2036-02-26","terça-feira","Carnaval"]
["2036-04-11","sexta-feira","Paixão de Cristo"]
["2036-04-21","segunda-feira","Tiradentes"]
["2036-05-01","quinta-feira","Dia do Trabalho"]
["2036-06-12","quinta-feira","Corpus Christi"]
["2036-09-07","domingo","Independência do Brasil"]
["2036-10-12","domingo","Nossa Sr.a Aparecida - Padroeira do Brasil"]
["2036-11-02","domingo","Finados"]
["2036-11-15","sábado","Proclamação da República"]
["2036-11-20","quinta-feira","Dia Nacional de Zumbi e da Consciência Negra"]
["2036-12-25","quinta-feira","Natal"]
["2037-01-01","quinta-feira","Confraternização Universal"]
["2037-02-16","segunda-feira","Carnaval"]
["2037-02-17","terça-feira","Carnaval"]
["2037-04-03","sexta-feira","Paixão de Cristo"]
["2037-04-21","terça-feira","Tiradentes"]
["2037-05-01","sexta-feira","Dia do Trabalho"]
["2037-06-04","quinta-feira","Corpus Christi"]
["2037-09-07","segunda-feira","Independência do Brasil"]
["2037-10-12","segunda-feira","Nossa Sr.a Aparecida - Padroeira do Brasil"]
["2037-11-02","segunda-feira","Finados"]
["2037-11-15","domingo","Proclamação da República"]
["2037-11-20","sexta-feira","Dia Nacional de Zumbi e da Consciência Negra"]
["2037-12-25","sexta-feira","Natal"]
["2038-01-01","sexta-feira","Confraternização Universal"]
["2038-03-08","segunda-feira","Carnaval"]
["2038-03-09","terça-feira","Carnaval"]
["2038-04-21","quarta-feira","Tiradentes"]
["2038-04-23","sexta-feira","Paixão de Cristo"]
["2038-05-01","sábado","Dia do Trabalho"]
["2038-06-24","quinta-feira","Corpus Christi"]
["2038-09-07","terça-feira","Independência do Brasil"]
["2038-10-12","terça-feira","Nossa Sr.a Aparecida - Padroeira do Brasil"]
["2038-11-02","terça-feira","Finados"]
["2038-11-15","segunda-feira","Proclamação da República"]
["2038-11-20","sábado","Dia Nacional de Zumbi e da Consciência Negra"]
["2038-12-25","sábado","Natal"]
["2039-01-01","sábado","Confraternização Universal"]
["2039-02-21","segunda-feira","Carnaval"]
["2039-02-22","terça-feira","Carnaval"]
["2039-04-08","sexta-feira","Paixão de Cristo"]
["2039-04-21","quinta-feira","Tiradentes"]
["2039-05-01","domingo","Dia do Trabalho"]
["2039-06-09","quinta-feira","Corpus Christi"]
["2039-09-07","quarta-feira","Independência do Brasil"]
["2039-10-12","quarta-feira","Nossa Sr.a Aparecida - Padroeira do Brasil"]
["2039-11-02","quarta-feira","Finados"]
["2039-11-15","terça-feira","Proclamação da República"]
["2039-11-20","domingo","Dia Nacional de Zumbi e da Consciência Negra"]
["2039-12-25","domingo","Natal"]
["2040-01-01","domingo","Confraternização Universal"]
["2040-02-13","segunda-feira","Carnaval"]
["2040-02-14","terça-feira","Carnaval"]
["2040-03-30","sexta-feira","Paixão de Cristo"]
["2040-04-21","sábado","Tiradentes"]
["2040-05-01","terça-feira","Dia do Trabalho"]
["2040-05-31","quinta-feira","Corpus Christi"]
["2040-09-07","sexta-feira","Independência do Brasil"]
["2040-10-12","sexta-feira","Nossa Sr.a Aparecida - Padroeira do Brasil"]
["2040-11-02","sexta-feira","Finados"]
["2040-11-15","quinta-feira","Proclamação da República"]
["2040-11-20","terça-feira","Dia Nacional de Zumbi e da Consciência Negra"]
["2040-12-25","terça-feira","Natal"]
["2041-01-01","terça-feira","Confraternização Universal"]
["2041-03-04","segunda-feira","Carnaval"]
["2041-03-05","terça-feira","Carnaval"]
["2041-04-19","sexta-feira","Paixão de Cristo"]
["2041-04-21","domingo","Tiradentes"]
["2041-05-01","quarta-feira","Dia do Trabalho"]
["2041-06-20","quinta-feira","Corpus Christi"]
["2041-09-07","sábado","Independência do Brasil"]
["2041-10-12","sábado","Nossa Sr.a Aparecida - Padroeira do Brasil"]
["2041-11-02","sábado","Finados"]
["2041-11-15","sexta-feira","Proclamação da República"]
["2041-11-20","quarta-feira","Dia Nacional de Zumbi e da Consciência Negra"]
["2041-12-25","quarta-feira","Natal"]
["2042-01-01","quarta-feira","Confraternização Universal"]
["2042-02-17","segunda-feira","Carnaval"]
["2042-02-18","terça-feira","Carnaval"]
["2042-04-04","sexta-feira","Paixão de Cristo"]
["2042-04-21","segunda-feira","Tiradentes"]
["2042-05-01","quinta-feira","Dia do Trabalho"]
["2042-06-05","quinta-feira","Corpus Christi"]
["2042-09-07","domingo","Independência do Brasil"]
["2042-10-12","domingo","Nossa Sr.a Aparecida - Padroeira do Brasil"]
["2042-11-02","domingo","Finados"]
["2042-11-15","sábado","Proclamação da República"]
["2042-11-20","quinta-feira","Dia Nacional de Zumbi e da Consciência Negra"]
["2042-12-25","quinta-feira","Natal"]
["2043-01-01","quinta-feira","Confraternização Universal"]
["2043-02-09","segunda-feira","Carnaval"]
["2043-02-10","terça-feira","Carnaval"]
["2043-03-27","sexta-feira","Paixão de Cristo"]
["2043-04-21","terça-feira","Tiradentes"]
["2043-05-01","sexta-feira","Dia do Trabalho"]
["2043-05-28","quinta-feira","Corpus Christi"]
["2043-09-07","segunda-feira","Independência do Brasil"]
["2043-10-12","segunda-feira","Nossa Sr.a Aparecida - Padroeira do Brasil"]
["2043-11-02","segunda-feira","Finados"]
["2043-11-15","domingo","Proclamação da República"]
["2043-11-20","sexta-feira","Dia Nacional de Zumbi e da Consciência Negra"]
["2043-12-25","sexta-feira","Natal"]
["2044-01-01","sexta-feira","Confraternização Universal"]
["2044-02-29","segunda-feira","Carnaval"]
["2044-03-01","terça-feira","Carnaval"]
["2044-04-15","sexta-feira","Paixão de Cristo"]
["2044-04-21","quinta-feira","Tiradentes"]
["2044-05-01","domingo","Dia do Trabalho"]
["2044-06-16","quinta-feira","Corpus Christi"]
["2044-09-07","quarta-feira","Independência do Brasil"]
["2044-10-12","quarta-feira","Nossa Sr.a Aparecida - Padroeira do Brasil"]
["2044-11-02","quarta-feira","Finados"]
["2044-11-15","terça-feira","Proclamação da República"]
["2044-11-20","domingo","Dia Nacional de Zumbi e da Consciência Negra"]
["2044-12-25","domingo","Natal"]
["2045-01-01","domingo","Confraternização Universal"]
["2045-02-20","segunda-feira","Carnaval"]
["2045-02-21","terça-feira","Carnaval"]
["2045-04-07","sexta-feira","Paixão de Cristo"]
["2045-04-21","sexta-feira","Tiradentes"]
["2045-05-01","segunda-feira","Dia do Trabalho"]
["2045-06-08","quinta-feira","Corpus Christi"]
["2045-09-07","quinta-feira","Independência do Brasil"]
["2045-10-12","quinta-feira","Nossa Sr.a Aparecida - Padroeira do Brasil"]
["2045-11-02","quinta-feira","Finados"]
["2045-11-15","quarta-feira","Proclamação da República"]
["2045-11-20","segunda-feira","Dia Nacional de Zumbi e da Consciência Negra"]
["2045-12-25","segunda-feira","Natal"]
["2046-01-01","segunda-feira","Confraternização Universal"]
["2046-02-05","segunda-feira","Carnaval"]
["2046-02-06","terça-feira","Carnaval"]
["2046-03-23","sexta-feira","Paixão de Cristo"]
["2046-04-21","sábado","Tiradentes"]
["2046-05-01","terça-feira","Dia do Trabalho"]
["2046-05-24","quinta-feira","Corpus Christi"]
["2046-09-07","sexta-feira","Independência do Brasil"]
["2046-10-12","sexta-feira","Nossa Sr.a Aparecida - Padroeira do Brasil"]
["2046-11-02","sexta-feira","Finados"]
["2046-11-15","quinta-feira","Proclamação da República"]
["2046-11-20","terça-feira","Dia Nacional de Zumbi e da Consciência Negra"]
["2046-12-25","terça-feira","Natal"]
["2047-01-01","terça-feira","Confraternização Universal"]
["2047-02-25","segunda-feira","Carnaval"]
["2047-02-26","terça-feira","Carnaval"]
["2047-04-12","sexta-feira","Paixão de Cristo"]
["2047-04-21","domingo","Tiradentes"]
["2047-05-01","quarta-feira","Dia do Trabalho"]
["2047-06-13","quinta-feira","Corpus Christi"]
["2047-09-07","sábado","Independência do Brasil"]
["2047-10-12","sábado","Nossa Sr.a Aparecida - Padroeira do Brasil"]
["2047-11-02","sábado","Finados"]
["2047-11-15","sexta-feira","Proclamação da República"]
["2047-11-20","quarta-feira","Dia Nacional de Zumbi e da Consciência Negra"]
["2047-12-25","quarta-feira","Natal"]
["2048-01-01","quarta-feira","Confraternização Universal"]
["2048-02-17","segunda-feira","Carnaval"]
["2048-02-18","terça-feira","Carnaval"]
["2048-04-03","sexta-feira","Paixão de Cristo"]
["2048-04-21","terça-feira","Tiradentes"]
["2048-05-01","sexta-feira","Dia do Trabalho"]
["2048-06-04","quinta-feira","Corpus Christi"]
["2048-09-07","segunda-feira","Independência do Brasil"]
["2048-10-12","segunda-feira","Nossa Sr.a Aparecida - Padroeira do Brasil"]
["2048-11-02","segunda-feira","Finados"]
["2048-11-15","domingo","Proclamação da República"]
["2048-11-20","sexta-feira","Dia Nacional de Zumbi e da Consciência Negra"]
["2048-12-25","sexta-feira","Natal"]
["2049-01-01","sexta-feira","Confraternização Universal"]
["2049-03-01","segunda-feira","Carnaval"]
["2049-03-02","terça-feira","Carnaval"]
["2049-04-16","sexta-feira","Paixão de Cristo"]
["2049-04-21","quarta-feira","Tiradentes"]
["2049-05-01","sábado","Dia do Trabalho"]
["2049-06-17","quinta-feira","Corpus Christi"]
["2049-09-07","terça-feira","Independência do Brasil"]
["2049-10-12","terça-feira","Nossa Sr.a Aparecida - Padroeira do Brasil"]
["2049-11-02","terça-feira","Finados"]
["2049-11-15","segunda-feira","Proclamação da República"]
["2049-11-20","sábado","Dia Nacional de Zumbi e da Consciência Negra"]
["2049-12-25","sábado","Natal"]
["2050-01-01","sábado","Confraternização Universal"]
["2050-02-21","segunda-feira","Carnaval"]
["2050-02-22","terça-feira","Carnaval"]
["2050-04-08","sexta-feira","Paixão de Cristo"]
["2050-04-21","quinta-feira","Tiradentes"]
["2050-05-01","domingo","Dia do Trabalho"]
["2050-06-09","quinta-feira","Corpus Christi"]
["2050-09-07","quarta-feira","Independência do Brasil"]
["2050-10-12","quarta-feira","Nossa Sr.a Aparecida - Padroeira do Brasil"]
["2050-11-02","quarta-feira","Finados"]
["2050-11-15","terça-feira","Proclamação da República"]
["2050-11-20","domingo","Dia Nacional de Zumbi e da Consciência Negra"]
["2050-12-25","domingo","Natal"]
["2051-01-01","domingo","Confraternização Universal"]
["2051-02-13","segunda-feira","Carnaval"]
["2051-02-14","terça-feira","Carnaval"]
["2051-03-31","sexta-feira","Paixão de Cristo"]
["2051-04-21","sexta-feira","Tiradentes"]
["2051-05-01","segunda-feira","Dia do Trabalho"]
["2051-06-01","quinta-feira","Corpus Christi"]
["2051-09-07","quinta-feira","Independência do Brasil"]
["2051-10-12","quinta-feira","Nossa Sr.a Aparecida - Padroeira do Brasil"]
["2051-11-02","quinta-feira","Finados"]
["2051-11-15","quarta-feira","Proclamação da República"]
["2051-11-20","segunda-feira","Dia Nacional de Zumbi e da Consciência Negra"]
["2051-12-25","segunda-feira","Natal"]
["2052-01-01","segunda-feira","Confraternização Universal"]
["2052-03-04","segunda-feira","Carnaval"]
["2052-03-05","terça-feira","Carnaval"]
["2052-04-19","sexta-feira","Paixão de Cristo"]
["2052-04-21","domingo","Tiradentes"]
["2052-05-01","quarta-feira","Dia do Trabalho"]
["2052-06-20","quinta-feira","Corpus Christi"]
["2052-09-07","sábado","Independência do Brasil"]
["2052-10-12","sábado","Nossa Sr.a Aparecida - Padroeira do Brasil"]
["2052-11-02","sábado","Finados"]
["2052-11-15","sexta-feira","Proclamação da República"]
["2052-11-20","quarta-feira","Dia Nacional de Zumbi e da Consciência Negra"]
["2052-12-25","quarta-feira","Natal"]
["2053-01-01","quarta-feira","Confraternização Universal"]
["2053-02-17","segunda-feira","Carnaval"]
["2053-02-18","terça-feira","Carnaval"]
["2053-04-04","sexta-feira","Paixão de Cristo"]
["2053-04-21","segunda-feira","Tiradentes"]
["2053-05-01","quinta-feira","Dia do Trabalho"]
["2053-06-05","quinta-feira","Corpus Christi"]
["2053-09-07","domingo","Independência do Brasil"]
["2053-10-12","domingo","Nossa Sr.a Aparecida - Padroeira do Brasil"]
["2053-11-02","domingo","Finados"]
["2053-11-15","sábado","Proclamação da República"]
["2053-11-20","quinta-feira","Dia Nacional de Zumbi e da Consciência Negra"]
["2053-12-25","quinta-feira","Natal"]
["2054-01-01","quinta-feira","Confraternização Universal"]
["2054-02-09","segunda-feira","Carnaval"]
["2054-02-10","terça-feira","Carnaval"]
["2054-03-27","sexta-feira","Paixão de Cristo"]
["2054-04-21","terça-feira","Tiradentes"]
["2054-05-01","sexta-feira","Dia do Trabalho"]
["2054-05-28","quinta-feira","Corpus Christi"]
["2054-09-07","segunda-feira","Independência do Brasil"]
["2054-10-12","segunda-feira","Nossa Sr.a Aparecida - Padroeira do Brasil"]
["2054-11-02","segunda-feira","Finados"]
["2054-11-15","domingo","Proclamação da República"]
["2054-11-20","sexta-feira","Dia Nacional de Zumbi e da Consciência Negra"]
["2054-12-25","sexta-feira","Natal"]
["2055-01-01","sexta-feira","Confraternização Universal"]
["2055-03-01","segunda-feira","Carnaval"]
["2055-03-02","terça-feira","Carnaval"]
["2055-04-16","sexta-feira","Paixão de Cristo"]
["2055-04-21","quarta-feira","Tiradentes"]
["2055-05-01","sábado","Dia do Trabalho"]
["2055-06-17","quinta-feira","Corpus Christi"]
["2055-09-07","terça-feira","Independência do Brasil"]
["2055-10-12","terça-feira","Nossa Sr.a Aparecida - Padroeira do Brasil"]
["2055-11-02","terça-feira","Finados"]
["2055-11-15","segunda-feira","Proclamação da República"]
["2055-11-20","sábado","Dia Nacional de Zumbi e da Consciência Negra"]
["2055-12-25","sábado","Natal"]
["2056-01-01","sábado","Confraternização Universal"]
["2056-02-14","segunda-feira","Carnaval"]
["2056-02-15","terça-feira","Carnaval"]
["2056-03-31","sexta-feira","Paixão de Cristo"]
["2056-04-21","sexta-feira","Tiradentes"]
["2056-05-01","segunda-feira","Dia do Trabalho"]
["2056-06-01","quinta-feira","Corpus Christi"]
["2056-09-07","quinta-feira","Independência do Brasil"]
["2056-10-12","quinta-feira","Nossa Sr.a Aparecida - Padroeira do Brasil"]
["2056-11-02","quinta-feira","Finados"]
["2056-11-15","quarta-feira","Proclamação da República"]
["2056-11-20","segunda-feira","Dia Nacional de Zumbi e da Consciência Negra"]
["2056-12-25","segunda-feira","Natal"]
["2057-01-01","segunda-feira","Confraternização Universal"]
["2057-03-05","segunda-feira","Carnaval"]
["2057-03-06","terça-feira","Carnaval"]
["2057-04-20","sexta-feira","Paixão de Cristo"]
["2057-04-21","sábado","Tiradentes"]
["2057-05-01","terça-feira","Dia do Trabalho"]
["2057-06-21","quinta-feira","Corpus Christi"]
["2057-09-07","sexta-feira","Independência do Brasil"]
["2057-10-12","sexta-feira","Nossa Sr.a Aparecida - Padroeira do Brasil"]
["2057-11-02","sexta-feira","Finados"]
["2057-11-15","quinta-feira","Proclamação da República"]
["2057-11-20","terça-feira","Dia Nacional de Zumbi e da Consciência Negra"]
["2057-12-25","terça-feira","Natal"]
["2058-01-01","terça-feira","Confraternização Universal"]
["2058-02-25","segunda-feira","Carnaval"]
["2058-02-26","terça-feira","Carnaval"]
["2058-04-12","sexta-feira","Paixão de Cristo"]
["2058-04-21","domingo","Tiradentes"]
["2058-05-01","quarta-feira","Dia do Trabalho"]
["2058-06-13","quinta-feira","Corpus Christi"]
["2058-09-07","sábado","Independência do Brasil"]
["2058-10-12","sábado","Nossa Sr.a Aparecida - Padroeira do Brasil"]
["2058-11-02","sábado","Finados"]
["2058-11-15","sexta-feira","Proclamação da República"]
["2058-11-20","quarta-feira","Dia Nacional de Zumbi e da Consciência Negra"]
["2058-12-25","quarta-feira","Natal"]
["2059-01-01","quarta-feira","Confraternização Universal"]
["2059-02-10","segunda-feira","Carnaval"]
["2059-02-11","terça-feira","Carnaval"]
["2059-03-28","sexta-feira","Paixão de Cristo"]
["2059-04-21","segunda-feira","Tiradentes"]
["2059-05-01","quinta-feira","Dia do Trabalho"]
["2059-05-29","quinta-feira","Corpus Christi"]
["2059-09-07","domingo","Independência do Brasil"]
["2059-10-12","domingo","Nossa Sr.a Aparecida - Padroeira do Brasil"]
["2059-11-02","domingo","Finados"]
["2059-11-15","sábado","Proclamação da República"]
["2059-11-20","quinta-feira","Dia Nacional de Zumbi e da Consciência Negra"]
["2059-12-25","quinta-feira","Natal"]
["2060-01-01","quinta-feira","Confraternização Universal"]
["2060-03-01","segunda-feira","Carnaval"]
["2060-03-02","terça-feira","Carnaval"]
["2060-04-16","sexta-feira","Paixão de Cristo"]
["2060-04-21","quarta-feira","Tiradentes"]
["2060-05-01","sábado","Dia do Trabalho"]
["2060-06-17","quinta-feira","Corpus Christi"]
["2060-09-07","terça-feira","Independência do Brasil"]
["2060-10-12","terça-feira","Nossa Sr.a Aparecida - Padroeira do Brasil"]
["2060-11-02","terça-feira","Finados"]
["2060-11-15","segunda-feira","Proclamação da República"]
["2060-11-20","sábado","Dia Nacional de Zumbi e da Consciência Negra"]
["2060-12-25","sábado","Natal"]
["2061-01-01","sábado","Confraternização Universal"]
["2061-02-21","segunda-feira","Carnaval"]
["2061-02-22","terça-feira","Carnaval"]
["2061-04-08","sexta-feira","Paixão de Cristo"]
["2061-04-21","quinta-feira","Tiradentes"]
["2061-05-01","domingo","Dia do Trabalho"]
["2061-06-09","quinta-feira","Corpus Christi"]
["2061-09-07","quarta-feira","Independência do Brasil"]
["2061-10-12","quarta-feira","Nossa Sr.a Aparecida - Padroeira do Brasil"]
["2061-11-02","quarta-feira","Finados"]
["2061-11-15","terça-feira","Proclamação da República"]
["2061-11-20","domingo","Dia Nacional de Zumbi e da Consciência Negra"]
["2061-12-25","domingo","Natal"]
["2062-01-01","domingo","Confraternização Universal"]
["2062-02-06","segunda-feira","Carnaval"]
["2062-02-07","terça-feira","Carnaval"]
["2062-03-24","sexta-feira","Paixão de Cristo"]
["2062-04-21","sexta-feira","Tiradentes"]
["2062-05-01","segunda-feira","Dia do Trabalho"]
["2062-05-25","quinta-feira","Corpus Christi"]
["2062-09-07","quinta-feira","Independência do Brasil"]
["2062-10-12","quinta-feira","Nossa Sr.a Aparecida - Padroeira do Brasil"]
["2062-11-02","quinta-feira","Finados"]
["2062-11-15","quarta-feira","Proclamação da República"]
["2062-11-20","segunda-feira","Dia Nacional de Zumbi e da Consciência Negra"]
["2062-12-25","segunda-feira","Natal"]
["2063-01-01","segunda-feira","Confraternização Universal"]
["2063-02-26","segunda-feira","Carnaval"]
["2063-02-27","terça-feira","Carnaval"]
["2063-04-13","sexta-feira","Paixão de Cristo"]
["2063-04-21","sábado","Tiradentes"]
["2063-05-01","terça-feira","Dia do Trabalho"]
["2063-06-14","quinta-feira","Corpus Christi"]
["2063-09-07","sexta-feira","Independência do Brasil"]
["2063-10-12","sexta-feira","Nossa Sr.a Aparecida - Padroeira do Brasil"]
["2063-11-02","sexta-feira","Finados"]
["2063-11-15","quinta-feira","Proclamação da República"]
["2063-11-20","terça-feira","Dia Nacional de Zumbi e da Consciência Negra"]
["2063-12-25","terça-feira","Natal"]
["2064-01-01","terça-feira","Confraternização Universal"]
["2064-02-18","segunda-feira","Carnaval"]
["2064-02-19","terça-feira","Carnaval"]
["2064-04-04","sexta-feira","Paixão de Cristo"]
["2064-04-21","segunda-feira","Tiradentes"]
["2064-05-01","quinta-feira","Dia do Trabalho"]
["2064-06-05","quinta-feira","Corpus Christi"]
["2064-09-07","domingo","Independência do Brasil"]
["2064-10-12","domingo","Nossa Sr.a Aparecida - Padroeira do Brasil"]
["2064-11-02","domingo","Finados"]
["2064-11-15","sábado","Proclamação da República"]
["2064-11-20","quinta-feira","Dia Nacional de Zumbi e da Consciência Negra"]
["2064-12-25","quinta-feira","Natal"]
["2065-01-01","quinta-feira","Confraternização Universal"]
["2065-02-09","segunda-feira","Carnaval"]
["2065-02-10","terça-feira","Carnaval"]
["2065-03-27","sexta-feira","Paixão de Cristo"]
["2065-04-21","terça-feira","Tiradentes"]
["2065-05-01","sexta-feira","Dia do Trabalho"]
["2065-05-28","quinta-feira","Corpus Christi"]
["2065-09-07","segunda-feira","Independência do Brasil"]
["2065-10-12","segunda-feira","Nossa Sr.a Aparecida - Padroeira do Brasil"]
["2065-11-02","segunda-feira","Finados"]
["2065-11-15","domingo","Proclamação da República"]
["2065-11-20","sexta-feira","Dia Nacional de Zumbi e da Consciência Negra"]
["2065-12-25","sexta-feira","Natal"]
["2066-01-01","sexta-feira","Confraternização Universal"]
["2066-02-22","segunda-feira","Carnaval"]
["2066-02-23","terça-feira","Carnaval"]
["2066-04-09","sexta-feira","Paixão de Cristo"]
["2066-04-21","quarta-feira","Tiradentes"]
["2066-05-01","sábado","Dia do Trabalho"]
["2066-06-10","quinta-feira","Corpus Christi"]
["2066-09-07","terça-feira","Independência do Brasil"]
["2066-10-12","terça-feira","Nossa Sr.a Aparecida - Padroeira do Brasil"]
["2066-11-02","terça-feira","Finados"]
["2066-11-15","segunda-feira","Proclamação da República"]
["2066-11-20","sábado","Dia Nacional de Zumbi e da Consciência Negra"]
["2066-12-25","sábado","Natal"]
["2067-01-01","sábado","Confraternização Universal"]
["2067-02-14","segunda-feira","Carnaval"]
["2067-02-15","terça-feira","Carnaval"]
["2067-04-01","sexta-feira","Paixão de Cristo"]
["2067-04-21","quinta-feira","Tiradentes"]
["2067-05-01","domingo","Dia do Trabalho"]
["2067-06-02","quinta-feira","Corpus Christi"]
["2067-09-07","quarta-feira","Independência do Brasil"]
["2067-10-12","quarta-feira","Nossa Sr.a Aparecida - Padroeira do Brasil"]
["2067-11-02","quarta-feira","Finados"]
["2067-11-15","terça-feira","Proclamação da República"]
["2067-11-20","domingo","Dia Nacional de Zumbi e da Consciência Negra"]
["2067-12-25","domingo","Natal"]
["2068-01-01","domingo","Confraternização Universal"]
["2068-03-05","segunda-feira","Carnaval"]
["2068-03-06","terça-feira","Carnaval"]
["2068-04-20","sexta-feira","Paixão de Cristo"]
["2068-04-21","sábado","Tiradentes"]
["2068-05-01","terça-feira","Dia do Trabalho"]
["2068-06-21","quinta-feira","Corpus Christi"]
["2068-09-07","sexta-feira","Independência do Brasil"]
["2068-10-12","sexta-feira","Nossa Sr.a Aparecida - Padroeira do Brasil"]
["2068-11-02","sexta-feira","Finados"]
["2068-11-15","quinta-feira","Proclamação da República"]
["2068-11-20","terça-feira","Dia Nacional de Zumbi e da Consciência Negra"]
["2068-12-25","terça-feira","Natal"]
["2069-01-01","terça-feira","Confraternização Universal"]
["2069-02-25","segunda-feira","Carnaval"]
["2069-02-26","terça-feira","Carnaval"]
["2069-04-12","sexta-feira","Paixão de Cristo"]
["2069-04-21","domingo","Tiradentes"]
["2069-05-01","quarta-feira","Dia do Trabalho"]
["2069-06-13","quinta-feira","Corpus Christi"]
["2069-09-07","sábado","Independência do Brasil"]
["2069-10-12","sábado","Nossa Sr.a Aparecida - Padroeira do Brasil"]
["2069-11-02","sábado","Finados"]
["2069-11-15","sexta-feira","Proclamação da República"]
["2069-11-20","quarta-feira","Dia Nacional de Zumbi e da Consciência Negra"]
["2069-12-25","quarta-feira","Natal"]
["2070-01-01","quarta-feira","Confraternização Universal"]
["2070-02-10","segunda-feira","Carnaval"]
["2070-02-11","terça-feira","Carnaval"]
["2070-03-28","sexta-feira","Paixão de Cristo"]
["2070-04-21","segunda-feira","Tiradentes"]
["2070-05-01","quinta-feira","Dia do Trabalho"]
["2070-05-29","quinta-feira","Corpus Christi"]
["2070-09-07","domingo","Independência do Brasil"]
["2070-10-12","domingo","Nossa Sr.a Aparecida - Padroeira do Brasil"]
["2070-11-02","domingo","Finados"]
["2070-11-15","sábado","Proclamação da República"]
["2070-11-20","quinta-feira","Dia Nacional de Zumbi e da Consciência Negra"]
["2070-12-25","quinta-feira","Natal"]
["2071-01-01","quinta-feira","Confraternização Universal"]
["2071-03-02","segunda-feira","Carnaval"]
["2071-03-03","terça-feira","Carnaval"]
["2071-04-17","sexta-feira","Paixão de Cristo"]
["2071-04-21","terça-feira","Tiradentes"]
["2071-05-01","sexta-feira","Dia do Trabalho"]
["2071-06-18","quinta-feira","Corpus Christi"]
["2071-09-07","segunda-feira","Independência do Brasil"]
["2071-10-12","segunda-feira","Nossa Sr.a Aparecida - Padroeira do Brasil"]
["2071-11-02","segunda-feira","Finados"]
["2071-11-15","domingo","Proclamação da República"]
["2071-11-20","sexta-feira","Dia Nacional de Zumbi e da Consciência Negra"]
["2071-12-25","sexta-feira","Natal"]
["2072-01-01","sexta-feira","Confraternização Universal"]
["2072-02-22","segunda-feira","Carnaval"]
["2072-02-23","terça-feira","Carnaval"]
["2072-04-08","sexta-feira","Paixão de Cristo"]
["2072-04-21","quinta-feira","Tiradentes"]
["2072-05-01","domingo","Dia do Trabalho"]
["2072-06-09","quinta-feira","Corpus Christi"]
["2072-09-07","quarta-feira","Independência do Brasil"]
["2072-10-12","quarta-feira","Nossa Sr.a Aparecida - Padroeira do Brasil"]
["2072-11-02","quarta-feira","Finados"]
["2072-11-15","terça-feira","Proclamação da República"]
["2072-11-20","domingo","Dia Nacional de Zumbi e da Consciência Negra"]
["2072-12-25","domingo","Natal"]
["2073-01-01","domingo","Confraternização Universal"]
["2073-02-06","segunda-feira","Carnaval"]
["2073-02-07","terça-feira","Carnaval"]
["2073-03-24","sexta-feira","Paixão de Cristo"]
["2073-04-21","sexta-feira","Tiradentes"]
["2073-05-01","segunda-feira","Dia do Trabalho"]
["2073-05-25","quinta-feira","Corpus Christi"]
["2073-09-07","quinta-feira","Independência do Brasil"]
["2073-10-12","quinta-feira","Nossa Sr.a Aparecida - Padroeira do Brasil"]
["2073-11-02","quinta-feira","Finados"]
["2073-11-15","quarta-feira","Proclamação da República"]
["2073-11-20","segunda-feira","Dia Nacional de Zumbi e da Consciência Negra"]
["2073-12-25","segunda-feira","Natal"]
["2074-01-01","segunda-feira","Confraternização Universal"]
["2074-02-26","segunda-feira","Carnaval"]
["2074-02-27","terça-feira","Carnaval"]
["2074-04-13","sexta-feira","Paixão de Cristo"]
["2074-04-21","sábado","Tiradentes"]
["2074-05-01","terça-feira","Dia do Trabalho"]
["2074-06-14","quinta-feira","Corpus Christi"]
["2074-09-07","sexta-feira","Independência do Brasil"]
["2074-10-12","sexta-feira","Nossa Sr.a Aparecida - Padroeira do Brasil"]
["2074-11-02","sexta-feira","Finados"]
["2074-11-15","quinta-feira","Proclamação da República"]
["2074-11-20","terça-feira","Dia Nacional de Zumbi e da Consciência Negra"]
["2074-12-25","terça-feira","Natal"]
["2075-01-01","terça-feira","Confraternização Universal"]
["2075-02-18","segunda-feira","Carnaval"]
["2075-02-19","terça-feira","Carnaval"]
["2075-04-05","sexta-feira","Paixão de Cristo"]
["2075-04-21","domingo","Tiradentes"]
["2075-05-01","quarta-feira","Dia do Trabalho"]
["2075-06-06","quinta-feira","Corpus Christi"]
["2075-09-07","sábado","Independência do Brasil"]
["2075-10-12","sábado","Nossa Sr.a Aparecida - Padroeira do Brasil"]
["2075-11-02","sábado","Finados"]
["2075-11-15","sexta-feira","Proclamação da República"]
["2075-11-20","quarta-feira","Dia Nacional de Zumbi e da Consciência Negra"]
["2075-12-25","quarta-feira","Natal"]
["2076-01-01","quarta-feira","Confraternização Universal"]
["2076-03-02","segunda-feira","Carnaval"]
["2076-03-03","terça-feira","Carnaval"]
["2076-04-17","sexta-feira","Paixão de Cristo"]
["2076-04-21","terça-feira","Tiradentes"]
["2076-05-01","sexta-feira","Dia do Trabalho"]
["2076-06-18","quinta-feira","Corpus Christi"]
["2076-09-07","segunda-feira","Independência do Brasil"]
["2076-10-12","segunda-feira","Nossa Sr.a Aparecida - Padroeira do Brasil"]
["2076-11-02","segunda-feira","Finados"]
["2076-11-15","domingo","Proclamação da República"]
["2076-11-20","sexta-feira","Dia Nacional de Zumbi e da Consciência Negra"]
["2076-12-25","sexta-feira","Natal"]
["2077-01-01","sexta-feira","Confraternização Universal"]
["2077-02-22","segunda-feira","Carnaval"]
["2077-02-23","terça-feira","Carnaval"]
["2077-04-09","sexta-feira","Paixão de Cristo"]
["2077-04-21","quarta-feira","Tiradentes"]
["2077-05-01","sábado","Dia do Trabalho"]
["2077-06-10","quinta-feira","Corpus Christi"]
["2077-09-07","terça-feira","Independência do Brasil"]
["2077-10-12","terça-feira","Nossa Sr.a Aparecida - Padroeira do Brasil"]
["2077-11-02","terça-feira","Finados"]
["2077-11-15","segunda-feira","Proclamação da República"]
["2077-11-20","sábado","Dia Nacional de Zumbi e da Consciência Negra"]
["2077-12-25","sábado","Natal"]
["2078-01-01","sábado","Confraternização Universal"]
["2078-02-14","segunda-feira","Carnaval"]
["2078-02-15","terça-feira","Carnaval"]
["2078-04-01","sexta-feira","Paixão de Cristo"]
["2078-04-21","quinta-feira","Tiradentes"]
["2078-05-01","domingo","Dia do Trabalho"]
["2078-06-02","quinta-feira","Corpus Christi"]
["2078-09-07","quarta-feira","Independência do Brasil"]
["2078-10-12","quarta-feira","Nossa Sr.a Aparecida - Padroeira do Brasil"]
["2078-11-02","quarta-feira","Finados"]
["2078-11-15","terça-feira","Proclamação da República"]
["2078-11-20","domingo","Dia Nacional de Zumbi e da Consciência Negra"]
["2078-12-25","domingo","Natal"]
["2079-01-01","domingo","Confraternização Universal"]
["2079-03-06","segunda-feira","Carnaval"]
["2079-03-07","terça-feira","Carnaval"]
["2079-04-21","sexta-feira","Paixão de Cristo"]
["2079-04-21","sexta-feira","Tiradentes"]
["2079-05-01","segunda-feira","Dia do Trabalho"]
["2079-06-22","quinta-feira","Corpus Christi"]
["2079-09-07","quinta-feira","Independência do Brasil"]
["2079-10-12","quinta-feira","Nossa Sr.a Aparecida - Padroeira do Brasil"]
["2079-11-02","quinta-feira","Finados"]
["2079-11-15","quarta-feira","Proclamação da República"]
["2079-11-20","segunda-feira","Dia Nacional de Zumbi e da Consciência Negra"]
["2079-12-25","segunda-feira","Natal"]
["2080-01-01","segunda-feira","Confraternização Universal"]
["2080-02-19","segunda-feira","Carnaval"]
["2080-02-20","terça-feira","Carnaval"]
["2080-04-05","sexta-feira","Paixão de Cristo"]
["2080-04-21","domingo","Tiradentes"]
["2080-05-01","quarta-feira","Dia do Trabalho"]
["2080-06-06","quinta-feira","Corpus Christi"]
["2080-09-07","sábado","Independência do Brasil"]
["2080-10-12","sábado","Nossa Sr.a Aparecida - Padroeira do Brasil"]
["2080-11-02","sábado","Finados"]
["2080-11-15","sexta-feira","Proclamação da República"]
["2080-11-20","quarta-feira","Dia Nacional de Zumbi e da Consciência Negra"]
["2080-12-25","quarta-feira","Natal"]
["2081-01-01","quarta-feira","Confraternização Universal"]
["2081-02-10","segunda-feira","Carnaval"]
["2081-02-11","terça-feira","Carnaval"]
["2081-03-28","sexta-feira","Paixão de Cristo"]
["2081-04-21","segunda-feira","Tiradentes"]
["2081-05-01","quinta-feira","Dia do Trabalho"]
["2081-05-29","quinta-feira","Corpus Christi"]
["2081-09-07","domingo","Independência do Brasil"]
["2081-10-12","domingo","Nossa Sr.a Aparecida - Padroeira do Brasil"]
["2081-11-02","domingo","Finados"]
["2081-11-15","sábado","Proclamação da República"]
["2081-11-20","quinta-feira","Dia Nacional de Zumbi e da Consciência Negra"]
["2081-12-25","quinta-feira","Natal"]
["2082-01-01","quinta-feira","Confraternização Universal"]
["2082-03-02","segunda-feira","Carnaval"]
["2082-03-03","terça-feira","Carnaval"]
["2082-04-17","sexta-feira","Paixão de Cristo"]
["2082-04-21","terça-feira","Tiradentes"]
["2082-05-01","sexta-feira","Dia do Trabalho"]
["2082-06-18","quinta-feira","Corpus Christi"]
["2082-09-07","segunda-feira","Independência do Brasil"]
["2082-10-12","segunda-feira","Nossa Sr.a Aparecida - Padroeira do Brasil"]
["2082-11-02","segunda-feira","Finados"]
["2082-11-15","domingo","Proclamação da República"]
["2082-11-20","sexta-feira","Dia Nacional de Zumbi e da Consciência Negra"]
["2082-12-25","sexta-feira","Natal"]
["2083-01-01","sexta-feira","Confraternização Universal"]
["2083-02-15","segunda-feira","Carnaval"]
["2083-02-16","terça-feira","Carnaval"]
["2083-04-02","sexta-feira","Paixão de Cristo"]
["2083-04-21","quarta-feira","Tiradentes"]
["2083-05-01","sábado","Dia do Trabalho"]
["2083-06-03","quinta-feira","Corpus Christi"]
["2083-09-07","terça-feira","Independência do Brasil"]
["2083-10-12","terça-feira","Nossa Sr.a Aparecida - Padroeira do Brasil"]
["2083-11-02","terça-feira","Finados"]
["2083-11-15","segunda-feira","Proclamação da República"]
["2083-11-20","sábado","Dia Nacional de Zumbi e da Consciência Negra"]
["2083-12-25","sábado","Natal"]
["2084-01-01","sábado","Confraternização Universal"]
["2084-02-07","segunda-feira","Carnaval"]
["2084-02-08","terça-feira","Carnaval"]
["2084-03-24","sexta-feira","Paixão de Cristo"]
["2084-04-21","sexta-feira","Tiradentes"]
["2084-05-01","segunda-feira","Dia do Trabalho"]
["2084-05-25","quinta-feira","Corpus Christi"]
["2084-09-07","quinta-feira","Independência do Brasil"]
["2084-10-12","quinta-feira","Nossa Sr.a Aparecida - Padroeira do Brasil"]
["2084-11-02","quinta-feira","Finados"]
["2084-11-15","quarta-feira","Proclamação da República"]
["2084-11-20","segunda-feira","Dia Nacional de Zumbi e da Consciência Negra"]
["2084-12-25","segunda-feira","Natal"]
["2085-01-01","segunda-feira","Confraternização Universal"]
["2085-02-26","segunda-feira","Carnaval"]
["2085-02-27","terça-feira","Carnaval"]
["2085-04-13","sexta-feira","Paixão de Cristo"]
["2085-04-21","sábado","Tiradentes"]
["2085-05-01","terça-feira","Dia do Trabalho"]
["2085-06-14","quinta-feira","Corpus Christi"]
["2085-09-07","sexta-feira","Independência do Brasil"]
["2085-10-12","sexta-feira","Nossa Sr.a Aparecida - Padroeira do Brasil"]
["2085-11-02","sexta-feira","Finados"]
["2085-11-15","quinta-feira","Proclamação da República"]
["2085-11-20","terça-feira","Dia Nacional de Zumbi e da Consciência Negra"]
["2085-12-25","terça-feira","Natal"]
["2086-01-01","terça-feira","Confraternização Universal"]
["2086-02-11","segunda-feira","Carnaval"]
["2086-02-12","terça-feira","Carnaval"]
["2086-03-29","sexta-feira","Paixão de Cristo"]
["2086-04-21","domingo","Tiradentes"]
["2086-05-01","quarta-feira","Dia do Trabalho"]
["2086-05-30","quinta-feira","Corpus Christi"]
["2086-09-07","sábado","Independência do Brasil"]
["2086-10-12","sábado","Nossa Sr.a Aparecida - Padroeira do Brasil"]
["2086-11-02","sábado","Finados"]
["2086-11-15","sexta-feira","Proclamação da República"]
["2086-11-20","quarta-feira","Dia Nacional de Zumbi e da Consciência Negra"]
["2086-12-25","quarta-feira","Natal"]
["2087-01-01","quarta-feira","Confraternização Universal"]
["2087-03-03","segunda-feira","Carnaval"]
["2087-03-04","terça-feira","Carnaval"]
["2087-04-18","sexta-feira","Paixão de Cristo"]
["2087-04-21","segunda-feira","Tiradentes"]
["2087-05-01","quinta-feira","Dia do Trabalho"]
["2087-06-19","quinta-feira","Corpus Christi"]
["2087-09-07","domingo","Independência do Brasil"]
["2087-10-12","domingo","Nossa Sr.a Aparecida - Padroeira do Brasil"]
["2087-11-02","domingo","Finados"]
["2087-11-15","sábado","Proclamação da República"]
["2087-11-20","quinta-feira","Dia Nacional de Zumbi e da Consciência Negra"]
["2087-12-25","quinta-feira","Natal"]
["2088-01-01","quinta-feira","Confraternização Universal"]
["2088-02-23","segunda-feira","Carnaval"]
["2088-02-24","terça-feira","Carnaval"]
["2088-04-09","sexta-feira","Paixão de Cristo"]
["2088-04-21","quarta-feira","Tiradentes"]
["2088-05-01","sábado","Dia do Trabalho"]
["2088-06-10","quinta-feira","Corpus Christi"]
["2088-09-07","terça-feira","Independência do Brasil"]
["2088-10-12","terça-feira","Nossa Sr.a Aparecida - Padroeira do Brasil"]
["2088-11-02","terça-feira","Finados"]
["2088-11-15","segunda-feira","Proclamação da República"]
["2088-11-20","sábado","Dia Nacional de Zumbi e da Consciência Negra"]
["2088-12-25","sábado","Natal"]
["2089-01-01","sábado","Confraternização Universal"]
["2089-02-14","segunda-feira","Carnaval"]
["2089-02-15","terça-feira","Carnaval"]
["2089-04-01","sexta-feira","Paixão de Cristo"]
["2089-04-21","quinta-feira","Tiradentes"]
["2089-05-01","domingo","Dia do Trabalho"]
["2089-06-02","quinta-feira","Corpus Christi"]
["2089-09-07","quarta-feira","Independência do Brasil"]
["2089-10-12","quarta-feira","Nossa Sr.a Aparecida - Padroeira do Brasil"]
["2089-11-02","quarta-feira","Finados"]
["2089-11-15","terça-feira","Proclamação da República"]
["2089-11-20","domingo","Dia Nacional de Zumbi e da Consciência Negra"]
["2089-12-25","domingo","Natal"]
["2090-01-01","domingo","Confraternização Universal"]
["2090-02-27","segunda-feira","Carnaval"]
["2090-02-28","terça-feira","Carnaval"]
["2090-04-14","sexta-feira","Paixão de Cristo"]
["2090-04-21","sexta-feira","Tiradentes"]
["2090-05-01","segunda-feira","Dia do Trabalho"]
["2090-06-15","quinta-feira","Corpus Christi"]
["2090-09-07","quinta-feira","Independência do Brasil"]
["2090-10-12","quinta-feira","Nossa Sr.a Aparecida - Padroeira do Brasil"]
["2090-11-02","quinta-feira","Finados"]
["2090-11-15","quarta-feira","Proclamação da República"]
["2090-11-20","segunda-feira","Dia Nacional de Zumbi e da Consciência Negra"]
["2090-12-25","segunda-feira","Natal"]
["2091-01-01","segunda-feira","Confraternização Universal"]
["2091-02-19","segunda-feira","Carnaval"]
["2091-02-20","terça-feira","Carnaval"]
["2091-04-06","sexta-feira","Paixão de Cristo"]
["2091-04-21","sábado","Tiradentes"]
["2091-05-01","terça-feira","Dia do Trabalho"]
["2091-06-07","quinta-feira","Corpus Christi"]
["2091-09-07","sexta-feira","Independência do Brasil"]
["2091-10-12","sexta-feira","Nossa Sr.a Aparecida - Padroeira do Brasil"]
["2091-11-02","sexta-feira","Finados"]
["2091-11-15","quinta-feira","Proclamação da República"]
["2091-11-20","terça-feira","Dia Nacional de Zumbi e da Consciência Negra"]
["2091-12-25","terça-feira","Natal"]
["2092-01-01","terça-feira","Confraternização Universal"]
["2092-02-11","segunda-feira","Carnaval"]
["2092-02-12","terça-feira","Carnaval"]
["2092-03-28","sexta-feira","Paixão de Cristo"]
["2092-04-21","segunda-feira","Tiradentes"]
["2092-05-01","quinta-feira","Dia do Trabalho"]
["2092-05-29","quinta-feira","Corpus Christi"]
["2092-09-07","domingo","Independência do Brasil"]
["2092-10-12","domingo","Nossa Sr.a Aparecida - Padroeira do Brasil"]
["2092-11-02","domingo","Finados"]
["2092-11-15","sábado","Proclamação da República"]
["2092-11-20","quinta-feira","Dia Nacional de Zumbi e da Consciência Negra"]
["2092-12-25","quinta-feira","Natal"]
["2093-01-01","quinta-feira","Confraternização Universal"]
["2093-02-23","segunda-feira","Carnaval"]
["2093-02-24","terça-feira","Carnaval"]
["2093-04-10","sexta-feira","Paixão de Cristo"]
["2093-04-21","terça-feira","Tiradentes"]
["2093-05-01","sexta-feira","Dia do Trabalho"]
["2093-06-11","quinta-feira","Corpus Christi"]
["2093-09-07","segunda-feira","Independência do Brasil"]
["2093-10-12","segunda-feira","Nossa Sr.a Aparecida - Padroeira do Brasil"]
["2093-11-02","segunda-feira","Finados"]
["2093-11-15","domingo","Proclamação da República"]
["2093-11-20","sexta-feira","Dia Nacional de Zumbi e da Consciência Negra"]
["2093-12-25","sexta-feira","Natal"]
["2094-01-01","sexta-feira","Confraternização Universal"]
["2094-02-15","segunda-feira","Carnaval"]
["2094-02-16","terça-feira","Carnaval"]
["2094-04-02","sexta-feira","Paixão de Cristo"]
["2094-04-21","quarta-feira","Tiradentes"]
["2094-05-01","sábado","Dia do Trabalho"]
["2094-06-03","quinta-feira","Corpus Christi"]
["2094-09-07","terça-feira","Independência do Brasil"]
["2094-10-12","terça-feira","Nossa Sr.a Aparecida - Padroeira do Brasil"]
["2094-11-02","terça-feira","Finados"]
["2094-11-15","segunda-feira","Proclamação da República"]
["2094-11-20","sábado","Dia Nacional de Zumbi e da Consciência Negra"]
["2094-12-25","sábado","Natal"]
["2095-01-01","sábado","Confraternização Universal"]
["2095-03-07","segunda-feira","Carnaval"]
["2095-03-08","terça-feira","Carnaval"]
["2095-04-21","quinta-feira","Tiradentes"]
["2095-04-22","sexta-feira","Paixão de Cristo"]
["2095-05-01","domingo","Dia do Trabalho"]
["2095-06-23","quinta-feira","Corpus Christi"]
["2095-09-07","quarta-feira","Independência do Brasil"]
["2095-10-12","quarta-feira","Nossa Sr.a Aparecida - Padroeira do Brasil"]
["2095-11-02","quarta-feira","Finados"]
["2095-11-15","terça-feira","Proclamação da República"]
["2095-11-20","domingo","Dia Nacional de Zumbi e da Consciência Negra"]
["2095-12-25","domingo","Natal"]
["2096-01-01","domingo","Confraternização Universal"]
["2096-02-27","segunda-feira","Carnaval"]
["2096-02-28","terça-feira","Carnaval"]
["2096-04-13","sexta-feira","Paixão de Cristo"]
["2096-04-21","sábado","Tiradentes"]
["2096-05-01","terça-feira","Dia do Trabalho"]
["2096-06-14","quinta-feira","Corpus Christi"]
["2096-09-07","sexta-feira","Independência do Brasil"]
["2096-10-12","sexta-feira","Nossa Sr.a Aparecida - Padroeira do Brasil"]
["2096-11-02","sexta-feira","Finados"]
["2096-11-15","quinta-feira","Proclamação da República"]
["2096-11-20","terça-feira","Dia Nacional de Zumbi e da Consciência Negra"]
["2096-12-25","terça-feira","Natal"]
["2097-01-01","terça-feira","Confraternização Universal"]
["2097-02-11","segunda-feira","Carnaval"]
["2097-02-12","terça-feira","Carnaval"]
["2097-03-29","sexta-feira","Paixão de Cristo"]
["2097-04-21","domingo","Tiradentes"]
["2097-05-01","quarta-feira","Dia do Trabalho"]
["2097-05-30","quinta-feira","Corpus Christi"]
["2097-09-07","sábado","Independência do Brasil"]
["2097-10-12","sábado","Nossa Sr.a Aparecida - Padroeira do Brasil"]
["2097-11-02","sábado","Finados"]
["2097-11-15","sexta-feira","Proclamação da República"]
["2097-11-20","quarta-feira","Dia Nacional de Zumbi e da Consciência Negra"]
["2097-12-25","quarta-feira","Natal"]
["2098-01-01","quarta-feira","Confraternização Universal"]
["2098-03-03","segunda-feira","Carnaval"]
["2098-03-04","terça-feira","Carnaval"]
["2098-04-18","sexta-feira","Paixão de Cristo"]
["2098-04-21","segunda-feira","Tiradentes"]
["2098-05-01","quinta-feira","Dia do Trabalho"]
["2098-06-19","quinta-feira","Corpus Christi"]
["2098-09-07","domingo","Independência do Brasil"]
["2098-10-12","domingo","Nossa Sr.a Aparecida - Padroeira do Brasil"]
["2098-11-02","domingo","Finados"]
["2098-11-15","sábado","Proclamação da República"]
["2098-11-20","quinta-feira","Dia Nacional de Zumbi e da Consciência Negra"]
["2098-12-25","quinta-feira","Natal"]
["2099-01-01","quinta-feira","Confraternização Universal "]
["2099-02-23","segunda-feira","Carnaval"]
["2099-02-24","terça-feira","Carnaval"]
["2099-04-10","sexta-feira","Paixão de Cristo"]
["2099-04-21","terça-feira","Tiradentes"]
["2099-05-01","sexta-feira","Dia do Trabalho"]
["2099-06-11","quinta-feira","Corpus Christi"]
["2099-09-07","segunda-feira","Independência do Brasil"]
["2099-10-12","segunda-feira","Nossa Sr.a Aparecida - Padroeira do Brasil"]
["2099-11-02","segunda-feira","Finados"]
["2099-11-15","domingo","Proclamação da República"]
["2099-11-20","sexta-feira","Dia Nacional de Zumbi e da Consciência Negra"]
["2099-12-25","sexta-feira","Natal"]

{"sheet":"PZO","index":2,"n_rows":1297,"n_cols":66,"rows_kept":1297,"cut":false,"hidden":true,"merged":[]}
["IOF ad",{"$f":"ROUND(3%/365,6)","v":8.2000000000000001E-5},null,null,null,null,null,null,null,null,null,null,null,null,null,null,null,null,null,null,"Port final",null,{"$f":"J16","v":1.6897391149092833E-2},{"$f":"IF($P$2=$AH$4,AH1,AP1)","v":"INSS"},{"$f":"IF($P$2=$AH$4,AI1,AQ1)","v":1.35E-2},{"$f":"IF($P$2=$AH$4,AJ1,AR1)","v":1.8499999999999999E-2},{"$f":"IF($P$2=$AH$4,AK1,AS1)","v":"Port"},{"$f":"'Simulador Port'!C18","v":"NORMAL"},null,null,null,null,null,"INSS",{"$f":"'Planilha 1'!AI1","v":1.35E-2},{"$f":"'Planilha 1'!AJ1","v":1.8499999999999999E-2},"Port",null,null,null,null,"SIAPE",{"$f":"'Planilha 1'!AQ1","v":1.6E-2},{"$f":"'Planilha 1'!AR1","v":1.7999999999999999E-2},"Port"]
["IOF adic.",3.8E-3,null,null,null,null,null,"CONVÊNIO",null,null,null,null,null,null,null,{"$f":"'Planilha 1'!P2","v":"INSS"},null,null,null,null,"TAXA TETO PONDERADO",{"$f":"((W1*W2)+(Z1*(Z2-W2)))/P3","v":1.7609661749496016E-2},{"$f":"J10","v":60},null,null,{"$f":"P3","v":108},null,null,null,null,null,null,null,null,null,null,null,null,null,null,null,null,96]
[null,null,null,null,null,null,null,null,null,null,null,null,null,null,"Prazo simulado (meses)",{"$f":"'Planilha 1'!P3","v":108},null,null,null,null,null,null,null,"Convenio","TxMax","TxMin","Nome",null,"Fator um jr","Novo Saldo","IOF","TROCO","VLR FIN","Convenio","TxMax","TxMin","Nome","Nome",null,null,null,"Convenio","TxMax","TxMin","Nome","Nome"]
[null,null,null,null,null,null,null,null,null,null,null,null,null,null,null,null,null,null,{"$f":"IF(AG4<$V$6,0,IF(AND(Z4>$V$2,Y4>$V$2),0,IF(OR(AF4/AD4>$V$4,$AF4>=$V$5),W3+1,0)))","v":0},null,"Troco min %",{"$f":"'Planilha 1'!V4","v":0},{"$f":"IF(AND(X4=\"INSS\",$AB$1=\"NORMAL\",OR(AA4=$AK$8,AA4=$AK$9)),0,IF($I$17<$Y$1,0,IFERROR(IF(AG4<$V$6,0,IF(AND(Z4>$V$2,Y4>$V$2),0,IF(OR(AF4/AD4>$V$4,$AF4>=$V$5),W3+1,0))),0)))","v":0},{"$f":"IF($P$2=$AH$4,AH4,AP4)","v":"INSS"},{"$f":"IF($P$2=$AH$4,AI4,AQ4)","v":1.8499999999999999E-2},{"$f":"IF($P$2=$AH$4,AJ4,AR4)","v":1.78E-2},{"$f":"IF($P$2=$AH$4,AK4,AS4)","v":"Normal"},{"$f":"IF($P$2=$AH$4,AL4,AT4)","v":"Tx1,850~1,78 (+90d Car) Normal-RfnP"},{"$f":"(1+MIN(Y4,$V$2))^(1/30)","v":1.0005820495985809},{"$f":"OFFSET($U$32,,ROW()-ROW($AD$4))","v":12125.074221916626},{"$f":"OFFSET($AH$29,,ROW()-ROW($AE$4))","v":92.319531811806996},{"$f":"AD4-AE4-$J$8","v":2032.7546142523988},{"$f":"SUM(AD4,AF4)","v":14157.828836169025},{"$f":"'Planilha 1'!AH4","v":"INSS"},{"$f":"'Planilha 1'!AI4","v":1.8499999999999999E-2},{"$f":"'Planilha 1'!AJ4","v":1.78E-2},{"$f":"'Planilha 1'!AK4","v":"Normal"},{"$f":"'Planilha 1'!AL4","v":"Tx1,850~1,78 (+90d Car) Normal-RfnP"},null,null,null,{"$f":"'Planilha 1'!AP4","v":"SIAPE"},{"$f":"'Planilha 1'!AQ4","v":1.7989999999999999E-2},{"$f":"'Planilha 1'!AR4","v":1.7989999999999999E-2},{"$f":"'Planilha 1'!AS4","v":"Normal"},{"$f":"'Planilha 1'!AT4","v":"SIAPE RfnPort Tx1.799 Normal Web"}]
[null,null,null,null,null,null,null,null,null,null,null,null,null,null,null,null,null,null,null,null,"Troco min R$",{"$f":"'Planilha 1'!V5","v":50},{"$f":"IF(AND(X5=\"INSS\",$AB$1=\"NORMAL\",OR(AA5=$AK$8,AA5=$AK$9)),0,IF($I$17<$Y$1,0,IFERROR(IF(AG5<$V$6,0,IF(AND(Z5>$V$2,Y5>$V$2),0,IF(OR(AF5/AD5>$V$4,$AF5>=$V$5),W4+1,0))),0)))","v":1},{"$f":"IF($P$2=$AH$4,AH5,AP5)","v":"INSS"},{"$f":"IF($P$2=$AH$4,AI5,AQ5)","v":1.779E-2},{"$f":"IF($P$2=$AH$4,AJ5,AR5)","v":1.7399999999999999E-2},{"$f":"IF($P$2=$AH$4,AK5,AS5)","v":"Flex 1"},{"$f":"IF($P$2=$AH$4,AL5,AT5)","v":"Tx1,779~1,74 (+90d Car) Flex1-RfnP"},{"$f":"(1+MIN(Y5,$V$2))^(1/30)","v":1.0005820495985809},{"$f":"OFFSET($U$32,,ROW()-ROW($AD$4))","v":12125.074221916626},{"$f":"OFFSET($AH$29,,ROW()-ROW($AE$4))","v":92.319531811806996},{"$f":"AD5-AE5-$J$8","v":2032.7546142523988},{"$f":"SUM(AD5,AF5)","v":14157.828836169025},{"$f":"'Planilha 1'!AH5","v":"INSS"},{"$f":"'Planilha 1'!AI5","v":1.779E-2},{"$f":"'Planilha 1'!AJ5","v":1.7399999999999999E-2},{"$f":"'Planilha 1'!AK5","v":"Flex 1"},{"$f":"'Planilha 1'!AL5","v":"Tx1,779~1,74 (+90d Car) Flex1-RfnP"},null,null,null,{"$f":"'Planilha 1'!AP5","v":"SIAPE"},{"$f":"'Planilha 1'!AQ5","v":1.7979999999999999E-2},{"$f":"'Planilha 1'!AR5","v":1.7499999999999998E-2},{"$f":"'Planilha 1'!AS5","v":"Flex 1"},{"$f":"'Planilha 1'!AT5","v":"SIAPE RfnPort Tx1.798 ~ 1.75 Flex 1 Web"}]
[null,null,null,null,null,null,null,null,null,null,"Observação",null,"Tabela",null,"Val Fin Novo","Troco",null,null,null,null,"Ticket Min",{"$f":"'Planilha 1'!V6","v":2000},2,"INSS",1.7389999999999999E-2,1.7000000000000001E-2,"Flex 2","Tx1,739~1,70 (+90d Car) Flex2-RfnP",{"$f":"(1+MIN(Y6,$V$2))^(1/30)","v":1.0005748493086513},12236.454167510979,94.317825693092928,2142.136265965466,14378.590433476445,{"$f":"'Planilha 1'!AH6","v":"INSS"},{"$f":"'Planilha 1'!AI6","v":1.7389999999999999E-2},{"$f":"'Planilha 1'!AJ6","v":1.7000000000000001E-2},{"$f":"'Planilha 1'!AK6","v":"Flex 2"},{"$f":"'Planilha 1'!AL6","v":"Tx1,739~1,70 (+90d Car) Flex2-RfnP"},null,null,null,{"$f":"'Planilha 1'!AP6","v":"SIAPE"},{"$f":"'Planilha 1'!AQ6","v":1.7489999999999999E-2},{"$f":"'Planilha 1'!AR6","v":1.6999999999999998E-2},{"$f":"'Planilha 1'!AS6","v":"Flex 2"},{"$f":"'Planilha 1'!AT6","v":"SIAPE RfnPort Tx1.749 ~ 1.70 Flex 2 Web"}]
[null,null,null,null,null,null,null,"Data Saldo",{"$f":"'Simulador Port'!C7","v":"2026-05-26"},{"$f":"TODAY()","v":"2026-05-26"},{"$f":"'Simulador Port'!D7","v":0},null,null,null,null,null,null,null,null,null,null,null,3,"INSS",1.6990000000000002E-2,1.6500000000000001E-2,"Flex 3","Tx1,699~1,65 (+90d Car) Flex3-RfnP",1.0005617338526143,12443.232351143488,98.050681340323393,2345.1815939507451,14788.413945094233,{"$f":"'Planilha 1'!AH7","v":"INSS"},{"$f":"'Planilha 1'!AI7","v":1.6990000000000002E-2},{"$f":"'Planilha 1'!AJ7","v":1.6500000000000001E-2},{"$f":"'Planilha 1'!AK7","v":"Flex 3"},{"$f":"'Planilha 1'!AL7","v":"Tx1,699~1,65 (+90d Car) Flex3-RfnP"},null,null,null,{"$f":"'Planilha 1'!AP7","v":"SIAPE"},{"$f":"'Planilha 1'!AQ7","v":1.6990000000000002E-2},{"$f":"'Planilha 1'!AR7","v":1.6500000000000001E-2},{"$f":"'Planilha 1'!AS7","v":"Flex 3"},{"$f":"'Planilha 1'!AT7","v":"SIAPE RfnPort Tx1.699 ~ 1.65 Flex 3 Web"}]
[null,null,null,null,null,null,null,"Saldo Portado",{"$f":"'Simulador Port'!C8","v":10000},{"$f":"SUM(PZO!J35:J143)","v":10000.00007585242},{"$f":"T8","v":""},1,{"$f":"IFERROR(VLOOKUP(L8,$W$4:$AF$15,6,0),\"\")","v":"Tx1,779~1,74 (+90d Car) Flex1-RfnP"},null,{"$f":"IFERROR(VLOOKUP(L8,$W$4:$AF$15,8,0),\"\")","v":12125.074221916626},{"$f":"IFERROR(VLOOKUP(L8,$W$4:$AF$15,10,0),\"\")","v":2032.7546142523988},null,{"$f":"O8-$I$8","v":2125.0742219166259},null,{"$f":"IF(OR((J17-I17)/I17>2%,(J17-I17)/I17<-2%),\"Saldo e Parcela não correspondem à taxa informada\",\"\")","v":""},"TAXA TROCO",null,0,"INSS",1.6490000000000001E-2,1.6E-2,"Flex 4","Tx1,649~1,60 (+90d Car) Flex4-RfnP",1.0005453325183937,12709.097215721285,102.89314393191702,2606.2039959369486,15315.301211658234,{"$f":"'Planilha 1'!AH8","v":"INSS"},{"$f":"'Planilha 1'!AI8","v":1.6490000000000001E-2},{"$f":"'Planilha 1'!AJ8","v":1.6E-2},{"$f":"'Planilha 1'!AK8","v":"Flex 4"},{"$f":"'Planilha 1'!AL8","v":"Tx1,649~1,60 (+90d Car) Flex4-RfnP"}]
[null,null,null,null,null,null,null,"Valor Parcela",{"$f":"'Simulador Port'!C22","v":270},{"$f":"I9","v":270},{"$f":"'Simulador Port'!D9","v":0},{"$f":"L8+1","v":2},{"$f":"IFERROR(VLOOKUP(L9,$W$4:$AF$15,6,0),\"\")","v":"Tx1,739~1,70 (+90d Car) Flex2-RfnP"},null,{"$f":"IFERROR(VLOOKUP(L9,$W$4:$AF$15,8,0),\"\")","v":12236.454167510979},{"$f":"IFERROR(VLOOKUP(L9,$W$4:$AF$15,10,0),\"\")","v":2142.136265965466},null,{"$f":"O9-$I$8","v":2236.4541675109795},null,null,null,null,0,"INSS",1.5990000000000001E-2,1.55E-2,"Flex 5","Tx1,599~1,55 (+90d Car) Flex5-RfnP",1.0005289233836074,12983.474045695073,107.9398742041439,2875.5340956385098,15859.008141333583,{"$f":"'Planilha 1'!AH9","v":"INSS"},{"$f":"'Planilha 1'!AI9","v":1.5990000000000001E-2},{"$f":"'Planilha 1'!AJ9","v":1.55E-2},{"$f":"'Planilha 1'!AK9","v":"Flex 5"},{"$f":"'Planilha 1'!AL9","v":"Tx1,599~1,55 (+90d Car) Flex5-RfnP"}]
[null,null,null,null,null,null,null,"Nº de Parcelas Restantes",{"$f":"'Simulador Port'!C21","v":60},{"$f":"I10","v":60},{"$f":"T10","v":""},{"$f":"L9+1","v":3},"Tx1,699~1,65 (+90d Car) Flex3-RfnP",null,12443.232351143488,2345.1815939507451,null,2443.2323511434879,null,{"$f":"IF(P3-J10<12,\"Contrato com menos de 12 parcelas pagas\",\"\")","v":""},null,null,0,0,0,0,0,0,1,{"$error":"#N/A"},{"$error":"#N/A"},{"$error":"#N/A"},{"$error":"#N/A"},{"$f":"'Planilha 1'!AH10","v":0},{"$f":"'Planilha 1'!AI10","v":0},{"$f":"'Planilha 1'!AJ10","v":0},{"$f":"'Planilha 1'!AK10","v":0},{"$f":"'Planilha 1'!AL10","v":0}]
[null,null,null,null,null,null,null,null,null,null,null,4,"",null,"","",null,{"$error":"#VALUE!"},null,null,null,null,0,0,0,0,0,0,1,{"$error":"#N/A"},{"$error":"#N/A"},{"$error":"#N/A"},{"$error":"#N/A"},{"$f":"'Planilha 1'!AH11","v":0},{"$f":"'Planilha 1'!AI11","v":0},{"$f":"'Planilha 1'!AJ11","v":0},{"$f":"'Planilha 1'!AK11","v":0},{"$f":"'Planilha 1'!AL11","v":0}]
[null,null,null,null,null,null,null,null,null,null,null,5,"",null,"","",null,{"$error":"#VALUE!"},null,null,null,null,0,0,0,0,0,0,1,{"$error":"#N/A"},{"$error":"#N/A"},{"$error":"#N/A"},{"$error":"#N/A"},{"$f":"'Planilha 1'!AH12","v":0},{"$f":"'Planilha 1'!AI12","v":0},{"$f":"'Planilha 1'!AJ12","v":0},{"$f":"'Planilha 1'!AK12","v":0},{"$f":"'Planilha 1'!AL12","v":0},null,null,null,null,null,null,null,null,null,null,";"]
[null,null,null,null,null,null,null,null,null,null,null,6,"",null,"","",null,{"$error":"#VALUE!"},null,null,null,null,0,0,0,0,0,0,1,{"$error":"#N/A"},{"$error":"#N/A"},{"$error":"#N/A"},{"$error":"#N/A"},{"$f":"'Planilha 1'!AH13","v":0},{"$f":"'Planilha 1'!AI13","v":0},{"$f":"'Planilha 1'!AJ13","v":0},{"$f":"'Planilha 1'!AK13","v":0},{"$f":"'Planilha 1'!AL13","v":0}]
[null,null,null,null,null,null,null,null,null,null,null,7,"",null,"","",null,{"$error":"#VALUE!"},null,null,null,null,0,0,0,0,0,0,1,{"$error":"#N/A"},{"$error":"#N/A"},{"$error":"#N/A"},{"$error":"#N/A"}]
[null,null,null,null,null,null,null,null,null,null,null,8,"",null,"","",null,{"$error":"#VALUE!"},null,null,null,null,0,0,0,0,0,0,1,{"$error":"#N/A"},{"$error":"#N/A"},{"$error":"#N/A"},{"$error":"#N/A"}]
[null,null,null,null,null,null,null,null,null,{"$f":"J17","v":1.6897391149092833E-2},null,9,"",null,"","",null,{"$error":"#VALUE!"}]
[null,null,null,null,null,null,null,"Taxa de Juros",{"$f":"J17","v":1.6897391149092833E-2},{"$f":"(1+XIRR($I$35:$I$143,$M$35:$M$143))^(360/365)^(30/360)-1","v":1.6897391149092833E-2},{"$f":"T17","v":""},10,"",null,"","",null,{"$error":"#VALUE!"},null,{"$f":"IF(J17<PZO!Y1,\"Taxa original inferior a mínima\",\"\")","v":""}]
[null,null,null,null,null,null,null,"Saldo Calculado pela Taxa",{"$f":"SUM(K36:K143)","v":10000.00007585242},{"$f":"SUM(J36:J143)","v":10000.00007585242},{"$f":"'Simulador Port'!F20","v":0},11,"",null,"","",null,null,null,null,null,null,null,null,null,{"$f":"IFERROR(VLOOKUP(M8,PZO!$AB$4:$AG$15,3,0),\"\")","v":""}]
[null,null,null,null,null,null,null,null,null,null,null,12,"",null,"",""]
[]
[]
[null,null,null,null,null,null,null,"Taxa AP considerando base 365",{"$f":"J16","v":1.6897391149092833E-2},null,null,null,null,null,null,null,null,null,null,null,null,null,null,null,null,null,null,{"$f":"IFERROR(VLOOKUP(M8,PZO!$AB$4:$AG$15,3,0),\"\")","v":""}]
[null,null,null,null,null,null,null,"Taxa CET da PORT",{"$f":"J17","v":1.6897391149092833E-2}]
[]
[null,null,null,null,null,null,null,null,null,null,";"]
[null,null,null,null,null,null,null,null,null,null,null,null,null,null,null,null,null,null,null,null,null,null,null,null,null,null,null,null,null,null,null,null,null,null,null,null,null,null,null,null,null,null,null,null,null,null,null,null,null,null,null,null,null,null,null,null,null,null,null,null,null,"SEM MUDA PRAZO","SOMAR 1 PARCELA","SOMAR 2 PARCELAS","TIRAR 1 PARCELA","TIRAR 2 PARCELAS"]
[null,null,null,null,null,null,null,null,null,null,null,null,null,null,null,null,null,null,null,null,null,null,null,null,null,null,null,null,null,null,null,null,null,null,null,null,null,null,null,null,null,null,null,null,null,{"$f":"XIRR(AU$35:AU$143,$H$35:$H$143)","v":6.1476138234138486E-2},{"$f":"XIRR(AV$35:AV$143,$H$35:$H$143)","v":6.1476138234138486E-2},6.0273954272270197E-2,5.8066871762275707E-2,5.5275341868400565E-2,5.2447351813316362E-2,{"$error":"#N/A"},{"$error":"#N/A"},{"$error":"#N/A"},{"$error":"#N/A"},{"$error":"#N/A"},{"$error":"#N/A"},null,null,null,null,{"$f":"IF(K17<>\"\",\"Taxa original inferior a mínima\",\"\")","v":""},{"$f":"IF(BK32<PZO!$Y$1,\"Taxa original inferior a mínima\",\"\")","v":""},{"$f":"IF(BL32<PZO!$Y$1,\"Taxa original inferior a mínima\",\"\")","v":""},{"$f":"IF(BM32<PZO!$Y$1,\"Taxa original inferior a mínima\",\"\")","v":""},{"$f":"IF(BN32<PZO!$Y$1,\"Taxa original inferior a mínima\",\"\")","v":""}]
[null,null,null,null,null,null,null,null,null,null,null,null,null,null,null,null,null,null,null,null,null,null,null,null,null,null,null,null,null,null,null,null,null,{"$f":"U32-$J$8","v":2125.0741460642057},{"$f":"V32-$J$8","v":2125.0741460642057},2236.4540916585593,2443.2322752910677,2709.0971398688653,2983.4739698426529,{"$error":"#N/A"},{"$error":"#N/A"},{"$error":"#N/A"},{"$error":"#N/A"},{"$error":"#N/A"},{"$error":"#N/A"}]
[null,null,null,null,null,null,null,null,null,null,null,null,null,null,null,null,null,null,null,"Taxa REFIN",{"$f":"VLOOKUP(U34,$AA$4:$AC$15,3,0)","v":1.0005820495985809},{"$f":"VLOOKUP(V34,$AA$4:$AC$15,3,0)","v":1.0005820495985809},{"$f":"VLOOKUP(W34,$AA$4:$AC$15,3,0)","v":1.0005748493086513},{"$f":"VLOOKUP(X34,$AA$4:$AC$15,3,0)","v":1.0005617338526143},1.0005453325183937,1.0005289233836074,{"$error":"#N/A"},{"$error":"#N/A"},{"$error":"#N/A"},{"$error":"#N/A"},{"$error":"#N/A"},{"$error":"#N/A"},null,{"$f":"SUM(AH35:AH143)","v":92.319531811806996},{"$f":"SUM(AI35:AI143)","v":92.319531811806996},94.317825693092928,98.050681340323393,102.89314393191702,107.9398742041439,{"$error":"#N/A"},{"$error":"#N/A"},{"$error":"#N/A"},{"$error":"#N/A"},{"$error":"#N/A"},{"$error":"#N/A"},null,{"$f":"(1+AT27)^(30/365)-1","v":4.9156469434352701E-3},4.9156469434352701E-3,4.8220536960905669E-3,4.6499725681552473E-3,4.4318509451279908E-3,4.2103397725425928E-3,{"$error":"#N/A"},{"$error":"#N/A"},{"$error":"#N/A"},{"$error":"#N/A"},{"$error":"#N/A"},{"$error":"#N/A"}]
[null,null,null,null,null,null,null,"dt ini fx pmt",{"$f":"EDATE(J31,-1)","v":"2026-09-07"},{"$f":"NETWORKDAYS(EOMONTH(I7,-1)+1,I7,$A$34:$A$1297)","v":17},null,null,null,null,null,null,null,null,null,null,null,null,null,null,null,null,null,null,null,null,null,null,null,null,null,null,null,null,null,null,null,null,null,null,null,null,null,null,null,null,null,null,null,null,null,null,null,null,null,null,null,"dt ini fx pmt",{"$f":"I30","v":"2026-09-07"}]
[null,null,null,null,null,null,null,"Prox Vencimento",null,{"$f":"'Planilha 1'!J31","v":"2026-10-07"},null,null,{"$f":"'Planilha 1'!M31","v":"2026-07-07"},null,null,null,null,null,null,null,{"$f":"U32-$I$8","v":2125.0742219166259},{"$f":"V32-$I$8","v":2125.0742219166259},2236.4541675109795,2443.2323511434879,2709.0972157212855,2983.4740456950731,{"$error":"#N/A"},{"$error":"#N/A"},{"$error":"#N/A"},{"$error":"#N/A"},{"$f":"AE32-$I$8","v":{"$error":"#N/A"}},{"$error":"#N/A"},null,null,null,null,null,null,null,null,null,null,null,null,null,null,null,null,null,null,null,null,null,null,null,null,null,null,null,null,null,"Prox Vencimento",null,{"$f":"J31","v":"2026-10-07"}]
[null,null,null,null,null,null,null,"Fator Dia",{"$f":"(1+I17)^(1/30)","v":1.0005586966234388},{"$f":"(1+J17)^(1/30)","v":1.0005586966234388},null,null,null,null,null,null,null,null,null,"Vlr Troco",{"$f":"SUM(U36:U143)","v":12125.074221916626},{"$f":"SUM(V36:V143)","v":12125.074221916626},12236.454167510979,12443.232351143488,12709.097215721285,12983.474045695073,{"$error":"#N/A"},{"$error":"#N/A"},{"$error":"#N/A"},{"$error":"#N/A"},{"$error":"#N/A"},{"$error":"#N/A"},null,null,null,null,null,null,null,null,null,null,null,null,null,null,null,null,null,null,null,null,null,null,null,null,null,null,null,null,null,"XITR",{"$f":"(1+XIRR(BK$35:BK$143,$BJ$35:$BJ$143))^(30/360)-1","v":1.57006140892062E-2},{"$f":"(1+XIRR(BL$35:BL$143,$BJ$35:$BJ$143))^(30/360)-1","v":1.6029232818115968E-2},1.4996871089751673E-2,1.4619910158086391E-2]
["Data","Dia da Semana","Feriado",null,null,null,null,"OPERAÇÃO ORIGINAL",null,null,null,null,null,null,null,null,null,null,null,"REFINANCIAMENTO",null,null,null,null,null,null,null,null,null,null,null,null,null,"IOF",null,null,null,null,null,null,null,null,null,null,null,null,"REFINANCIAMENTO",null,null,null,null,null,null,null,null,null,null,null,null,null,null,"OPERAÇÃO ORIGINAL"]
["2001-01-01","segunda-feira","Confraternização Universal",null,null,null,null,"DATA EV","FLUXO","Principal","Principal2","IOF","Data Sld",null,null,null,null,null,null,"FX Refin","Normal","Flex 1","Flex 2","Flex 3","Flex 4","Flex 5","Flex 6","Flex 7","Flex 8","Flex 9","Flex 10","Flex 11",null,"Normal","Flex 1","Flex 2","Flex 3","Flex 4","Flex 5","Flex 6","Flex 7","Flex 8","Flex 9","Flex 10","Flex 11",null,"Normal","Flex 1","Flex 2","Flex 3","Flex 4","Flex 5","Flex 6","Flex 7","Flex 8","Flex 9","Flex 10","Flex 11",null,null,null,"DATA EV","FLUXO1","FLUXO2","FLUXO3","FLUXO4"]
["2001-02-26","segunda-feira","Carnaval",null,null,null,0,{"$f":"I7","v":"2026-05-26"},{"$f":"-I8","v":-10000},null,null,{"$f":"I35*-0.38%","v":38},{"$f":"I7","v":"2026-05-26"},null,null,null,null,null,null,{"$f":"I35","v":-10000},null,null,null,null,null,null,null,null,null,null,null,null,null,{"$f":"(U31)*$B$2","v":8.0752820432831776},{"$f":"(V31)*$B$2","v":8.0752820432831776},8.498525836541722,9.2842829343452546,10.294569419740885,11.337201373641278,{"$error":"#N/A"},{"$error":"#N/A"},{"$error":"#N/A"},{"$error":"#N/A"},{"$error":"#N/A"},{"$error":"#N/A"},null,{"$f":"-U32+$I$35","v":-22125.074221916628},{"$f":"-V32+$I$35","v":-22125.074221916628},-22236.454167510979,-22443.232351143488,-22709.097215721285,-22983.474045695075,{"$error":"#N/A"},{"$error":"#N/A"},{"$error":"#N/A"},{"$error":"#N/A"},{"$error":"#N/A"},{"$error":"#N/A"},null,null,0,{"$f":"H35","v":"2026-05-26"},{"$f":"I35","v":-10000},{"$f":"BK35","v":-10000},{"$f":"BL35","v":-10000},{"$f":"BM35","v":-10000}]
["2001-02-27","terça-feira","Carnaval",null,null,{"$f":"H36-$H$35","v":134},1,{"$f":"J31","v":"2026-10-07"},{"$f":"IF($G36>$I$10,0,$I$9)","v":270},{"$f":"I36/($J$32^(M36-$M$35))","v":263.73986390338524},{"$f":"I36/($I$32^(M36-$M$35))","v":263.73986390338524},{"$f":"J36*0.0082%*MIN(F36,365)","v":2.8979736245703971},{"$f":"M31","v":"2026-07-07"},null,null,null,null,null,1,{"$f":"IF($G36>$P$3,0,$J$9)","v":270},{"$f":"$T36/((U$29)^($H36-$H$35))","v":249.74739882540274},{"$f":"$T36/((V$29)^($H36-$H$35))","v":249.74739882540274},249.98834166218865,250.4278252722282,250.97851033191017,251.53067817216245,{"$error":"#N/A"},{"$error":"#N/A"},{"$error":"#N/A"},{"$error":"#N/A"},{"$error":"#N/A"},{"$error":"#N/A"},null,{"$f":"IF($I36<>0,0,U36*$B$1*MIN($F36,365))","v":0},{"$f":"IF($I36<>0,0,V36*$B$1*MIN($F36,365))","v":0},0,0,0,0,0,0,0,0,0,0,null,{"$f":"$T36","v":270},270,270,270,270,270,270,270,270,270,270,270,null,{"$f":"BJ36-$H$35","v":134},1,{"$f":"BL31","v":"2026-10-07"},{"$f":"I36","v":270},{"$f":"BK36","v":270},{"$f":"I37","v":270},{"$f":"BM37","v":270}]
["2001-04-13","sexta-feira","Paixão de Cristo",null,null,{"$f":"H37-$H$35","v":165},{"$f":"G36+1","v":2},{"$f":"EDATE(H36,1)","v":"2026-11-07"},{"$f":"IF($G37>$I$10,0,$I$9)","v":270},{"$f":"I37/($J$32^(M37-$M$35))","v":259.21257926760569},{"$f":"I37/($I$32^(M37-$M$35))","v":259.21257926760569},{"$f":"J37*0.0082%*MIN(F37,365)","v":3.5071461974907052},{"$f":"EDATE(M36,1)","v":"2026-08-07"},null,null,null,null,null,{"$f":"S36+1","v":2},270,245.28277137589933,245.28277137589933,245.57418354655687,246.10589136766495,246.7724406398622,247.44112446558725,{"$error":"#N/A"},{"$error":"#N/A"},{"$error":"#N/A"},{"$error":"#N/A"},{"$error":"#N/A"},{"$error":"#N/A"},null,0,0,0,0,0,0,0,0,0,0,0,0,null,270,270,270,270,270,270,270,270,270,270,270,270,null,{"$f":"BJ37-$H$35","v":165},{"$f":"BI36+1","v":2},{"$f":"EDATE(BJ36,1)","v":"2026-11-07"},{"$f":"I36","v":270},{"$f":"BK36","v":270},{"$f":"I38","v":270},{"$f":"BM38","v":270}]
["2001-04-21","sábado","Tiradentes",null,null,195,{"$f":"G37+1","v":3},{"$f":"EDATE(H37,1)","v":"2026-12-07"},{"$f":"IF($G38>$I$10,0,$I$9)","v":270},254.76300873188674,254.76300873188674,4.0736605096228686,{"$f":"EDATE(M37,1)","v":"2026-09-07"},null,null,null,null,null,3,270,241.03817072078846,241.03817072078846,241.37664371239754,241.99440640288086,242.76917691257378,243.54681095836341,{"$error":"#N/A"},{"$error":"#N/A"},{"$error":"#N/A"},{"$error":"#N/A"},{"$error":"#N/A"},{"$error":"#N/A"},null,0,0,0,0,0,0,0,0,0,0,0,0,null,270,270,270,270,270,270,270,270,270,270,270,270,null,195,{"$f":"BI37+1","v":3},{"$f":"EDATE(BJ37,1)","v":"2026-12-07"},{"$f":"I37","v":270},{"$f":"BK37","v":270},270,270]
["2001-05-01","terça-feira","Dia do Trabalho",null,null,226,4,"2027-01-07",{"$f":"IF($G39>$I$10,0,$I$9)","v":270},250.52971022376803,250.52971022376803,4.642816589866869,"2026-10-07",null,null,null,null,null,4,270,236.72923441779045,236.72923441779045,237.11454627344244,237.8180181416709,238.7006848499465,239.58706429558208,{"$error":"#N/A"},{"$error":"#N/A"},{"$error":"#N/A"},{"$error":"#N/A"},{"$error":"#N/A"},{"$error":"#N/A"},null,0,0,0,0,0,0,0,0,0,0,0,0,null,270,270,270,270,270,270,270,270,270,270,270,270,null,226,4,"2027-01-07",270,270,270,270]
["2001-06-14","quinta-feira","Corpus Christi",null,null,257,5,"2027-02-07",270,246.22918738616676,246.22918738616676,5.1890338949760784,"2026-11-07",null,null,null,null,null,5,270,232.49732712645377,232.49732712645377,232.92770663200977,233.71370683119568,234.70037536252974,235.6916978378699,{"$error":"#N/A"},{"$error":"#N/A"},{"$error":"#N/A"},{"$error":"#N/A"},{"$error":"#N/A"},{"$error":"#N/A"},null,0,0,0,0,0,0,0,0,0,0,0,0,null,270,270,270,270,270,270,270,270,270,270,270,270,null,257,5,"2027-02-07",270,270,270,270]
["2001-09-07","sexta-feira","Independência do Brasil",null,null,285,6,"2027-03-07",270,242.13769209096827,242.13769209096827,5.6587578641659286,"2026-12-07",null,null,null,null,null,6,270,228.74002143805473,228.74002143805473,229.20962488880218,230.06750349586903,231.1448461401778,232.22776747367982,{"$error":"#N/A"},{"$error":"#N/A"},{"$error":"#N/A"},{"$error":"#N/A"},{"$error":"#N/A"},{"$error":"#N/A"},null,0,0,0,0,0,0,0,0,0,0,0,0,null,270,270,270,270,270,270,270,270,270,270,270,270,null,285,6,"2027-03-07",270,270,270,270]
["2001-10-12","sexta-feira","Nossa Sr.a Aparecida - Padroeira do Brasil",null,null,316,7,"2027-04-07",270,237.98122428620692,237.98122428620692,6.166569483704194,"2027-01-07",null,null,null,null,null,7,270,224.6509338907355,224.6509338907355,225.16236604802376,226.09695212995695,227.27116257046669,228.45205337731971,{"$error":"#N/A"},{"$error":"#N/A"},{"$error":"#N/A"},{"$error":"#N/A"},{"$error":"#N/A"},{"$error":"#N/A"},null,0,0,0,0,0,0,0,0,0,0,0,0,null,270,270,270,270,270,270,270,270,270,270,270,270,null,316,7,"2027-04-07",270,270,270,270]
["2001-11-02","sexta-feira","Finados",null,null,346,8,"2027-05-07",270,233.89610524364286,233.89610524364286,6.6361002979726349,"2027-02-07",null,null,null,null,null,8,270,220.76336569418024,220.76336569418024,221.31372044940792,222.31973975157848,223.58425815351512,224.85659640087005,{"$error":"#N/A"},{"$error":"#N/A"},{"$error":"#N/A"},{"$error":"#N/A"},{"$error":"#N/A"},{"$error":"#N/A"},null,0,0,0,0,0,0,0,0,0,0,0,0,null,270,270,270,270,270,270,270,270,270,270,270,270,null,346,8,"2027-05-07",270,270,270,270]
["2001-11-15","quinta-feira","Proclamação da República",null,null,377,9,"2027-06-07",270,230.2666269172891,230.2666269172891,6.891880143634463,"2027-03-07",null,null,null,null,null,9,270,216.81687341054271,216.81687341054271,217.40588319297095,218.48290085461673,219.83728009314305,221.20072772536147,{"$error":"#N/A"},{"$error":"#N/A"},{"$error":"#N/A"},{"$error":"#N/A"},{"$error":"#N/A"},{"$error":"#N/A"},null,0,0,0,0,0,0,0,0,0,0,0,0,null,270,270,270,270,270,270,270,270,270,270,270,270,null,377,9,"2027-06-07",270,270,270,270]
["2001-12-25","terça-feira","Natal",null,null,407,10,"2027-07-07",270,226.31393449246366,226.31393449246366,6.7735760593594367,"2027-04-07",null,null,null,null,null,10,270,213.06487306516539,213.06487306516539,213.68981727063391,214.83289005262347,216.2709717686775,217.71939460561794,{"$error":"#N/A"},{"$error":"#N/A"},{"$error":"#N/A"},{"$error":"#N/A"},{"$error":"#N/A"},{"$error":"#N/A"},null,0,0,0,0,0,0,0,0,0,0,0,0,null,270,270,270,270,270,270,270,270,270,270,270,270,null,407,10,"2027-07-07",270,270,270,270]
["2002-01-01","terça-feira","Confraternização Universal",null,null,438,11,"2027-08-07",270,222.55336326188254,222.55336326188254,6.6610221624281447,"2027-05-07",null,null,null,null,null,11,270,209.25600344215604,209.25600344215604,209.91659874827704,211.12526071740714,212.64655476810231,214.17956732223078,{"$error":"#N/A"},{"$error":"#N/A"},{"$error":"#N/A"},{"$error":"#N/A"},{"$error":"#N/A"},{"$error":"#N/A"},null,0,0,0,0,0,0,0,0,0,0,0,0,null,270,270,270,270,270,270,270,270,270,270,270,270,null,438,11,"2027-08-07",270,270,270,270]
["2002-02-11","segunda-feira","Carnaval",null,null,469,12,"2027-09-07",270,218.73307456064288,218.73307456064288,6.5466809216000419,"2027-06-07",null,null,null,null,null,12,270,205.51522335261302,205.51522335261302,206.21000566553778,207.48161839686054,209.08287822884117,210.69729291427254,{"$error":"#N/A"},{"$error":"#N/A"},{"$error":"#N/A"},{"$error":"#N/A"},{"$error":"#N/A"},{"$error":"#N/A"},null,0,0,0,0,0,0,0,0,0,0,0,0,null,270,270,270,270,270,270,270,270,270,270,270,270,null,469,12,"2027-09-07",270,270,270,270]
["2002-02-12","terça-feira","Carnaval",null,null,499,13,"2027-10-07",270,215.09847155127008,215.09847155127008,6.4378972535295134,"2027-07-07",null,null,null,null,null,13,270,201.95879724577935,201.95879724577935,202.68530815669229,204.01539680514199,205.69103309313533,207.38126646352114,{"$error":"#N/A"},{"$error":"#N/A"},{"$error":"#N/A"},{"$error":"#N/A"},{"$error":"#N/A"},{"$error":"#N/A"},null,0,0,0,0,0,0,0,0,0,0,0,0,null,270,270,270,270,270,270,270,270,270,270,270,270,null,499,13,"2027-10-07",270,270,270,270]
["2002-03-29","sexta-feira","Paixão de Cristo",null,null,530,14,"2027-11-07",270,211.40615143317643,211.40615143317643,6.3273861123949713,"2027-08-07",null,null,null,null,null,14,270,198.34846619090996,198.34846619090996,199.10640126859346,200.49445794961917,202.24392194774308,204.0095233699823,{"$error":"#N/A"},{"$error":"#N/A"},{"$error":"#N/A"},{"$error":"#N/A"},{"$error":"#N/A"},{"$error":"#N/A"},null,0,0,0,0,0,0,0,0,0,0,0,0,null,270,270,270,270,270,270,270,270,270,270,270,270,null,530,14,"2027-11-07",270,270,270,270]
["2002-04-21","domingo","Tiradentes",null,null,560,15,"2027-12-07",270,207.77721264808895,207.77721264808895,6.2187719745573027,"2027-09-07",null,null,null,null,null,15,270,194.91606029949116,194.91606029949116,195.70312394322036,197.14496499436564,198.96302171958703,200.79875133611802,{"$error":"#N/A"},{"$error":"#N/A"},{"$error":"#N/A"},{"$error":"#N/A"},{"$error":"#N/A"},{"$error":"#N/A"},null,0,0,0,0,0,0,0,0,0,0,0,0,null,270,270,270,270,270,270,270,270,270,270,270,270,null,560,15,"2027-12-07",270,270,270,270]
["2002-05-01","quarta-feira","Dia do Trabalho",null,null,591,16,"2028-01-07",270,204.32465896416741,204.32465896416741,6.1154370427975309,"2027-10-07",null,null,null,null,null,16,270,191.43162924133011,191.43162924133011,192.2475046648789,193.74259743638009,195.62866319468247,197.53403116850407,{"$error":"#N/A"},{"$error":"#N/A"},{"$error":"#N/A"},{"$error":"#N/A"},{"$error":"#N/A"},{"$error":"#N/A"},null,0,0,0,0,0,0,0,0,0,0,0,0,null,270,270,270,270,270,270,270,270,270,270,270,270,null,591,16,"2028-01-07",270,270,270,270]
["2002-05-30","quinta-feira","Corpus Christi",null,null,622,17,"2028-02-07",270,200.81727909542585,200.81727909542585,6.0104611633260951,"2027-11-07",null,null,null,null,null,17,270,{"$f":"$T52/((U$29)^($H52-$H$35))","v":188.00948786715117},188.00948786715117,188.85290283151352,190.3989486237603,192.3501841325872,194.3223910011485,{"$error":"#N/A"},{"$error":"#N/A"},{"$error":"#N/A"},{"$error":"#N/A"},{"$error":"#N/A"},{"$error":"#N/A"},null,0,0,0,0,0,0,0,0,0,0,0,0,null,{"$f":"$T52","v":270},270,270,270,270,270,270,270,270,270,270,270,null,622,17,"2028-02-07",270,270,270,270]
["2002-09-07","sábado","Independência do Brasil",null,null,651,18,"2028-03-07",270,197.48037593891706,197.48037593891706,5.9105876518517881,"2027-12-07",null,null,null,null,null,18,270,184.86353440343245,184.86353440343245,185.73159240030122,187.32327963766127,189.33297813349242,191.36524243123245,{"$error":"#N/A"},{"$error":"#N/A"},{"$error":"#N/A"},{"$error":"#N/A"},{"$error":"#N/A"},{"$error":"#N/A"},null,0,0,0,0,0,0,0,0,0,0,0,0,null,270,270,270,270,270,270,270,270,270,270,270,270,null,651,18,"2028-03-07",270,270,270,270]
["2002-10-12","sábado","Nossa Sr.a Aparecida - Padroeira do Brasil",null,null,682,19,"2028-04-07",270,194.09048311564723,194.09048311564723,5.8091281596513218,"2028-01-07",null,null,null,null,null,19,270,181.55880805196091,181.55880805196091,182.45204500032335,184.09041670599657,186.16000647157875,188.2538985499161,{"$error":"#N/A"},{"$error":"#N/A"},{"$error":"#N/A"},{"$error":"#N/A"},{"$error":"#N/A"},{"$error":"#N/A"},null,0,0,0,0,0,0,0,0,0,0,0,0,null,270,270,270,270,270,270,270,270,270,270,270,270,null,682,19,"2028-04-07",270,270,270,270]
["2002-11-02","sábado","Finados",null,null,712,20,"2028-05-07",270,190.75878024314403,190.75878024314403,5.7094102926773012,"2028-02-07",null,null,null,null,null,20,270,178.41694598282487,178.41694598282487,179.33343653891117,181.01497232617555,183.14002741943222,185.2910939575354,{"$error":"#N/A"},{"$error":"#N/A"},{"$error":"#N/A"},{"$error":"#N/A"},{"$error":"#N/A"},{"$error":"#N/A"},null,0,0,0,0,0,0,0,0,0,0,0,0,null,270,270,270,270,270,270,270,270,270,270,270,270,null,712,20,"2028-05-07",270,270,270,270]
["2002-11-15","sexta-feira","Proclamação da República",null,null,743,21,"2028-06-07",270,187.69382062617004,187.69382062617004,5.6176760513412693,"2028-03-07",null,null,null,null,null,21,270,175.22746253579865,175.22746253579865,176.16686429382585,177.8909794340932,180.07084146518051,182.27850763766418,{"$error":"#N/A"},{"$error":"#N/A"},{"$error":"#N/A"},{"$error":"#N/A"},{"$error":"#N/A"},{"$error":"#N/A"},null,0,0,0,0,0,0,0,0,0,0,0,0,null,270,270,270,270,270,270,270,270,270,270,270,270,null,743,21,"2028-06-07",270,270,270,270]
["2002-12-25","quarta-feira","Natal",null,null,773,22,"2028-07-07",270,184.47192107039066,184.47192107039066,5.5212445976367928,"2028-04-07",null,null,null,null,null,22,270,172.19516394384814,172.19516394384814,173.15568689865773,174.91910385952059,177.14964383828709,179.40974580228581,{"$error":"#N/A"},{"$error":"#N/A"},{"$error":"#N/A"},{"$error":"#N/A"},{"$error":"#N/A"},{"$error":"#N/A"},null,0,0,0,0,0,0,0,0,0,0,0,0,null,270,270,270,270,270,270,270,270,270,270,270,270,null,773,22,"2028-07-07",270,270,270,270]
["2003-01-01","quarta-feira","Confraternização Universal",null,null,804,23,"2028-08-07",270,181.40662241441936,181.40662241441936,5.4295002088635718,"2028-05-07",null,null,null,null,null,23,270,169.11690463371653,169.11690463371653,170.09819799533776,171.90031469460058,174.1808488330098,176.49278236755421,{"$error":"#N/A"},{"$error":"#N/A"},{"$error":"#N/A"},{"$error":"#N/A"},{"$error":"#N/A"},{"$error":"#N/A"},null,0,0,0,0,0,0,0,0,0,0,0,0,null,270,270,270,270,270,270,270,270,270,270,270,270,null,804,23,"2028-08-07",270,270,270,270]
["2003-03-03","segunda-feira","Carnaval",null,null,835,24,"2028-09-07",270,178.29264714223098,178.29264714223098,5.3362989289669729,"2028-06-07",null,null,null,null,null,24,270,166.09367404891839,166.09367404891839,167.09469656745881,168.93362440179436,171.26180692682084,173.62324487192933,{"$error":"#N/A"},{"$error":"#N/A"},{"$error":"#N/A"},{"$error":"#N/A"},{"$error":"#N/A"},{"$error":"#N/A"},null,0,0,0,{"$f":"IF($I59<>0,0,X59*$B$1*MIN($F59,365))","v":0},0,0,0,0,0,0,0,0,null,270,270,270,270,270,270,270,270,270,270,270,270,null,835,24,"2028-09-07",270,270,270,270]
["2003-03-04","terça-feira","Carnaval",null,null,865,25,"2028-10-07",270,175.33002709423943,175.33002709423943,5.247627710930586,"2028-07-07",null,null,null,null,null,25,270,163.21943500749225,163.21943500749225,164.23858753030635,166.11139185419225,168.48351378451414,170.89070253834143,{"$error":"#N/A"},{"$error":"#N/A"},{"$error":"#N/A"},{"$error":"#N/A"},{"$error":"#N/A"},{"$error":"#N/A"},null,0,{"$f":"IF($I60<>0,0,V60*$B$1*MIN($F60,365))","v":0},{"$f":"IF($I60<>0,0,W60*$B$1*MIN($F60,365))","v":0},0,0,0,0,0,0,0,0,0,null,270,270,270,270,270,270,270,270,270,270,270,270,null,865,25,"2028-10-07",270,270,270,270]
["2003-04-18","sexta-feira","Paixão de Cristo",null,null,896,26,"2028-11-07",270,172.32036095539075,172.32036095539075,5.1575484033948449,"2028-08-07",null,null,null,null,null,26,270,160.30163096527153,160.30163096527153,161.33855191573963,163.2446079590384,165.65995171937314,168.11224739695086,{"$error":"#N/A"},{"$error":"#N/A"},{"$error":"#N/A"},{"$error":"#N/A"},{"$error":"#N/A"},{"$error":"#N/A"},null,0,0,0,0,0,0,0,0,0,0,0,0,null,270,270,270,270,270,270,270,270,270,270,270,270,null,896,26,"2028-11-07",270,270,270,270]
["2003-04-21","segunda-feira","Tiradentes",null,null,926,27,"2028-12-07",270,169.36235790253747,169.36235790253747,5.0690153720229469,"2028-09-07",null,null,null,null,null,27,270,157.52762281136097,157.52762281136097,158.58083126012562,160.51741704347049,162.97253462343264,165.4664390367534,{"$error":"#N/A"},{"$error":"#N/A"},{"$error":"#N/A"},{"$error":"#N/A"},{"$error":"#N/A"},{"$error":"#N/A"},null,0,0,0,0,0,0,0,0,0,0,0,0,null,270,270,270,270,270,270,270,270,270,270,270,270,null,926,27,"2028-12-07",270,270,270,270]
["2003-05-01","quinta-feira","Dia do Trabalho",null,null,957,28,"2029-01-07",270,166.54812902131553,166.54812902131553,4.9847855016079743,"2028-10-07",null,null,null,null,null,28,270,154.71156886178488,154.71156886178488,155.78069722732965,157.7471750935635,160.24132931980188,162.77617519301904,{"$error":"#N/A"},{"$error":"#N/A"},{"$error":"#N/A"},{"$error":"#N/A"},{"$error":"#N/A"},{"$error":"#N/A"},null,0,0,0,0,0,0,0,0,0,0,0,0,null,270,270,270,270,270,270,270,270,270,270,270,270,null,957,28,"2029-01-07",270,270,270,270]
["2003-06-19","quinta-feira","Corpus Christi",null,null,988,29,"2029-02-07",270,163.68921048516185,163.68921048516185,4.8992180698208943,"2028-11-07",null,null,null,null,null,29,270,151.94585630443831,151.94585630443831,153.03000643770071,155.02474253781682,157.55589542438915,160.12965145507923,{"$error":"#N/A"},{"$error":"#N/A"},{"$error":"#N/A"},{"$error":"#N/A"},{"$error":"#N/A"},{"$error":"#N/A"},null,0,0,0,0,0,0,0,0,0,0,0,0,null,270,270,270,270,270,270,270,270,270,270,270,270,null,988,29,"2029-02-07",270,270,270,270]
["2003-09-07","domingo","Independência do Brasil",null,null,1016,30,"2029-03-07",270,160.96925010319279,160.96925010319279,4.8178096555885608,"2028-12-07",null,null,null,null,null,30,270,149.49031396647925,149.49031396647925,150.58728254999315,152.60617778625175,155.16904542694061,157.77624670229923,{"$error":"#N/A"},{"$error":"#N/A"},{"$error":"#N/A"},{"$error":"#N/A"},{"$error":"#N/A"},{"$error":"#N/A"},null,0,0,0,0,0,0,0,0,0,0,0,0,null,270,270,270,270,270,270,270,270,270,270,270,270,null,1016,30,"2029-03-07",270,270,270,270]
["2003-10-12","domingo","Nossa Sr.a Aparecida - Padroeira do Brasil",null,null,1047,31,"2029-04-07",270,158.20609704002101,158.20609704002101,4.7351084844078288,"2029-01-07",null,null,null,null,null,31,270,146.81793955013464,146.81793955013464,147.9282942509418,149.97246959866021,152.56861633740954,155.21101514009095,{"$error":"#N/A"},{"$error":"#N/A"},{"$error":"#N/A"},{"$error":"#N/A"},{"$error":"#N/A"},{"$error":"#N/A"},null,0,0,0,0,0,0,0,0,0,0,0,0,null,270,270,270,270,270,270,270,270,270,270,270,270,null,1047,31,"2029-04-07",270,270,270,270]
["2003-11-02","domingo","Finados",null,null,1077,32,"2029-05-07",270,155.49037548843069,155.49037548843069,4.6538269383687298,"2029-02-07",null,null,null,null,null,32,270,144.27726570296301,144.27726570296301,145.39979187031662,147.46700518064165,150.09357331347033,152.76825080964488,{"$error":"#N/A"},{"$error":"#N/A"},{"$error":"#N/A"},{"$error":"#N/A"},{"$error":"#N/A"},{"$error":"#N/A"},null,0,0,0,0,0,0,0,0,0,0,0,0,null,270,270,270,270,270,270,270,270,270,270,270,270,null,1077,32,"2029-05-07",270,270,270,270]
["2003-11-15","sábado","Proclamação da República",null,null,1108,33,"2029-06-07",270,153.07755656951804,153.07755656951804,4.5816112681256751,"2029-03-07",null,null,null,null,null,33,270,{"$f":"$T68/((U$29)^($H68-$H$35))","v":141.69808272117322},141.69808272117322,142.8324014591156,144.92198987013532,147.57820246020449,150.28444258837513,{"$error":"#N/A"},{"$error":"#N/A"},{"$error":"#N/A"},{"$error":"#N/A"},{"$error":"#N/A"},{"$error":"#N/A"},null,{"$f":"IF($I68<>0,0,U68*$B$1*MIN($F68,365))","v":0},0,0,0,0,0,0,0,0,0,0,0,null,{"$f":"$T68","v":270},270,270,270,270,270,270,270,270,270,270,270,null,1108,33,"2029-06-07",270,270,270,270]
["2003-12-25","quinta-feira","Natal",null,null,1138,34,"2029-07-07",270,150.44987010724799,150.44987010724799,4.5029646123099321,"2029-04-07",null,null,null,null,null,34,270,139.24600762689556,139.24600762689556,140.39100193545761,142.5008995861669,145.18411638108043,147.91921435090435,{"$error":"#N/A"},{"$error":"#N/A"},{"$error":"#N/A"},{"$error":"#N/A"},{"$error":"#N/A"},{"$error":"#N/A"},null,0,0,0,0,0,0,0,0,0,0,0,0,null,270,270,270,270,270,270,270,270,270,270,270,270,null,1138,34,"2029-07-07",270,270,270,270]
["2004-01-01","quinta-feira","Confraternização Universal",null,null,1169,35,"2029-08-07",270,147.94990273034387,147.94990273034387,4.4281405887191916,"2029-05-07",null,null,null,null,null,35,270,136.75676629421841,136.75676629421841,137.91205401158805,140.04159032737056,142.75102156802387,145.51424500196322,{"$error":"#N/A"},{"$error":"#N/A"},{"$error":"#N/A"},{"$error":"#N/A"},{"$error":"#N/A"},{"$error":"#N/A"},null,0,0,0,0,0,0,0,0,0,0,0,0,null,270,270,270,270,270,270,270,270,270,270,270,270,null,1169,35,"2029-08-07",270,270,270,270]
["2004-02-23","segunda-feira","Carnaval",null,null,1200,36,"2029-09-07",270,145.41023613772919,145.41023613772919,4.3521283676022344,"2029-06-07",null,null,null,null,null,36,270,134.31202406437308,134.31202406437308,135.47687800133502,137.62472432365519,140.35870222350263,143.14837725043611,{"$error":"#N/A"},{"$error":"#N/A"},{"$error":"#N/A"},{"$error":"#N/A"},{"$error":"#N/A"},{"$error":"#N/A"},null,0,0,0,0,0,0,0,0,0,0,0,0,null,270,270,270,270,270,270,270,270,270,270,270,270,null,1200,36,"2029-09-07",270,270,270,270]
["2004-02-24","terça-feira","Carnaval",null,null,1230,37,"2029-10-07",270,142.99401041182384,142.99401041182384,4.2798107316258873,"2029-07-07",null,null,null,null,null,37,270,131.9877641820546,131.9877641820546,133.16120465242886,135.32554334227049,138.08173442286943,140.89545886321355,{"$error":"#N/A"},{"$error":"#N/A"},{"$error":"#N/A"},{"$error":"#N/A"},{"$error":"#N/A"},{"$error":"#N/A"},null,0,0,0,0,0,0,0,0,0,0,0,0,null,270,270,270,270,270,270,270,270,270,270,270,270,null,1230,37,"2029-10-07",270,270,270,270]
["2004-04-09","sexta-feira","Paixão de Cristo",null,null,1261,38,"2029-11-07",270,140.53941527870774,140.53941527870774,4.2063446992917228,"2029-08-07",null,null,null,null,null,38,270,129.62827536360351,129.62827536360351,130.80991655516985,132.99006782836301,135.76766618884656,138.60468642058021,{"$error":"#N/A"},{"$error":"#N/A"},{"$error":"#N/A"},{"$error":"#N/A"},{"$error":"#N/A"},{"$error":"#N/A"},null,0,0,0,0,0,0,0,0,0,0,0,0,null,270,270,270,270,270,270,270,270,270,270,270,270,null,1261,38,"2029-11-07",270,270,270,270]
["2004-04-21","quarta-feira","Tiradentes",null,null,1291,39,"2029-12-07",270,138.12695503816627,138.12695503816627,4.1341397642923159,"2029-09-07",null,null,null,null,null,39,270,127.38506741449719,127.38506741449719,128.57401444398849,130.76831417060487,133.56517642952375,136.42327820212842,{"$error":"#N/A"},{"$error":"#N/A"},{"$error":"#N/A"},{"$error":"#N/A"},{"$error":"#N/A"},{"$error":"#N/A"},null,0,0,0,0,0,0,0,0,0,0,0,0,null,270,270,270,270,270,270,270,270,270,270,270,270,null,1291,39,"2029-12-07",270,270,270,270]
["2004-05-01","sábado","Dia do Trabalho",null,null,1322,40,"2030-01-07",270,135.83175278096016,135.83175278096016,4.0654443607341371,"2029-10-07",null,null,null,null,null,40,270,125.10785903791188,125.10785903791188,126.30372445548889,128.5114882366571,131.32679976631729,134.20521745864809,{"$error":"#N/A"},{"$error":"#N/A"},{"$error":"#N/A"},{"$error":"#N/A"},{"$error":"#N/A"},{"$error":"#N/A"},null,0,0,0,0,0,0,0,0,0,0,0,0,null,270,270,270,270,270,270,270,270,270,270,270,270,null,1322,40,"2030-01-07",270,270,270,270]
["2004-06-10","quinta-feira","Corpus Christi",null,null,1353,41,"2030-02-07",270,133.5001029563378,133.5001029563378,3.9956580814831901,"2029-11-07",null,null,null,null,null,41,270,122.87135934167382,122.87135934167382,124.07352201231612,126.29361105974141,129.12593535158999,132.02321942767998,{"$error":"#N/A"},{"$error":"#N/A"},{"$error":"#N/A"},{"$error":"#N/A"},{"$error":"#N/A"},{"$error":"#N/A"},null,0,0,0,0,0,0,0,0,0,0,0,0,null,270,270,270,270,270,270,270,270,270,270,270,270,null,1353,41,"2030-02-07",270,270,270,270]
["2004-09-07","terça-feira","Independência do Brasil",null,null,1381,42,"2030-03-07",270,131.28178331294907,131.28178331294907,3.9292637745565657,"2029-12-07",null,null,null,null,null,42,270,120.88567949278378,120.88567949278378,122.09301267884182,124.32328509075973,127.16977726791873,130.08289126699839,{"$error":"#N/A"},{"$error":"#N/A"},{"$error":"#N/A"},{"$error":"#N/A"},{"$error":"#N/A"},{"$error":"#N/A"},null,0,0,0,0,0,0,0,0,0,0,0,0,null,270,270,270,270,270,270,270,270,270,270,270,270,null,1381,42,"2030-03-07",270,270,270,270]
["2004-10-12","terça-feira","Nossa Sr.a Aparecida - Padroeira do Brasil",null,null,1412,43,"2030-04-07",270,129.02823698986393,129.02823698986393,3.8618151331066275,"2030-01-07",null,null,null,null,null,43,270,118.72465789474643,118.72465789474643,119.93716069312593,122.17768876824108,125.03857908205123,127.96791676763004,{"$error":"#N/A"},{"$error":"#N/A"},{"$error":"#N/A"},{"$error":"#N/A"},{"$error":"#N/A"},{"$error":"#N/A"},null,0,0,0,0,0,0,0,0,0,0,0,0,null,270,270,270,270,270,270,270,270,270,270,270,270,null,1412,43,"2030-04-07",270,270,270,270]
["2004-11-02","terça-feira","Finados",null,null,1442,44,"2030-05-07",270,126.81337441178994,126.81337441178994,3.795524296144873,"2030-02-07",null,null,null,null,null,44,270,116.67013625895829,116.67013625895829,117.88710395534221,120.1365684699373,123.0101418430592,125.95391368776286,{"$error":"#N/A"},{"$error":"#N/A"},{"$error":"#N/A"},{"$error":"#N/A"},{"$error":"#N/A"},{"$error":"#N/A"},null,0,0,0,0,0,0,0,0,0,0,0,0,null,270,270,270,270,270,270,270,270,270,270,270,270,null,1442,44,"2030-05-07",270,270,270,270]
["2004-11-15","segunda-feira","Proclamação da República",null,null,1473,45,"2030-06-07",270,124.84555030698101,124.84555030698101,3.7366273206879419,"2030-03-07",null,null,null,null,null,45,270,114.58447412462232,114.58447412462232,115.80551761738414,118.06322734706612,120.94865367526189,123.90607086269452,{"$error":"#N/A"},{"$error":"#N/A"},{"$error":"#N/A"},{"$error":"#N/A"},{"$error":"#N/A"},{"$error":"#N/A"},null,0,0,0,0,0,0,0,0,0,0,0,0,null,270,270,270,270,270,270,270,270,270,270,270,270,null,1473,45,"2030-06-07",270,270,270,270]
["2004-12-25","sábado","Natal",null,null,1503,46,"2030-07-07",270,122.70248655702282,122.70248655702282,3.6724854226516932,"2030-04-07",null,null,null,null,null,46,270,112.60159807015397,112.60159807015397,113.82608205052517,116.09084390905174,118.98656521486866,121.95599451047225,{"$error":"#N/A"},{"$error":"#N/A"},{"$error":"#N/A"},{"$error":"#N/A"},{"$error":"#N/A"},{"$error":"#N/A"},null,0,0,0,0,0,0,0,0,0,0,0,0,null,270,270,270,270,270,270,270,270,270,270,270,270,null,1503,46,"2030-07-07",270,270,270,270]
["2005-01-01","sábado","Confraternização Universal",null,null,1534,47,"2030-08-07",270,120.66358673451781,120.66358673451781,3.6114611509641179,"2030-05-07",null,null,null,null,null,47,270,110.58866745319328,110.58866745319328,111.81620302771515,114.0873247164282,116.9925068986833,119.97315252470068,{"$error":"#N/A"},{"$error":"#N/A"},{"$error":"#N/A"},{"$error":"#N/A"},{"$error":"#N/A"},{"$error":"#N/A"},null,0,0,0,0,0,0,0,0,0,0,0,0,null,270,270,270,270,270,270,270,270,270,270,270,270,null,1534,47,"2030-08-07",270,270,270,270]
["2005-02-07","segunda-feira","Carnaval",null,null,1565,48,"2030-09-07",270,118.59230939996453,118.59230939996453,3.5494678203409382,"2030-06-07",null,null,null,null,null,48,270,108.61172113608387,108.61172113608387,109.84181335509236,112.11838266201852,115.03186637686129,118.02254890782865,{"$error":"#N/A"},{"$error":"#N/A"},{"$error":"#N/A"},{"$error":"#N/A"},{"$error":"#N/A"},{"$error":"#N/A"},null,0,0,0,0,0,0,0,0,0,0,0,0,null,270,270,270,270,270,270,270,270,270,270,270,270,null,1565,48,"2030-09-07",270,270,270,270]
["2005-02-08","terça-feira","Carnaval",null,null,1595,49,"2030-10-07",270,116.62170680362937,116.62170680362937,3.4904876846326269,"2030-07-07",null,null,null,null,null,49,270,{"$f":"$T84/((U$29)^($H84-$H$35))","v":106.73220314099227},106.73220314099227,107.96431393574936,110.24531476417556,113.16576294588366,116.16506944736544,{"$error":"#N/A"},{"$error":"#N/A"},{"$error":"#N/A"},{"$error":"#N/A"},{"$error":"#N/A"},{"$error":"#N/A"},null,0,0,0,0,0,0,0,0,0,0,0,0,null,{"$f":"$T84","v":270},270,270,270,270,270,270,270,270,270,270,270,null,1595,49,"2030-10-07",270,270,270,270]
["2005-03-25","sexta-feira","Paixão de Cristo",null,null,1626,50,"2030-11-07",270,114.61981124792425,114.61981124792425,3.430570950650373,"2030-08-07",null,null,null,null,null,50,270,104.82419718725509,104.82419718725509,106.05793882485678,108.3426788922209,111.26925361895084,114.27638018772818,{"$error":"#N/A"},{"$error":"#N/A"},{"$error":"#N/A"},{"$error":"#N/A"},{"$error":"#N/A"},{"$error":"#N/A"},null,0,0,0,0,0,0,0,0,0,0,0,0,null,270,270,270,270,270,270,270,270,270,270,270,270,null,1626,50,"2030-11-07",270,270,270,270]
["2005-04-21","quinta-feira","Tiradentes",null,null,1656,51,"2030-12-07",270,112.65227967063952,112.65227967063952,3.3716827305422408,"2030-09-07",null,null,null,null,null,51,270,103.01022202072933,103.01022202072933,104.24511625321313,106.53268851436226,109.46418914003169,112.47785921881942,{"$error":"#N/A"},{"$error":"#N/A"},{"$error":"#N/A"},{"$error":"#N/A"},{"$error":"#N/A"},{"$error":"#N/A"},null,0,0,0,0,0,0,0,0,0,0,0,0,null,270,270,270,270,270,270,270,270,270,270,270,270,null,1656,51,"2030-12-07",270,270,270,270]
["2005-05-01","domingo","Dia do Trabalho",null,null,1687,52,"2031-01-07",270,110.78038025384561,110.78038025384561,3.3156567809975992,"2030-10-07",null,null,null,null,null,52,270,101.16875233185101,101.16875233185101,102.40441271134188,104.69412589483713,107.62971332097604,110.64911908493758,{"$error":"#N/A"},{"$error":"#N/A"},{"$error":"#N/A"},{"$error":"#N/A"},{"$error":"#N/A"},{"$error":"#N/A"},null,0,0,0,0,0,0,{"$f":"IF($I87<>0,0,AA87*$B$1*MIN($F87,365))","v":0},0,0,0,0,0,null,270,270,270,270,270,270,270,270,270,270,270,270,null,1687,52,"2031-01-07",270,270,270,270]
["2005-05-26","quinta-feira","Corpus Christi",null,null,1718,53,"2031-02-07",270,108.87875527366144,108.87875527366144,3.2587411453406867,"2030-11-07",null,null,null,null,null,53,270,99.360201809134438,99.360201809134438,100.59621131106576,102.88729355972563,105.82598090354917,108.8501118291572,{"$error":"#N/A"},{"$error":"#N/A"},{"$error":"#N/A"},{"$error":"#N/A"},{"$error":"#N/A"},{"$error":"#N/A"},null,0,0,0,{"$f":"IF($I88<>0,0,X88*$B$1*MIN($F88,365))","v":0},{"$f":"IF($I88<>0,0,Y88*$B$1*MIN($F88,365))","v":0},{"$f":"IF($I88<>0,0,Z88*$B$1*MIN($F88,365))","v":0},0,0,0,0,0,0,null,270,270,270,270,270,270,270,270,270,270,270,270,null,1718,53,"2031-02-07",270,270,270,270]
["2005-09-07","quarta-feira","Independência do Brasil",null,null,1746,54,"2031-03-07",270,107.06955905416291,107.06955905416291,3.2045919024910954,"2030-12-07",null,null,null,null,null,54,270,97.754477321579841,97.754477321579841,98.990455851057604,101.28213313491936,104.22279911483061,107.2503558302426,{"$error":"#N/A"},{"$error":"#N/A"},{"$error":"#N/A"},{"$error":"#N/A"},{"$error":"#N/A"},{"$error":"#N/A"},null,0,0,0,0,0,0,0,0,0,0,0,0,null,270,270,270,270,270,270,270,270,270,270,270,270,null,1746,54,"2031-03-07",270,270,270,270]
["2005-10-12","quarta-feira","Nossa Sr.a Aparecida - Padroeira do Brasil",null,null,1777,55,"2031-04-07",270,105.23163299136951,105.23163299136951,3.1495827754316892,"2031-01-07",null,null,null,null,null,55,270,96.006962333177896,96.006962333177896,97.24253624344847,99.53418565884931,102.47616209798971,105.50660793672769,{"$error":"#N/A"},{"$error":"#N/A"},{"$error":"#N/A"},{"$error":"#N/A"},{"$error":"#N/A"},{"$error":"#N/A"},null,0,0,0,0,0,0,0,0,0,0,0,0,null,270,270,270,270,270,270,270,270,270,270,270,270,null,1777,55,"2031-04-07",270,270,270,270]
["2005-11-02","quarta-feira","Finados",null,null,1807,56,"2031-05-07",270,103.42525625260564,103.42525625260564,3.0955179196404869,"2031-02-07",null,null,null,null,null,56,270,94.345568779408538,94.345568779408538,95.580393205602732,97.871351398587706,100.81374346819909,103.84610865926622,{"$error":"#N/A"},{"$error":"#N/A"},{"$error":"#N/A"},{"$error":"#N/A"},{"$error":"#N/A"},{"$error":"#N/A"},null,0,0,0,0,0,0,0,0,0,0,0,0,null,270,270,270,270,270,270,270,270,270,270,270,270,null,1807,56,"2031-05-07",270,270,270,270]
["2005-11-15","terça-feira","Proclamação da República",null,null,1838,57,"2031-06-07",270,101.82035682268403,101.82035682268403,3.047483279702933,"2031-03-07",null,null,null,null,null,57,270,92.658993391265966,92.658993391265966,93.892686628733969,96.182267881469869,99.124237739669852,102.15770928918926,{"$error":"#N/A"},{"$error":"#N/A"},{"$error":"#N/A"},{"$error":"#N/A"},{"$error":"#N/A"},{"$error":"#N/A"},null,0,0,0,0,0,0,0,0,0,0,0,0,null,270,270,270,270,270,270,270,270,270,270,270,270,null,1838,57,"2031-06-07",270,270,270,270]
["2005-12-25","domingo","Natal",null,null,1868,58,"2031-07-07",270,100.07253709520519,100.07253709520519,2.9951710352594918,"2031-04-07",null,null,null,null,null,58,270,91.055536198393057,91.055536198393057,92.287801756193502,94.575431303621698,97.516195673021699,100.54991613026644,{"$error":"#N/A"},{"$error":"#N/A"},{"$error":"#N/A"},{"$error":"#N/A"},{"$error":"#N/A"},{"$error":"#N/A"},null,0,0,0,0,0,0,0,0,0,0,0,0,null,270,270,270,270,270,270,270,270,270,270,270,270,null,1868,58,"2031-07-07",270,270,270,270]
["2006-01-01","domingo","Confraternização Universal",null,null,1899,59,"2031-08-07",270,98.409670401576861,98.409670401576861,2.9454014351191957,"2031-05-07",null,null,null,null,null,59,270,89.427775315787031,89.427775315787031,90.658233967602769,92.943229440088828,95.881952507892947,98.915108459112716,{"$error":"#N/A"},{"$error":"#N/A"},{"$error":"#N/A"},{"$error":"#N/A"},{"$error":"#N/A"},{"$error":"#N/A"},null,0,0,0,0,0,0,0,0,0,0,0,0,null,270,270,270,270,270,270,270,270,270,270,270,270,null,1899,59,"2031-08-07",270,270,270,0]
["2006-02-27","segunda-feira","Carnaval",null,null,1930,60,"2031-09-07",270,96.72039756194124,96.72039756194124,2.8948414990289013,"2031-06-07",null,null,null,null,null,60,270,87.82911321840119,87.82911321840119,89.057440200356965,91.33919644543235,94.275097108502393,97.306880582597529,{"$error":"#N/A"},{"$error":"#N/A"},{"$error":"#N/A"},{"$error":"#N/A"},{"$error":"#N/A"},{"$error":"#N/A"},null,0,0,0,0,0,0,0,0,0,0,0,0,null,270,270,270,270,270,270,270,270,270,270,270,270,null,1930,60,"2031-09-07",270,270,0,0]
["2006-02-28","terça-feira","Carnaval",null,null,1960,61,"2031-10-07",0,0,0,0,"2031-07-07",null,null,null,null,null,61,270,86.309236753317904,86.309236753317904,87.53520301984166,89.813269005037085,92.745720182689823,95.775431433968478,{"$error":"#N/A"},{"$error":"#N/A"},{"$error":"#N/A"},{"$error":"#N/A"},{"$error":"#N/A"},{"$error":"#N/A"},null,2.5832354560268049,2.5832354560268049,2.6199286263838606,2.6881111413207601,2.7758794050679065,2.8665586628186768,{"$error":"#N/A"},{"$error":"#N/A"},{"$error":"#N/A"},{"$error":"#N/A"},{"$error":"#N/A"},{"$error":"#N/A"},null,270,270,270,270,270,270,270,270,270,270,270,270,null,1960,61,"2031-10-07",270,270,0,0]
["2006-04-14","sexta-feira","Paixão de Cristo",null,null,1991,62,"2031-11-07",0,0,0,0,"2031-08-07",null,null,null,null,null,62,270,84.766323436234913,84.766323436234913,85.989554033795542,88.263253498690815,91.19142391161985,94.218250522813278,{"$error":"#N/A"},{"$error":"#N/A"},{"$error":"#N/A"},{"$error":"#N/A"},{"$error":"#N/A"},{"$error":"#N/A"},null,2.5370560604465111,2.5370560604465111,2.5736673522315008,2.6417191772158164,2.7293593176747821,2.8199522381478013,{"$error":"#N/A"},{"$error":"#N/A"},{"$error":"#N/A"},{"$error":"#N/A"},{"$error":"#N/A"},{"$error":"#N/A"},null,270,270,270,270,270,270,270,270,270,270,270,270,null,1991,62,"2031-11-07",0,270,0,0]
["2006-04-21","sexta-feira","Tiradentes",null,null,2021,63,"2031-12-07",0,0,0,0,"2031-09-07",null,null,null,null,null,63,270,83.299448327271875,83.299448327271875,84.519755485895573,86.788713260397003,89.712071846865015,92.735411296187351,{"$error":"#N/A"},{"$error":"#N/A"},{"$error":"#N/A"},{"$error":"#N/A"},{"$error":"#N/A"},{"$error":"#N/A"},null,2.4931524884352472,2.4931524884352472,2.5296762816928546,2.5975861878836821,2.6850823103766701,2.7755708600948874,{"$error":"#N/A"},{"$error":"#N/A"},{"$error":"#N/A"},{"$error":"#N/A"},{"$error":"#N/A"},{"$error":"#N/A"},null,270,270,270,270,270,270,270,270,270,270,270,270,null,2021,63,"2031-12-07",0,0,0,0]
["2006-05-01","segunda-feira","Dia do Trabalho",null,null,2052,64,"2032-01-07",0,0,0,0,"2031-10-07",null,null,null,null,null,64,270,81.810339710807668,81.810339710807668,83.027351631665297,85.290896146960094,88.208615531394344,91.22765706217892,{"$error":"#N/A"},{"$error":"#N/A"},{"$error":"#N/A"},{"$error":"#N/A"},{"$error":"#N/A"},{"$error":"#N/A"},null,2.4485834675444735,2.4485834675444735,2.4850086343357423,2.5527565216785155,2.6400838628546328,2.7304437758710152,{"$error":"#N/A"},{"$error":"#N/A"},{"$error":"#N/A"},{"$error":"#N/A"},{"$error":"#N/A"},{"$error":"#N/A"},null,270,270,270,270,270,270,270,270,270,270,270,270,null,2052,64,"2032-01-07",0,0,0,0]
["2006-06-15","quinta-feira","Corpus Christi",null,null,2083,65,"2032-02-07",0,0,0,0,"2031-11-07",null,null,null,null,null,65,{"$f":"IF($G100>$P$3,0,$J$9)","v":270},{"$f":"$T100/((U$29)^($H100-$H$35))","v":80.34785125229358},80.34785125229358,81.561299832659486,83.81892866328522,86.730355166100665,89.744416903197447,{"$error":"#N/A"},{"$error":"#N/A"},{"$error":"#N/A"},{"$error":"#N/A"},{"$error":"#N/A"},{"$error":"#N/A"},null,2.4048111879811471,2.4048111879811471,2.4411297039914985,2.5087005348921267,2.5958395301213928,2.6860503979126995,{"$error":"#N/A"},{"$error":"#N/A"},{"$error":"#N/A"},{"$error":"#N/A"},{"$error":"#N/A"},{"$error":"#N/A"},null,{"$f":"$T100","v":270},270,270,270,270,270,270,270,270,270,270,270,null,2083,65,"2032-02-07",0,0,0,0]
["2006-09-07","quinta-feira","Independência do Brasil",null,null,{"$f":"H101-$H$35","v":2112},66,"2032-03-07",0,{"$f":"I101/($J$32^(M101-$M$35))","v":0},{"$f":"I101/($I$32^(M101-$M$35))","v":0},{"$f":"J101*0.0082%*MIN(F101,365)","v":0},"2031-12-07",null,null,null,null,null,{"$f":"S100+1","v":66},270,79.003394630359068,79.003394630359068,80.213276412664541,82.4649333749649,85.369902359201333,88.378709262734745,{"$error":"#N/A"},{"$error":"#N/A"},{"$error":"#N/A"},{"$error":"#N/A"},{"$error":"#N/A"},{"$error":"#N/A"},null,{"$f":"IF($I101<>0,0,U101*$B$1*MIN($F101,365))","v":2.3645716012866469},2.3645716012866469,2.4007833630310498,2.4681754559126996,2.555121177610896,2.6451747682336513,{"$error":"#N/A"},{"$error":"#N/A"},{"$error":"#N/A"},{"$error":"#N/A"},{"$error":"#N/A"},{"$error":"#N/A"},null,270,270,270,270,270,270,270,270,270,270,270,270,null,{"$f":"BJ101-$H$35","v":2112},66,"2032-03-07",0,0,{"$f":"I102","v":0},{"$f":"BM102","v":0}]
["2006-10-12","quinta-feira","Nossa Sr.a Aparecida - Padroeira do Brasil",null,null,2143,{"$f":"G101+1","v":67},{"$f":"EDATE(H101,1)","v":"2032-04-07"},{"$f":"IF($G102>$I$10,0,$I$9)","v":0},0,0,0,{"$f":"EDATE(M101,1)","v":"2032-01-07"},null,null,null,null,null,67,270,77.591084728716282,77.591084728716282,78.79691402270619,81.041736926633419,83.939215092585258,86.941789199249072,{"$error":"#N/A"},{"$error":"#N/A"},{"$error":"#N/A"},{"$error":"#N/A"},{"$error":"#N/A"},{"$error":"#N/A"},null,2.3223011659304786,2.3223011659304786,2.3583916366995963,2.4255791862141383,2.5123007077210771,2.6021677507335248,{"$error":"#N/A"},{"$error":"#N/A"},{"$error":"#N/A"},{"$error":"#N/A"},{"$error":"#N/A"},{"$error":"#N/A"},null,270,270,270,270,270,270,270,270,270,270,270,270,null,2143,{"$f":"BI101+1","v":67},{"$f":"EDATE(BJ101,1)","v":"2032-04-07"},{"$f":"I101","v":0},{"$f":"BK101","v":0},0,0]
["2006-11-02","quinta-feira","Finados",null,null,2173,68,"2032-05-07",0,0,0,0,"2032-02-07",null,null,null,null,null,68,270,76.248376607706206,76.248376607706206,77.450057522391589,79.687840516262412,82.577511921007797,85.573469423172639,{"$error":"#N/A"},{"$error":"#N/A"},{"$error":"#N/A"},{"$error":"#N/A"},{"$error":"#N/A"},{"$error":"#N/A"},null,2.2821139118686466,2.2821139118686466,2.3180802216451801,2.3850570666517341,2.4715449317957634,2.5612139398355573,{"$error":"#N/A"},{"$error":"#N/A"},{"$error":"#N/A"},{"$error":"#N/A"},{"$error":"#N/A"},{"$error":"#N/A"},null,270,270,270,270,270,270,270,270,270,270,270,270,null,2173,68,"2032-05-07",0,0,0,0]
["2006-11-15","quarta-feira","Proclamação da República",null,null,2204,69,"2032-06-07",0,0,0,0,"2032-03-07",null,null,null,null,null,69,270,74.885316985128043,74.885316985128043,76.082486548099524,78.312571696456644,81.193621444981176,84.182158821988253,{"$error":"#N/A"},{"$error":"#N/A"},{"$error":"#N/A"},{"$error":"#N/A"},{"$error":"#N/A"},{"$error":"#N/A"},null,2.2413175373648824,2.2413175373648824,2.2771488223846186,2.3438952708749476,2.4301250898482865,2.5195720135421085,{"$error":"#N/A"},{"$error":"#N/A"},{"$error":"#N/A"},{"$error":"#N/A"},{"$error":"#N/A"},{"$error":"#N/A"},null,270,270,270,270,270,270,270,270,270,270,270,270,null,2204,69,"2032-06-07",0,0,0,0]
["2006-12-25","segunda-feira","Natal",null,null,2234,70,"2032-07-07",0,0,0,0,"2032-04-07",null,null,null,null,null,70,270,73.589431979629069,73.589431979629069,74.782027096884477,77.004269163371262,79.876458641974963,82.857271057774511,{"$error":"#N/A"},{"$error":"#N/A"},{"$error":"#N/A"},{"$error":"#N/A"},{"$error":"#N/A"},{"$error":"#N/A"},null,2.2025316991502981,2.2025316991502981,2.2382260710097523,2.3047377760597016,2.3907024071543108,2.4799181227591909,{"$error":"#N/A"},{"$error":"#N/A"},{"$error":"#N/A"},{"$error":"#N/A"},{"$error":"#N/A"},{"$error":"#N/A"},null,270,270,270,270,270,270,270,270,270,270,270,270,null,2234,70,"2032-07-07",0,0,0,0]
["2007-01-01","segunda-feira","Confraternização Universal",null,null,2265,71,"2032-08-07",0,0,0,0,"2032-05-07",null,null,null,null,null,71,270,72.273905173124476,72.273905173124476,73.461566752140996,75.675313959086296,78.537834265896606,81.510122223153658,{"$error":"#N/A"},{"$error":"#N/A"},{"$error":"#N/A"},{"$error":"#N/A"},{"$error":"#N/A"},{"$error":"#N/A"},null,2.1631579818316156,2.1631579818316156,2.1987046928915799,2.2649621467954528,2.3506373795782856,2.4395979581389891,{"$error":"#N/A"},{"$error":"#N/A"},{"$error":"#N/A"},{"$error":"#N/A"},{"$error":"#N/A"},{"$error":"#N/A"},null,270,270,270,270,270,270,270,270,270,270,270,270,null,2265,71,"2032-08-07",0,0,0,0]
["2007-02-19","segunda-feira","Carnaval",null,null,2296,72,"2032-09-07",0,0,0,0,"2032-06-07",null,null,null,null,null,72,270,70.981895476781972,70.981895476781972,72.164422377687799,74.369294131686104,77.221643473513538,80.184876233744234,{"$error":"#N/A"},{"$error":"#N/A"},{"$error":"#N/A"},{"$error":"#N/A"},{"$error":"#N/A"},{"$error":"#N/A"},null,2.1244881316200845,2.1244881316200845,2.1598811617641962,2.2258729733613651,2.3112437891622601,2.3999333456759651,{"$error":"#N/A"},{"$error":"#N/A"},{"$error":"#N/A"},{"$error":"#N/A"},{"$error":"#N/A"},{"$error":"#N/A"},null,270,270,270,270,270,270,270,270,270,270,270,270,null,2296,72,"2032-09-07",0,0,0,0]
["2007-02-20","terça-feira","Carnaval",null,null,2326,73,"2032-10-07",0,0,0,0,"2032-07-07",null,null,null,null,null,73,270,69.75355889875128,69.75355889875128,70.93093344507767,73.126868633601504,75.968916047883894,78.922899077495231,{"$error":"#N/A"},{"$error":"#N/A"},{"$error":"#N/A"},{"$error":"#N/A"},{"$error":"#N/A"},{"$error":"#N/A"},null,2.0877240178396259,2.0877240178396259,2.1229628380111749,2.188687178203693,2.2737496573131653,2.362162369389432,{"$error":"#N/A"},{"$error":"#N/A"},{"$error":"#N/A"},{"$error":"#N/A"},{"$error":"#N/A"},{"$error":"#N/A"},null,270,270,270,270,270,270,270,270,270,270,270,270,null,2326,73,"2032-10-07",0,0,0,0]
["2007-04-06","sexta-feira","Paixão de Cristo",null,null,2357,74,"2032-11-07",0,0,0,0,"2032-08-07",null,null,null,null,null,74,270,68.506604354981917,68.506604354981917,69.67847361661488,71.864830389494443,74.695776945638954,77.639717889413205,{"$error":"#N/A"},{"$error":"#N/A"},{"$error":"#N/A"},{"$error":"#N/A"},{"$error":"#N/A"},{"$error":"#N/A"},null,2.050402668344609,2.050402668344609,2.0854767153452833,2.1509143735575686,2.235644603982974,2.3237567564301371,{"$error":"#N/A"},{"$error":"#N/A"},{"$error":"#N/A"},{"$error":"#N/A"},{"$error":"#N/A"},{"$error":"#N/A"},null,270,270,270,270,270,270,270,270,270,270,270,270,null,2357,74,"2032-11-07",0,0,0,0]
["2007-04-21","sábado","Tiradentes",null,null,2387,75,"2032-12-07",0,0,0,0,"2032-09-07",null,null,null,null,null,75,270,67.321102511157136,67.321102511157136,68.487476401984154,70.664244869167575,73.484025367331611,76.417797310419715,{"$error":"#N/A"},{"$error":"#N/A"},{"$error":"#N/A"},{"$error":"#N/A"},{"$error":"#N/A"},{"$error":"#N/A"},null,2.0149205981589331,2.0149205981589331,2.0498301687113858,2.1149808489341857,2.1993768792442352,2.2871846735008621,{"$error":"#N/A"},{"$error":"#N/A"},{"$error":"#N/A"},{"$error":"#N/A"},{"$error":"#N/A"},{"$error":"#N/A"},null,270,270,270,270,270,270,270,270,270,270,270,270,null,2387,75,"2032-12-07",0,0,0,0]
["2007-05-01","terça-feira","Dia do Trabalho",null,null,2418,76,"2033-01-07",0,0,0,0,"2032-10-07",null,null,null,null,null,76,270,66.117631950039254,66.117631950039254,67.278161808476113,69.444707082548121,72.252529764228115,75.175345739461704,{"$error":"#N/A"},{"$error":"#N/A"},{"$error":"#N/A"},{"$error":"#N/A"},{"$error":"#N/A"},{"$error":"#N/A"},null,1.978900724264675,1.978900724264675,2.0136353829276903,2.0784800829806653,2.1625182158433476,2.2499980979820888,{"$error":"#N/A"},{"$error":"#N/A"},{"$error":"#N/A"},{"$error":"#N/A"},{"$error":"#N/A"},{"$error":"#N/A"},null,270,270,270,270,270,270,270,270,270,270,270,270,null,2418,76,"2033-01-07",0,0,0,0]
["2007-06-07","quinta-feira","Corpus Christi",null,null,2449,77,"2033-02-07",0,0,0,0,"2032-11-07",null,null,null,null,null,77,270,64.935675317503211,64.935675317503211,66.090200634058704,68.246216324956507,71.041672407503754,73.953094775698716,{"$error":"#N/A"},{"$error":"#N/A"},{"$error":"#N/A"},{"$error":"#N/A"},{"$error":"#N/A"},{"$error":"#N/A"},null,1.9435247622528711,1.9435247622528711,1.9780797049773771,2.0426092546059484,2.1262772551565874,2.2134161266366625,{"$error":"#N/A"},{"$error":"#N/A"},{"$error":"#N/A"},{"$error":"#N/A"},{"$error":"#N/A"},{"$error":"#N/A"},null,270,270,270,270,270,270,270,270,270,270,270,270,null,2449,77,"2033-02-07",0,0,0,0]
["2007-09-07","sexta-feira","Independência do Brasil",null,null,2477,78,"2033-03-07",0,0,0,0,"2032-12-07",null,null,null,null,null,78,270,63.886273222150152,63.886273222150152,65.035243403184353,67.181496651637516,69.965445998153228,72.866215717720252,{"$error":"#N/A"},{"$error":"#N/A"},{"$error":"#N/A"},{"$error":"#N/A"},{"$error":"#N/A"},{"$error":"#N/A"},null,1.9121161575389543,1.9121161575389543,1.9465048350573078,2.0107421947835111,2.0940657987247264,2.1808858364313668,{"$error":"#N/A"},{"$error":"#N/A"},{"$error":"#N/A"},{"$error":"#N/A"},{"$error":"#N/A"},{"$error":"#N/A"},null,270,270,270,270,270,270,270,270,270,270,270,270,null,2477,78,"2033-03-07",0,0,0,0]
["2007-10-12","sexta-feira","Nossa Sr.a Aparecida - Padroeira do Brasil",null,null,2508,79,"2033-04-07",0,0,0,0,"2033-01-07",null,null,null,null,null,79,270,62.744205635398295,62.744205635398295,63.886886461570697,66.022064836014039,68.792917156882012,71.681508131600111,{"$error":"#N/A"},{"$error":"#N/A"},{"$error":"#N/A"},{"$error":"#N/A"},{"$error":"#N/A"},{"$error":"#N/A"},null,1.8779340746674709,1.8779340746674709,1.912134511794811,1.9760404005419001,2.0589720105054785,2.1454275383787915,{"$error":"#N/A"},{"$error":"#N/A"},{"$error":"#N/A"},{"$error":"#N/A"},{"$error":"#N/A"},{"$error":"#N/A"},null,270,270,270,270,270,270,270,270,270,270,270,270,null,2508,79,"2033-04-07",0,0,0,0]
["2007-11-02","sexta-feira","Finados",null,null,2538,80,"2033-05-07",0,0,0,0,"2033-02-07",null,null,null,null,null,80,270,61.658421685508536,61.658421685508536,62.794883438573734,64.919089505318937,67.676924669088734,70.553359906692194,{"$error":"#N/A"},{"$error":"#N/A"},{"$error":"#N/A"},{"$error":"#N/A"},{"$error":"#N/A"},{"$error":"#N/A"},null,1.8454365610472703,1.8454365610472703,1.879450861316512,1.9430283488941957,2.0255703553458257,2.1116620620072974,{"$error":"#N/A"},{"$error":"#N/A"},{"$error":"#N/A"},{"$error":"#N/A"},{"$error":"#N/A"},{"$error":"#N/A"},null,270,270,270,270,270,270,270,270,270,270,270,270,null,2538,80,"2033-05-07",0,0,0,0]
["2007-11-15","quinta-feira","Proclamação da República",null,null,2569,81,"2033-06-07",0,0,0,0,"2033-03-07",null,null,null,null,null,81,270,{"$f":"$T116/((U$29)^($H116-$H$35))","v":60.556180447982705},60.556180447982705,61.686085554210393,63.798702768416121,66.542748434935362,69.406256274584734,{"$error":"#N/A"},{"$error":"#N/A"},{"$error":"#N/A"},{"$error":"#N/A"},{"$error":"#N/A"},{"$error":"#N/A"},null,1.8124464808081224,1.8124464808081224,1.8462645406375171,1.9094951738586945,1.9916244606576152,2.0773292502983209,{"$error":"#N/A"},{"$error":"#N/A"},{"$error":"#N/A"},{"$error":"#N/A"},{"$error":"#N/A"},{"$error":"#N/A"},null,{"$f":"$T116","v":270},270,270,270,270,270,270,270,270,270,270,270,null,2569,81,"2033-06-07",0,0,0,0]
["2007-12-25","terça-feira","Natal",null,null,2599,82,"2033-07-07",0,0,0,0,"2033-04-07",null,null,null,null,null,82,270,59.508260116038109,59.508260116038109,60.631700286232608,62.732871285279465,65.463259289255504,68.313916745819199,{"$error":"#N/A"},{"$error":"#N/A"},{"$error":"#N/A"},{"$error":"#N/A"},{"$error":"#N/A"},{"$error":"#N/A"},null,1.7810822252730207,1.7810822252730207,1.814706789566942,1.8775948375684146,1.9593153505274172,2.0446355282023689,{"$error":"#N/A"},{"$error":"#N/A"},{"$error":"#N/A"},{"$error":"#N/A"},{"$error":"#N/A"},{"$error":"#N/A"},null,270,270,270,270,270,270,270,270,270,270,270,270,null,2599,82,"2033-07-07",0,0,0,0]
["2008-01-01","terça-feira","Confraternização Universal",null,null,2630,83,"2033-08-07",0,0,0,0,"2033-05-07",null,null,null,null,null,83,270,58.444456397417653,58.444456397417653,59.561098712961289,61.650214743244952,64.366181174977569,67.20322347584235,{"$error":"#N/A"},{"$error":"#N/A"},{"$error":"#N/A"},{"$error":"#N/A"},{"$error":"#N/A"},{"$error":"#N/A"},null,1.7492425799747104,1.7492425799747104,1.7826636844789314,1.8451909272653215,1.9264798025670786,2.0113924786319615,{"$error":"#N/A"},{"$error":"#N/A"},{"$error":"#N/A"},{"$error":"#N/A"},{"$error":"#N/A"},{"$error":"#N/A"},null,270,270,270,270,270,270,270,270,270,270,270,270,null,2630,83,"2033-08-07",0,0,0,0]
["2008-02-04","segunda-feira","Carnaval",null,null,2661,84,"2033-09-07",0,0,0,0,"2033-06-07",null,null,null,null,null,84,270,57.399669842961366,57.399669842961366,58.509401239744555,60.586242906118649,63.287488646780986,66.110588598631395,{"$error":"#N/A"},{"$error":"#N/A"},{"$error":"#N/A"},{"$error":"#N/A"},{"$error":"#N/A"},{"$error":"#N/A"},null,1.7179721183998338,1.7179721183998338,1.7511863791055546,1.8133462501801312,1.8941945351981548,1.9786899167570375,{"$error":"#N/A"},{"$error":"#N/A"},{"$error":"#N/A"},{"$error":"#N/A"},{"$error":"#N/A"},{"$error":"#N/A"},null,270,270,270,270,270,270,270,270,270,270,270,270,null,2661,84,"2033-09-07",0,0,0,0]
["2008-02-05","terça-feira","Carnaval",null,null,2691,85,"2033-10-07",0,0,0,0,"2033-07-07",null,null,null,null,null,85,270,56.406372699212106,56.406372699212106,57.509314264681578,59.57407929883172,62.260807924112349,65.070117421068602,{"$error":"#N/A"},{"$error":"#N/A"},{"$error":"#N/A"},{"$error":"#N/A"},{"$error":"#N/A"},{"$error":"#N/A"},null,1.6882427348874183,1.6882427348874183,1.7212537759419198,1.7830521934140333,1.8634659811686827,1.9475486144125833,{"$error":"#N/A"},{"$error":"#N/A"},{"$error":"#N/A"},{"$error":"#N/A"},{"$error":"#N/A"},{"$error":"#N/A"},null,270,270,270,270,270,270,270,270,270,270,270,270,null,2691,85,"2033-10-07",0,0,0,0]
["2008-03-21","sexta-feira","Paixão de Cristo",null,null,2722,86,"2033-11-07",0,0,0,0,"2033-08-07",null,null,null,null,null,86,270,55.398020095484384,55.398020095484384,56.493846084853814,58.545937825834969,61.21739868215888,64.012164006318642,{"$error":"#N/A"},{"$error":"#N/A"},{"$error":"#N/A"},{"$error":"#N/A"},{"$error":"#N/A"},{"$error":"#N/A"},null,1.6580627414578475,1.6580627414578475,1.6908608133196747,1.7522799191272407,1.8322367425570154,1.915884068709117,{"$error":"#N/A"},{"$error":"#N/A"},{"$error":"#N/A"},{"$error":"#N/A"},{"$error":"#N/A"},{"$error":"#N/A"},null,270,270,270,270,270,270,270,270,270,270,270,270,null,2722,86,"2033-11-07",0,0,0,0]
["2008-04-21","segunda-feira","Tiradentes",null,null,2752,87,"2033-12-07",0,0,0,0,"2033-09-07",null,null,null,null,null,87,270,54.439361356143991,54.439361356143991,55.528210504185871,57.567859886365831,60.224299975561841,63.004718556598718,{"$error":"#N/A"},{"$error":"#N/A"},{"$error":"#N/A"},{"$error":"#N/A"},{"$error":"#N/A"},{"$error":"#N/A"},null,1.6293700853893895,1.6293700853893895,1.661959340390283,1.7230060463989294,1.8025132982685659,1.8857312263989998,{"$error":"#N/A"},{"$error":"#N/A"},{"$error":"#N/A"},{"$error":"#N/A"},{"$error":"#N/A"},{"$error":"#N/A"},null,270,270,270,270,270,270,270,270,270,270,270,270,null,2752,87,"2033-12-07",0,0,0,0]
["2008-05-01","quinta-feira","Dia do Trabalho",null,null,2783,88,"2034-01-07",0,0,0,0,"2033-10-07",null,null,null,null,null,88,270,53.466172173044676,53.466172173044676,54.547723576620328,56.574342152521488,59.215019927971206,61.980345775603389,{"$error":"#N/A"},{"$error":"#N/A"},{"$error":"#N/A"},{"$error":"#N/A"},{"$error":"#N/A"},{"$error":"#N/A"},null,1.6002425331392272,1.6002425331392272,1.6326133666482463,1.6932700606249682,1.7723055464441781,1.8550717490638096,{"$error":"#N/A"},{"$error":"#N/A"},{"$error":"#N/A"},{"$error":"#N/A"},{"$error":"#N/A"},{"$error":"#N/A"},null,270,270,270,270,270,270,270,270,270,270,270,270,null,2783,88,"2034-01-07",0,0,0,0]
["2008-05-22","quinta-feira","Corpus Christi",null,null,2814,89,"2034-02-07",0,0,0,0,"2033-11-07",null,null,null,null,null,89,270,52.510380276807453,52.510380276807453,53.584549553727868,55.597970748059737,58.22265408635517,60.972627931229987,{"$error":"#N/A"},{"$error":"#N/A"},{"$error":"#N/A"},{"$error":"#N/A"},{"$error":"#N/A"},{"$error":"#N/A"},null,1.5716356816848471,1.5716356816848471,1.603785568143075,1.664047264489428,1.7426040368046101,1.8249107539817138,{"$error":"#N/A"},{"$error":"#N/A"},{"$error":"#N/A"},{"$error":"#N/A"},{"$error":"#N/A"},{"$error":"#N/A"},null,270,270,270,270,270,270,270,270,270,270,270,270,null,2814,89,"2034-02-07",0,0,0,0]
["2008-09-07","domingo","Independência do Brasil",null,null,2842,90,"2034-03-07",0,0,0,0,"2033-12-07",null,null,null,null,null,90,270,51.661778905976476,51.661778905976476,52.729212340759602,54.730578291162089,57.340625893229557,60.076521113667262,{"$error":"#N/A"},{"$error":"#N/A"},{"$error":"#N/A"},{"$error":"#N/A"},{"$error":"#N/A"},{"$error":"#N/A"},null,1.546237042655876,1.546237042655876,1.5781853253589351,1.6380862082544811,1.7162049329843607,1.798090276932061,{"$error":"#N/A"},{"$error":"#N/A"},{"$error":"#N/A"},{"$error":"#N/A"},{"$error":"#N/A"},{"$error":"#N/A"},null,270,270,270,270,270,270,270,270,270,270,270,270,null,2842,90,"2034-03-07",0,0,0,0]
["2008-10-12","domingo","Nossa Sr.a Aparecida - Padroeira do Brasil",null,null,2873,91,"2034-04-07",0,0,0,0,"2034-01-07",null,null,null,null,null,91,270,50.73824337656324,50.73824337656324,51.798148599797813,53.786026935194378,56.379672430028158,59.099756921784575,{"$error":"#N/A"},{"$error":"#N/A"},{"$error":"#N/A"},{"$error":"#N/A"},{"$error":"#N/A"},{"$error":"#N/A"},null,1.5185956242605378,1.5185956242605378,1.5503185875919485,1.6098157861703679,1.6874435958307428,1.7688557246690124,{"$error":"#N/A"},{"$error":"#N/A"},{"$error":"#N/A"},{"$error":"#N/A"},{"$error":"#N/A"},{"$error":"#N/A"},null,270,270,270,270,270,270,270,270,270,270,270,270,null,2873,91,"2034-04-07",0,0,0,0]
["2008-11-02","domingo","Finados",null,null,2903,92,"2034-05-07",0,0,0,0,"2034-02-07",null,null,null,null,null,92,270,49.860221737019351,49.860221737019351,50.912775434983281,52.887468839609618,55.465053694604116,58.169624624046151,{"$error":"#N/A"},{"$error":"#N/A"},{"$error":"#N/A"},{"$error":"#N/A"},{"$error":"#N/A"},{"$error":"#N/A"},null,1.4923164365889892,1.4923164365889892,1.5238193687690496,1.5829219423695158,1.6600690570795011,1.7410168649977011,{"$error":"#N/A"},{"$error":"#N/A"},{"$error":"#N/A"},{"$error":"#N/A"},{"$error":"#N/A"},{"$error":"#N/A"},null,270,270,270,270,270,270,270,270,270,270,270,270,null,2903,92,"2034-05-07",0,0,0,0]
["2008-11-15","sábado","Proclamação da República",null,null,2934,93,"2034-06-07",0,0,0,0,"2034-03-07",null,null,null,null,null,93,270,48.968891874716988,48.968891874716988,50.013785348560127,51.974726238199544,54.535532354294254,57.223864028479653,{"$error":"#N/A"},{"$error":"#N/A"},{"$error":"#N/A"},{"$error":"#N/A"},{"$error":"#N/A"},{"$error":"#N/A"},null,1.4656389338102795,1.4656389338102795,1.4969125954824045,1.5556035563093125,1.6322484833640272,1.7127102503723961,{"$error":"#N/A"},{"$error":"#N/A"},{"$error":"#N/A"},{"$error":"#N/A"},{"$error":"#N/A"},{"$error":"#N/A"},null,270,270,270,270,270,270,270,270,270,270,270,270,null,2934,93,"2034-06-07",0,0,0,0]
["2008-12-25","quinta-feira","Natal",null,null,2964,94,"2034-07-07",0,0,0,0,"2034-04-07",null,null,null,null,null,94,270,48.121488735207691,48.121488735207691,49.158911871121184,51.106428026037349,53.650830164875465,56.323255178180617,{"$error":"#N/A"},{"$error":"#N/A"},{"$error":"#N/A"},{"$error":"#N/A"},{"$error":"#N/A"},{"$error":"#N/A"},null,1.440276157844766,1.440276157844766,1.471326232302657,1.5296153908192978,1.6057693468347227,1.6857550274829458,{"$error":"#N/A"},{"$error":"#N/A"},{"$error":"#N/A"},{"$f":"IF($I129<>0,0,AD129*$B$1*MIN($F129,365))","v":{"$error":"#N/A"}},{"$error":"#N/A"},{"$error":"#N/A"},null,270,270,270,270,270,270,270,270,270,270,270,270,null,2964,94,"2034-07-07",0,0,0,0]
["2009-01-01","quinta-feira","Confraternização Universal",null,null,2995,95,"2034-08-07",0,0,0,0,"2034-05-07",null,null,null,null,null,95,270,47.261241459245568,47.261241459245568,48.290890553212037,50.224422986115187,52.751712824465429,55.40751408984049,{"$error":"#N/A"},{"$error":"#N/A"},{"$error":"#N/A"},{"$error":"#N/A"},{"$error":"#N/A"},{"$error":"#N/A"},null,1.41452895687522,1.41452895687522,1.4453463542576361,1.5032169799744277,1.5788587648362502,1.6583468967089259,{"$error":"#N/A"},{"$error":"#N/A"},{"$error":"#N/A"},{"$error":"#N/A"},{"$error":"#N/A"},{"$error":"#N/A"},null,270,270,270,270,270,270,270,270,270,270,270,270,null,2995,95,"2034-08-07",0,0,0,0]
["2009-02-23","segunda-feira","Carnaval",null,null,3026,96,"2034-09-07",0,0,0,0,"2034-06-07",null,null,null,null,null,{"$f":"S130+1","v":96},270,46.416372455968919,46.416372455968919,47.438196283434436,49.357639767018597,51.867663507967464,54.506661731532432,{"$error":"#N/A"},{"$error":"#N/A"},{"$error":"#N/A"},{"$error":"#N/A"},{"$error":"#N/A"},{"$error":"#N/A"},null,1.3892420276071498,1.3892420276071498,1.4198252147631927,1.4772741582268667,1.5523991687934662,1.6313843856247656,{"$error":"#N/A"},{"$error":"#N/A"},{"$error":"#N/A"},{"$error":"#N/A"},{"$error":"#N/A"},{"$error":"#N/A"},null,270,270,270,270,270,270,270,270,270,270,270,270,null,3026,96,"2034-09-07",0,0,0,0]
["2009-02-24","terça-feira","Carnaval",null,null,{"$f":"H132-$H$35","v":3056},97,"2034-10-07",0,0,0,{"$f":"J132*0.0082%*MIN(F132,365)","v":0},"2034-07-07",null,null,null,null,null,{"$f":"S131+1","v":97},270,45.613140480770227,45.613140480770227,46.627346723905603,48.533063026203592,51.02624079722127,53.648817145377883,{"$error":"#N/A"},{"$error":"#N/A"},{"$error":"#N/A"},{"$error":"#N/A"},{"$error":"#N/A"},{"$error":"#N/A"},null,{"$f":"IF($I132<>0,0,U132*$B$1*MIN($F132,365))","v":1.3652012945894529},{"$f":"IF($I132<>0,0,V132*$B$1*MIN($F132,365))","v":1.3652012945894529},{"$f":"IF($I132<>0,0,W132*$B$1*MIN($F132,365))","v":1.3955564874464947},{"$f":"IF($I132<>0,0,X132*$B$1*MIN($F132,365))","v":1.4525945763742736},{"$f":"IF($I132<>0,0,Y132*$B$1*MIN($F132,365))","v":1.5272153870608325},{"$f":"IF($I132<>0,0,Z132*$B$1*MIN($F132,365))","v":1.6057090971611601},{"$f":"IF($I132<>0,0,AA132*$B$1*MIN($F132,365))","v":{"$error":"#N/A"}},{"$f":"IF($I132<>0,0,AB132*$B$1*MIN($F132,365))","v":{"$error":"#N/A"}},{"$f":"IF($I132<>0,0,AC132*$B$1*MIN($F132,365))","v":{"$error":"#N/A"}},{"$f":"IF($I132<>0,0,AD132*$B$1*MIN($F132,365))","v":{"$error":"#N/A"}},{"$f":"IF($I132<>0,0,AE132*$B$1*MIN($F132,365))","v":{"$error":"#N/A"}},{"$f":"IF($I132<>0,0,AF132*$B$1*MIN($F132,365))","v":{"$error":"#N/A"}},null,270,270,270,270,270,270,270,270,270,270,270,270,null,{"$f":"BJ132-$H$35","v":3056},97,"2034-10-07",{"$f":"I131","v":0},{"$f":"BK131","v":0},{"$f":"I133","v":0},{"$f":"BM133","v":0}]
["2009-04-10","sexta-feira","Paixão de Cristo",null,null,3087,98,"2034-11-07",0,0,0,0,"2034-08-07",null,null,null,null,null,98,270,{"$f":"$T133/((U$29)^($H133-$H$35))","v":44.79773387390955},44.79773387390955,45.804026405913191,47.695469638339276,50.171108122186624,52.776558856231631,{"$error":"#N/A"},{"$error":"#N/A"},{"$error":"#N/A"},{"$error":"#N/A"},{"$error":"#N/A"},{"$error":"#N/A"},null,1.3407961748461128,1.3407961748461128,1.3709145103289819,1.4275254062754945,1.5016212660970458,1.5796024065670129,{"$error":"#N/A"},{"$error":"#N/A"},{"$error":"#N/A"},{"$error":"#N/A"},{"$error":"#N/A"},{"$error":"#N/A"},null,{"$f":"$T133","v":270},270,270,270,270,270,270,270,270,270,270,270,null,3087,98,"2034-11-07",0,0,0,0]
["2009-04-21","terça-feira","Tiradentes",null,null,3117,99,"2034-12-07",0,0,0,0,"2034-09-07",null,null,null,null,null,99,270,44.02251232254639,44.02251232254639,45.021109314926498,46.898661381468308,49.357207766123224,51.945943224078668,{"$error":"#N/A"},{"$error":"#N/A"},{"$error":"#N/A"},{"$error":"#N/A"},{"$error":"#N/A"},{"$error":"#N/A"},null,1.3175937938138134,1.3175937938138134,1.3474818017957499,1.4036769351473464,1.4772612284400679,1.5547420806966745,{"$error":"#N/A"},{"$error":"#N/A"},{"$error":"#N/A"},{"$error":"#N/A"},{"$error":"#N/A"},{"$error":"#N/A"},null,270,270,270,270,270,270,270,270,270,270,270,270,null,3117,99,"2034-12-07",0,0,0,0]
["2009-05-01","sexta-feira","Dia do Trabalho",null,null,3148,100,"2035-01-07",0,0,0,0,"2034-10-07",null,null,null,null,null,100,270,43.23554069507113,43.23554069507113,44.226151063130189,46.089274826747953,48.530045889217256,51.101371396111965,{"$error":"#N/A"},{"$error":"#N/A"},{"$error":"#N/A"},{"$error":"#N/A"},{"$error":"#N/A"},{"$error":"#N/A"},null,1.294039733003479,1.294039733003479,1.3236887013194865,1.3794519955645661,1.4525042734642724,1.529464045885631,{"$error":"#N/A"},{"$error":"#N/A"},{"$error":"#N/A"},{"$error":"#N/A"},{"$error":"#N/A"},{"$error":"#N/A"},null,270,270,270,270,270,270,270,270,270,270,270,270,null,3148,100,"2035-01-07",0,0,0,0]
["2009-06-11","quinta-feira","Corpus Christi",null,null,3179,101,"2035-02-07",0,0,0,0,"2034-11-07",null,null,null,null,null,101,270,42.462637422848132,42.462637422848132,43.445229751598482,45.293856828392848,47.716746157306375,50.270531180824172,{"$error":"#N/A"},{"$error":"#N/A"},{"$error":"#N/A"},{"$error":"#N/A"},{"$error":"#N/A"},{"$error":"#N/A"},null,1.2709067380658448,1.2709067380658448,1.3003157264653424,1.3556451348737979,1.4281622124881796,1.5045969982420675,{"$error":"#N/A"},{"$error":"#N/A"},{"$error":"#N/A"},{"$error":"#N/A"},{"$error":"#N/A"},{"$error":"#N/A"},null,270,270,270,270,270,270,270,270,270,270,270,270,null,3179,101,"2035-02-07",0,0,0,0]
["2009-09-07","segunda-feira","Independência do Brasil",null,null,3207,102,"2035-03-07",0,0,0,0,"2034-12-07",null,null,null,null,null,102,270,41.776414010711797,41.776414010711797,42.751740265506228,44.587220430910278,46.993874346403715,49.531711693423297,{"$error":"#N/A"},{"$error":"#N/A"},{"$error":"#N/A"},{"$error":"#N/A"},{"$error":"#N/A"},{"$error":"#N/A"},null,1.250368071340604,1.250368071340604,1.2795595861466016,1.3344955074971445,1.4065266591878631,1.4824841309841594,{"$error":"#N/A"},{"$error":"#N/A"},{"$error":"#N/A"},{"$error":"#N/A"},{"$error":"#N/A"},{"$error":"#N/A"},null,270,270,270,270,270,270,270,270,270,270,270,270,null,3207,102,"2035-03-07",0,0,0,0]
["2009-10-12","segunda-feira","Nossa Sr.a Aparecida - Padroeira do Brasil",null,null,3238,103,"2035-04-07",0,0,0,0,"2035-01-07",null,null,null,null,null,103,270,41.029594922259811,41.029594922259811,41.996853297595642,43.817725190191283,46.206318828845959,48.726392053605032,{"$error":"#N/A"},{"$error":"#N/A"},{"$error":"#N/A"},{"$error":"#N/A"},{"$error":"#N/A"},{"$error":"#N/A"},null,1.2280157760232362,1.2280157760232362,1.2569658191970376,1.3114645149424251,1.3829551225473595,1.4583809141643986,{"$error":"#N/A"},{"$error":"#N/A"},{"$error":"#N/A"},{"$error":"#N/A"},{"$error":"#N/A"},{"$error":"#N/A"},null,270,270,270,270,270,270,270,270,270,270,270,270,null,3238,103,"2035-04-07",0,0,0,0]
["2009-11-02","segunda-feira","Finados",null,null,3268,104,"2035-05-07",0,0,0,0,"2035-02-07",null,null,null,null,null,104,270,40.31958074348546,40.31958074348546,41.279011291240849,43.085699161438612,45.456737231892049,47.959519339368576,{"$error":"#N/A"},{"$error":"#N/A"},{"$error":"#N/A"},{"$error":"#N/A"},{"$error":"#N/A"},{"$error":"#N/A"},null,1.2067650516525199,1.2067650516525199,1.2354808079468387,1.2895549759018576,1.3605201453505291,1.4354284138273017,{"$error":"#N/A"},{"$error":"#N/A"},{"$error":"#N/A"},{"$error":"#N/A"},{"$error":"#N/A"},{"$error":"#N/A"},null,270,270,270,270,270,270,270,270,270,270,270,270,null,3268,104,"2035-05-07",0,0,0,0]
["2009-11-15","domingo","Proclamação da República",null,null,3299,105,"2035-06-07",0,0,0,0,"2035-03-07",null,null,null,null,null,105,270,39.59880484036713,39.59880484036713,40.550128970229601,42.34211747755338,44.694942110398955,47.17976145255674,{"$error":"#N/A"},{"$error":"#N/A"},{"$error":"#N/A"},{"$error":"#N/A"},{"$error":"#N/A"},{"$error":"#N/A"},null,1.1851922288721883,1.1851922288721883,1.213665360078972,1.2672995761031727,1.3377196173642407,1.4120902602750232,{"$error":"#N/A"},{"$error":"#N/A"},{"$error":"#N/A"},{"$error":"#N/A"},{"$error":"#N/A"},{"$error":"#N/A"},null,270,270,270,270,270,270,270,270,270,270,270,270,null,3299,105,"2035-06-07",0,0,0,0]
["2009-12-25","sexta-feira","Natal",null,null,3329,106,"2035-07-07",0,0,0,0,"2035-04-07",null,null,null,null,null,106,270,38.913550380691106,38.913550380691106,39.857015471185569,41.634743190742832,43.969878808841166,46.437230142576993,{"$error":"#N/A"},{"$error":"#N/A"},{"$error":"#N/A"},{"$error":"#N/A"},{"$error":"#N/A"},{"$error":"#N/A"},null,1.1646825628940847,1.1646825628940847,1.1929204730525842,1.246127863698933,1.3160184727486162,1.3898662981673293,{"$error":"#N/A"},{"$error":"#N/A"},{"$error":"#N/A"},{"$error":"#N/A"},{"$error":"#N/A"},{"$error":"#N/A"},null,270,270,270,270,270,270,270,270,270,270,270,270,null,3329,106,"2035-07-07",0,0,0,0]
["2010-01-01","sexta-feira","Confraternização Universal",null,null,3360,107,"2035-08-07",0,0,0,0,"2035-05-07",null,null,null,null,null,107,270,38.217909481108713,38.217909481108713,39.153241978641098,40.916202397569187,43.233001478681246,45.68222264992167,{"$error":"#N/A"},{"$error":"#N/A"},{"$error":"#N/A"},{"$error":"#N/A"},{"$error":"#N/A"},{"$error":"#N/A"},null,1.1438620307695837,1.1438620307695837,1.1718565324207282,1.2246219377592458,1.2939637342569297,1.3672689239121556,{"$error":"#N/A"},{"$error":"#N/A"},{"$error":"#N/A"},{"$error":"#N/A"},{"$error":"#N/A"},{"$error":"#N/A"},null,270,270,270,270,270,270,270,270,270,270,270,270,null,3360,107,"2035-08-07",0,0,0,0]
["2010-02-15","segunda-feira","Carnaval",null,null,3391,108,"2035-09-07",0,0,0,0,"2035-06-07",null,null,null,null,null,108,270,37.53470425641175,37.53470425641175,38.461895335497005,40.210062326289993,42.508473243274686,44.939490573181885,{"$error":"#N/A"},{"$error":"#N/A"},{"$error":"#N/A"},{"$error":"#N/A"},{"$error":"#N/A"},{"$error":"#N/A"},null,1.1234136983944036,1.1234136983944036,1.1511645273914253,1.2034871654258594,1.2722786041712113,1.3450389528553337,{"$error":"#N/A"},{"$error":"#N/A"},{"$error":"#N/A"},{"$error":"#N/A"},{"$error":"#N/A"},{"$error":"#N/A"},null,270,270,270,270,270,270,270,270,270,270,270,270,null,3391,108,"2035-09-07",0,0,0,0]
["2010-02-16","terça-feira","Carnaval"]
["2010-04-02","sexta-feira","Paixão de Cristo"]
["2010-04-21","quarta-feira","Tiradentes"]
["2010-05-01","sábado","Dia do Trabalho"]
["2010-06-03","quinta-feira","Corpus Christi"]
["2010-09-07","terça-feira","Independência do Brasil"]
["2010-10-12","terça-feira","Nossa Sr.a Aparecida - Padroeira do Brasil"]
["2010-11-02","terça-feira","Finados"]
["2010-11-15","segunda-feira","Proclamação da República"]
["2010-12-25","sábado","Natal"]
["2011-01-01","sábado","Confraternização Universal"]
["2011-03-07","segunda-feira","Carnaval"]
["2011-03-08","terça-feira","Carnaval"]
["2011-04-21","quinta-feira","Tiradentes"]
["2011-04-22","sexta-feira","Paixão de Cristo"]
["2011-05-01","domingo","Dia do Trabalho"]
["2011-06-23","quinta-feira","Corpus Christi"]
["2011-09-07","quarta-feira","Independência do Brasil"]
["2011-10-12","quarta-feira","Nossa Sr.a Aparecida - Padroeira do Brasil"]
["2011-11-02","quarta-feira","Finados"]
["2011-11-15","terça-feira","Proclamação da República"]
["2011-12-25","domingo","Natal"]
["2012-01-01","domingo","Confraternização Universal"]
["2012-02-20","segunda-feira","Carnaval"]
["2012-02-21","terça-feira","Carnaval"]
["2012-04-06","sexta-feira","Paixão de Cristo"]
["2012-04-21","sábado","Tiradentes"]
["2012-05-01","terça-feira","Dia do Trabalho"]
["2012-06-07","quinta-feira","Corpus Christi"]
["2012-09-07","sexta-feira","Independência do Brasil"]
["2012-10-12","sexta-feira","Nossa Sr.a Aparecida - Padroeira do Brasil"]
["2012-11-02","sexta-feira","Finados"]
["2012-11-15","quinta-feira","Proclamação da República"]
["2012-12-25","terça-feira","Natal"]
["2013-01-01","terça-feira","Confraternização Universal"]
["2013-02-11","segunda-feira","Carnaval"]
["2013-02-12","terça-feira","Carnaval"]
["2013-03-29","sexta-feira","Paixão de Cristo"]
["2013-04-21","domingo","Tiradentes"]
["2013-05-01","quarta-feira","Dia do Trabalho"]
["2013-05-30","quinta-feira","Corpus Christi"]
["2013-09-07","sábado","Independência do Brasil"]
["2013-10-12","sábado","Nossa Sr.a Aparecida - Padroeira do Brasil"]
["2013-11-02","sábado","Finados"]
["2013-11-15","sexta-feira","Proclamação da República"]
["2013-12-25","quarta-feira","Natal"]
["2014-01-01","quarta-feira","Confraternização Universal"]
["2014-03-03","segunda-feira","Carnaval"]
["2014-03-04","terça-feira","Carnaval"]
["2014-04-18","sexta-feira","Paixão de Cristo"]
["2014-04-21","segunda-feira","Tiradentes"]
["2014-05-01","quinta-feira","Dia do Trabalho"]
["2014-06-19","quinta-feira","Corpus Christi"]
["2014-09-07","domingo","Independência do Brasil"]
["2014-10-12","domingo","Nossa Sr.a Aparecida - Padroeira do Brasil"]
["2014-11-02","domingo","Finados"]
["2014-11-15","sábado","Proclamação da República"]
["2014-12-25","quinta-feira","Natal"]
["2015-01-01","quinta-feira","Confraternização Universal"]
["2015-02-16","segunda-feira","Carnaval"]
["2015-02-17","terça-feira","Carnaval"]
["2015-04-03","sexta-feira","Paixão de Cristo"]
["2015-04-21","terça-feira","Tiradentes"]
["2015-05-01","sexta-feira","Dia do Trabalho"]
["2015-06-04","quinta-feira","Corpus Christi"]
["2015-09-07","segunda-feira","Independência do Brasil"]
["2015-10-12","segunda-feira","Nossa Sr.a Aparecida - Padroeira do Brasil"]
["2015-11-02","segunda-feira","Finados"]
["2015-11-15","domingo","Proclamação da República"]
["2015-12-25","sexta-feira","Natal"]
["2016-01-01","sexta-feira","Confraternização Universal"]
["2016-02-08","segunda-feira","Carnaval"]
["2016-02-09","terça-feira","Carnaval"]
["2016-03-25","sexta-feira","Paixão de Cristo"]
["2016-04-21","quinta-feira","Tiradentes"]
["2016-05-01","domingo","Dia do Trabalho"]
["2016-05-26","quinta-feira","Corpus Christi"]
["2016-09-07","quarta-feira","Independência do Brasil"]
["2016-10-12","quarta-feira","Nossa Sr.a Aparecida - Padroeira do Brasil"]
["2016-11-02","quarta-feira","Finados"]
["2016-11-15","terça-feira","Proclamação da República"]
["2016-12-25","domingo","Natal"]
["2017-01-01","domingo","Confraternização Universal"]
["2017-02-27","segunda-feira","Carnaval"]
["2017-02-28","terça-feira","Carnaval"]
["2017-04-14","sexta-feira","Paixão de Cristo"]
["2017-04-21","sexta-feira","Tiradentes"]
["2017-05-01","segunda-feira","Dia do Trabalho"]
["2017-06-15","quinta-feira","Corpus Christi"]
["2017-09-07","quinta-feira","Independência do Brasil"]
["2017-10-12","quinta-feira","Nossa Sr.a Aparecida - Padroeira do Brasil"]
["2017-11-02","quinta-feira","Finados"]
["2017-11-15","quarta-feira","Proclamação da República"]
["2017-12-25","segunda-feira","Natal"]
["2018-01-01","segunda-feira","Confraternização Universal"]
["2018-02-12","segunda-feira","Carnaval"]
["2018-02-13","terça-feira","Carnaval"]
["2018-03-30","sexta-feira","Paixão de Cristo"]
["2018-04-21","sábado","Tiradentes"]
["2018-05-01","terça-feira","Dia do Trabalho"]
["2018-05-31","quinta-feira","Corpus Christi"]
["2018-09-07","sexta-feira","Independência do Brasil"]
["2018-10-12","sexta-feira","Nossa Sr.a Aparecida - Padroeira do Brasil"]
["2018-11-02","sexta-feira","Finados"]
["2018-11-15","quinta-feira","Proclamação da República"]
["2018-12-25","terça-feira","Natal"]
["2019-01-01","terça-feira","Confraternização Universal"]
["2019-03-04","segunda-feira","Carnaval"]
["2019-03-05","terça-feira","Carnaval"]
["2019-04-19","sexta-feira","Paixão de Cristo"]
["2019-04-21","domingo","Tiradentes"]
["2019-05-01","quarta-feira","Dia do Trabalho"]
["2019-06-20","quinta-feira","Corpus Christi"]
["2019-09-07","sábado","Independência do Brasil"]
["2019-10-12","sábado","Nossa Sr.a Aparecida - Padroeira do Brasil"]
["2019-11-02","sábado","Finados"]
["2019-11-15","sexta-feira","Proclamação da República"]
["2019-12-25","quarta-feira","Natal"]
["2020-01-01","quarta-feira","Confraternização Universal"]
["2020-02-24","segunda-feira","Carnaval"]
["2020-02-25","terça-feira","Carnaval"]
["2020-04-10","sexta-feira","Paixão de Cristo"]
["2020-04-21","terça-feira","Tiradentes"]
["2020-05-01","sexta-feira","Dia do Trabalho"]
["2020-06-11","quinta-feira","Corpus Christi"]
["2020-09-07","segunda-feira","Independência do Brasil"]
["2020-10-12","segunda-feira","Nossa Sr.a Aparecida - Padroeira do Brasil"]
["2020-11-02","segunda-feira","Finados"]
["2020-11-15","domingo","Proclamação da República"]
["2020-12-25","sexta-feira","Natal"]
["2021-01-01","sexta-feira","Confraternização Universal"]
["2021-02-15","segunda-feira","Carnaval"]
["2021-02-16","terça-feira","Carnaval"]
["2021-04-02","sexta-feira","Paixão de Cristo"]
["2021-04-21","quarta-feira","Tiradentes"]
["2021-05-01","sábado","Dia do Trabalho"]
["2021-06-03","quinta-feira","Corpus Christi"]
["2021-09-07","terça-feira","Independência do Brasil"]
["2021-10-12","terça-feira","Nossa Sr.a Aparecida - Padroeira do Brasil"]
["2021-11-02","terça-feira","Finados"]
["2021-11-15","segunda-feira","Proclamação da República"]
["2021-12-25","sábado","Natal"]
["2022-01-01","sábado","Confraternização Universal"]
["2022-02-28","segunda-feira","Carnaval"]
["2022-03-01","terça-feira","Carnaval"]
["2022-04-15","sexta-feira","Paixão de Cristo"]
["2022-04-21","quinta-feira","Tiradentes"]
["2022-05-01","domingo","Dia do Trabalho"]
["2022-06-16","quinta-feira","Corpus Christi"]
["2022-09-07","quarta-feira","Independência do Brasil"]
["2022-10-12","quarta-feira","Nossa Sr.a Aparecida - Padroeira do Brasil"]
["2022-11-02","quarta-feira","Finados"]
["2022-11-15","terça-feira","Proclamação da República"]
["2022-12-25","domingo","Natal"]
["2023-01-01","domingo","Confraternização Universal"]
["2023-02-20","segunda-feira","Carnaval"]
["2023-02-21","terça-feira","Carnaval"]
["2023-04-07","sexta-feira","Paixão de Cristo"]
["2023-04-21","sexta-feira","Tiradentes"]
["2023-05-01","segunda-feira","Dia do Trabalho"]
["2023-06-08","quinta-feira","Corpus Christi"]
["2023-09-07","quinta-feira","Independência do Brasil"]
["2023-10-12","quinta-feira","Nossa Sr.a Aparecida - Padroeira do Brasil"]
["2023-11-02","quinta-feira","Finados"]
["2023-11-15","quarta-feira","Proclamação da República"]
["2023-12-25","segunda-feira","Natal"]
["2024-01-01","segunda-feira","Confraternização Universal"]
["2024-02-12","segunda-feira","Carnaval"]
["2024-02-13","terça-feira","Carnaval"]
["2024-03-29","sexta-feira","Paixão de Cristo"]
["2024-04-21","domingo","Tiradentes"]
["2024-05-01","quarta-feira","Dia do Trabalho"]
["2024-05-30","quinta-feira","Corpus Christi"]
["2024-09-07","sábado","Independência do Brasil"]
["2024-10-12","sábado","Nossa Sr.a Aparecida - Padroeira do Brasil"]
["2024-11-02","sábado","Finados"]
["2024-11-15","sexta-feira","Proclamação da República"]
["2024-11-20","quarta-feira","Dia Nacional de Zumbi e da Consciência Negra"]
["2024-12-25","quarta-feira","Natal"]
["2025-01-01","quarta-feira","Confraternização Universal"]
["2025-03-03","segunda-feira","Carnaval"]
["2025-03-04","terça-feira","Carnaval"]
["2025-04-18","sexta-feira","Paixão de Cristo"]
["2025-04-21","segunda-feira","Tiradentes"]
["2025-05-01","quinta-feira","Dia do Trabalho"]
["2025-06-19","quinta-feira","Corpus Christi"]
["2025-09-07","domingo","Independência do Brasil"]
["2025-10-12","domingo","Nossa Sr.a Aparecida - Padroeira do Brasil"]
["2025-11-02","domingo","Finados"]
["2025-11-15","sábado","Proclamação da República"]
["2025-11-20","quinta-feira","Dia Nacional de Zumbi e da Consciência Negra"]
["2025-12-25","quinta-feira","Natal"]
["2026-01-01","quinta-feira","Confraternização Universal"]
["2026-02-16","segunda-feira","Carnaval"]
["2026-02-17","terça-feira","Carnaval"]
["2026-04-03","sexta-feira","Paixão de Cristo"]
["2026-04-21","terça-feira","Tiradentes"]
["2026-05-01","sexta-feira","Dia do Trabalho"]
["2026-06-04","quinta-feira","Corpus Christi"]
["2026-09-07","segunda-feira","Independência do Brasil"]
["2026-10-12","segunda-feira","Nossa Sr.a Aparecida - Padroeira do Brasil"]
["2026-11-02","segunda-feira","Finados"]
["2026-11-15","domingo","Proclamação da República"]
["2026-11-20","sexta-feira","Dia Nacional de Zumbi e da Consciência Negra"]
["2026-12-25","sexta-feira","Natal"]
["2027-01-01","sexta-feira","Confraternização Universal"]
["2027-02-08","segunda-feira","Carnaval"]
["2027-02-09","terça-feira","Carnaval"]
["2027-03-26","sexta-feira","Paixão de Cristo"]
["2027-04-21","quarta-feira","Tiradentes"]
["2027-05-01","sábado","Dia do Trabalho"]
["2027-05-27","quinta-feira","Corpus Christi"]
["2027-09-07","terça-feira","Independência do Brasil"]
["2027-10-12","terça-feira","Nossa Sr.a Aparecida - Padroeira do Brasil"]
["2027-11-02","terça-feira","Finados"]
["2027-11-15","segunda-feira","Proclamação da República"]
["2027-11-20","sábado","Dia Nacional de Zumbi e da Consciência Negra"]
["2027-12-25","sábado","Natal"]
["2028-01-01","sábado","Confraternização Universal"]
["2028-02-28","segunda-feira","Carnaval"]
["2028-02-29","terça-feira","Carnaval"]
["2028-04-14","sexta-feira","Paixão de Cristo"]
["2028-04-21","sexta-feira","Tiradentes"]
["2028-05-01","segunda-feira","Dia do Trabalho"]
["2028-06-15","quinta-feira","Corpus Christi"]
["2028-09-07","quinta-feira","Independência do Brasil"]
["2028-10-12","quinta-feira","Nossa Sr.a Aparecida - Padroeira do Brasil"]
["2028-11-02","quinta-feira","Finados"]
["2028-11-15","quarta-feira","Proclamação da República"]
["2028-11-20","segunda-feira","Dia Nacional de Zumbi e da Consciência Negra"]
["2028-12-25","segunda-feira","Natal"]
["2029-01-01","segunda-feira","Confraternização Universal"]
["2029-02-12","segunda-feira","Carnaval"]
["2029-02-13","terça-feira","Carnaval"]
["2029-03-30","sexta-feira","Paixão de Cristo"]
["2029-04-21","sábado","Tiradentes"]
["2029-05-01","terça-feira","Dia do Trabalho"]
["2029-05-31","quinta-feira","Corpus Christi"]
["2029-09-07","sexta-feira","Independência do Brasil"]
["2029-10-12","sexta-feira","Nossa Sr.a Aparecida - Padroeira do Brasil"]
["2029-11-02","sexta-feira","Finados"]
["2029-11-15","quinta-feira","Proclamação da República"]
["2029-11-20","terça-feira","Dia Nacional de Zumbi e da Consciência Negra"]
["2029-12-25","terça-feira","Natal"]
["2030-01-01","terça-feira","Confraternização Universal"]
["2030-03-04","segunda-feira","Carnaval"]
["2030-03-05","terça-feira","Carnaval"]
["2030-04-19","sexta-feira","Paixão de Cristo"]
["2030-04-21","domingo","Tiradentes"]
["2030-05-01","quarta-feira","Dia do Trabalho"]
["2030-06-20","quinta-feira","Corpus Christi"]
["2030-09-07","sábado","Independência do Brasil"]
["2030-10-12","sábado","Nossa Sr.a Aparecida - Padroeira do Brasil"]
["2030-11-02","sábado","Finados"]
["2030-11-15","sexta-feira","Proclamação da República"]
["2030-11-20","quarta-feira","Dia Nacional de Zumbi e da Consciência Negra"]
["2030-12-25","quarta-feira","Natal"]
["2031-01-01","quarta-feira","Confraternização Universal"]
["2031-02-24","segunda-feira","Carnaval"]
["2031-02-25","terça-feira","Carnaval"]
["2031-04-11","sexta-feira","Paixão de Cristo"]
["2031-04-21","segunda-feira","Tiradentes"]
["2031-05-01","quinta-feira","Dia do Trabalho"]
["2031-06-12","quinta-feira","Corpus Christi"]
["2031-09-07","domingo","Independência do Brasil"]
["2031-10-12","domingo","Nossa Sr.a Aparecida - Padroeira do Brasil"]
["2031-11-02","domingo","Finados"]
["2031-11-15","sábado","Proclamação da República"]
["2031-11-20","quinta-feira","Dia Nacional de Zumbi e da Consciência Negra"]
["2031-12-25","quinta-feira","Natal"]
["2032-01-01","quinta-feira","Confraternização Universal"]
["2032-02-09","segunda-feira","Carnaval"]
["2032-02-10","terça-feira","Carnaval"]
["2032-03-26","sexta-feira","Paixão de Cristo"]
["2032-04-21","quarta-feira","Tiradentes"]
["2032-05-01","sábado","Dia do Trabalho"]
["2032-05-27","quinta-feira","Corpus Christi"]
["2032-09-07","terça-feira","Independência do Brasil"]
["2032-10-12","terça-feira","Nossa Sr.a Aparecida - Padroeira do Brasil"]
["2032-11-02","terça-feira","Finados"]
["2032-11-15","segunda-feira","Proclamação da República"]
["2032-11-20","sábado","Dia Nacional de Zumbi e da Consciência Negra"]
["2032-12-25","sábado","Natal"]
["2033-01-01","sábado","Confraternização Universal"]
["2033-02-28","segunda-feira","Carnaval"]
["2033-03-01","terça-feira","Carnaval"]
["2033-04-15","sexta-feira","Paixão de Cristo"]
["2033-04-21","quinta-feira","Tiradentes"]
["2033-05-01","domingo","Dia do Trabalho"]
["2033-06-16","quinta-feira","Corpus Christi"]
["2033-09-07","quarta-feira","Independência do Brasil"]
["2033-10-12","quarta-feira","Nossa Sr.a Aparecida - Padroeira do Brasil"]
["2033-11-02","quarta-feira","Finados"]
["2033-11-15","terça-feira","Proclamação da República"]
["2033-11-20","domingo","Dia Nacional de Zumbi e da Consciência Negra"]
["2033-12-25","domingo","Natal"]
["2034-01-01","domingo","Confraternização Universal"]
["2034-02-20","segunda-feira","Carnaval"]
["2034-02-21","terça-feira","Carnaval"]
["2034-04-07","sexta-feira","Paixão de Cristo"]
["2034-04-21","sexta-feira","Tiradentes"]
["2034-05-01","segunda-feira","Dia do Trabalho"]
["2034-06-08","quinta-feira","Corpus Christi"]
["2034-09-07","quinta-feira","Independência do Brasil"]
["2034-10-12","quinta-feira","Nossa Sr.a Aparecida - Padroeira do Brasil"]
["2034-11-02","quinta-feira","Finados"]
["2034-11-15","quarta-feira","Proclamação da República"]
["2034-11-20","segunda-feira","Dia Nacional de Zumbi e da Consciência Negra"]
["2034-12-25","segunda-feira","Natal"]
["2035-01-01","segunda-feira","Confraternização Universal"]
["2035-02-05","segunda-feira","Carnaval"]
["2035-02-06","terça-feira","Carnaval"]
["2035-03-23","sexta-feira","Paixão de Cristo"]
["2035-04-21","sábado","Tiradentes"]
["2035-05-01","terça-feira","Dia do Trabalho"]
["2035-05-24","quinta-feira","Corpus Christi"]
["2035-09-07","sexta-feira","Independência do Brasil"]
["2035-10-12","sexta-feira","Nossa Sr.a Aparecida - Padroeira do Brasil"]
["2035-11-02","sexta-feira","Finados"]
["2035-11-15","quinta-feira","Proclamação da República"]
["2035-11-20","terça-feira","Dia Nacional de Zumbi e da Consciência Negra"]
["2035-12-25","terça-feira","Natal"]
["2036-01-01","terça-feira","Confraternização Universal"]
["2036-02-25","segunda-feira","Carnaval"]
["2036-02-26","terça-feira","Carnaval"]
["2036-04-11","sexta-feira","Paixão de Cristo"]
["2036-04-21","segunda-feira","Tiradentes"]
["2036-05-01","quinta-feira","Dia do Trabalho"]
["2036-06-12","quinta-feira","Corpus Christi"]
["2036-09-07","domingo","Independência do Brasil"]
["2036-10-12","domingo","Nossa Sr.a Aparecida - Padroeira do Brasil"]
["2036-11-02","domingo","Finados"]
["2036-11-15","sábado","Proclamação da República"]
["2036-11-20","quinta-feira","Dia Nacional de Zumbi e da Consciência Negra"]
["2036-12-25","quinta-feira","Natal"]
["2037-01-01","quinta-feira","Confraternização Universal"]
["2037-02-16","segunda-feira","Carnaval"]
["2037-02-17","terça-feira","Carnaval"]
["2037-04-03","sexta-feira","Paixão de Cristo"]
["2037-04-21","terça-feira","Tiradentes"]
["2037-05-01","sexta-feira","Dia do Trabalho"]
["2037-06-04","quinta-feira","Corpus Christi"]
["2037-09-07","segunda-feira","Independência do Brasil"]
["2037-10-12","segunda-feira","Nossa Sr.a Aparecida - Padroeira do Brasil"]
["2037-11-02","segunda-feira","Finados"]
["2037-11-15","domingo","Proclamação da República"]
["2037-11-20","sexta-feira","Dia Nacional de Zumbi e da Consciência Negra"]
["2037-12-25","sexta-feira","Natal"]
["2038-01-01","sexta-feira","Confraternização Universal"]
["2038-03-08","segunda-feira","Carnaval"]
["2038-03-09","terça-feira","Carnaval"]
["2038-04-21","quarta-feira","Tiradentes"]
["2038-04-23","sexta-feira","Paixão de Cristo"]
["2038-05-01","sábado","Dia do Trabalho"]
["2038-06-24","quinta-feira","Corpus Christi"]
["2038-09-07","terça-feira","Independência do Brasil"]
["2038-10-12","terça-feira","Nossa Sr.a Aparecida - Padroeira do Brasil"]
["2038-11-02","terça-feira","Finados"]
["2038-11-15","segunda-feira","Proclamação da República"]
["2038-11-20","sábado","Dia Nacional de Zumbi e da Consciência Negra"]
["2038-12-25","sábado","Natal"]
["2039-01-01","sábado","Confraternização Universal"]
["2039-02-21","segunda-feira","Carnaval"]
["2039-02-22","terça-feira","Carnaval"]
["2039-04-08","sexta-feira","Paixão de Cristo"]
["2039-04-21","quinta-feira","Tiradentes"]
["2039-05-01","domingo","Dia do Trabalho"]
["2039-06-09","quinta-feira","Corpus Christi"]
["2039-09-07","quarta-feira","Independência do Brasil"]
["2039-10-12","quarta-feira","Nossa Sr.a Aparecida - Padroeira do Brasil"]
["2039-11-02","quarta-feira","Finados"]
["2039-11-15","terça-feira","Proclamação da República"]
["2039-11-20","domingo","Dia Nacional de Zumbi e da Consciência Negra"]
["2039-12-25","domingo","Natal"]
["2040-01-01","domingo","Confraternização Universal"]
["2040-02-13","segunda-feira","Carnaval"]
["2040-02-14","terça-feira","Carnaval"]
["2040-03-30","sexta-feira","Paixão de Cristo"]
["2040-04-21","sábado","Tiradentes"]
["2040-05-01","terça-feira","Dia do Trabalho"]
["2040-05-31","quinta-feira","Corpus Christi"]
["2040-09-07","sexta-feira","Independência do Brasil"]
["2040-10-12","sexta-feira","Nossa Sr.a Aparecida - Padroeira do Brasil"]
["2040-11-02","sexta-feira","Finados"]
["2040-11-15","quinta-feira","Proclamação da República"]
["2040-11-20","terça-feira","Dia Nacional de Zumbi e da Consciência Negra"]
["2040-12-25","terça-feira","Natal"]
["2041-01-01","terça-feira","Confraternização Universal"]
["2041-03-04","segunda-feira","Carnaval"]
["2041-03-05","terça-feira","Carnaval"]
["2041-04-19","sexta-feira","Paixão de Cristo"]
["2041-04-21","domingo","Tiradentes"]
["2041-05-01","quarta-feira","Dia do Trabalho"]
["2041-06-20","quinta-feira","Corpus Christi"]
["2041-09-07","sábado","Independência do Brasil"]
["2041-10-12","sábado","Nossa Sr.a Aparecida - Padroeira do Brasil"]
["2041-11-02","sábado","Finados"]
["2041-11-15","sexta-feira","Proclamação da República"]
["2041-11-20","quarta-feira","Dia Nacional de Zumbi e da Consciência Negra"]
["2041-12-25","quarta-feira","Natal"]
["2042-01-01","quarta-feira","Confraternização Universal"]
["2042-02-17","segunda-feira","Carnaval"]
["2042-02-18","terça-feira","Carnaval"]
["2042-04-04","sexta-feira","Paixão de Cristo"]
["2042-04-21","segunda-feira","Tiradentes"]
["2042-05-01","quinta-feira","Dia do Trabalho"]
["2042-06-05","quinta-feira","Corpus Christi"]
["2042-09-07","domingo","Independência do Brasil"]
["2042-10-12","domingo","Nossa Sr.a Aparecida - Padroeira do Brasil"]
["2042-11-02","domingo","Finados"]
["2042-11-15","sábado","Proclamação da República"]
["2042-11-20","quinta-feira","Dia Nacional de Zumbi e da Consciência Negra"]
["2042-12-25","quinta-feira","Natal"]
["2043-01-01","quinta-feira","Confraternização Universal"]
["2043-02-09","segunda-feira","Carnaval"]
["2043-02-10","terça-feira","Carnaval"]
["2043-03-27","sexta-feira","Paixão de Cristo"]
["2043-04-21","terça-feira","Tiradentes"]
["2043-05-01","sexta-feira","Dia do Trabalho"]
["2043-05-28","quinta-feira","Corpus Christi"]
["2043-09-07","segunda-feira","Independência do Brasil"]
["2043-10-12","segunda-feira","Nossa Sr.a Aparecida - Padroeira do Brasil"]
["2043-11-02","segunda-feira","Finados"]
["2043-11-15","domingo","Proclamação da República"]
["2043-11-20","sexta-feira","Dia Nacional de Zumbi e da Consciência Negra"]
["2043-12-25","sexta-feira","Natal"]
["2044-01-01","sexta-feira","Confraternização Universal"]
["2044-02-29","segunda-feira","Carnaval"]
["2044-03-01","terça-feira","Carnaval"]
["2044-04-15","sexta-feira","Paixão de Cristo"]
["2044-04-21","quinta-feira","Tiradentes"]
["2044-05-01","domingo","Dia do Trabalho"]
["2044-06-16","quinta-feira","Corpus Christi"]
["2044-09-07","quarta-feira","Independência do Brasil"]
["2044-10-12","quarta-feira","Nossa Sr.a Aparecida - Padroeira do Brasil"]
["2044-11-02","quarta-feira","Finados"]
["2044-11-15","terça-feira","Proclamação da República"]
["2044-11-20","domingo","Dia Nacional de Zumbi e da Consciência Negra"]
["2044-12-25","domingo","Natal"]
["2045-01-01","domingo","Confraternização Universal"]
["2045-02-20","segunda-feira","Carnaval"]
["2045-02-21","terça-feira","Carnaval"]
["2045-04-07","sexta-feira","Paixão de Cristo"]
["2045-04-21","sexta-feira","Tiradentes"]
["2045-05-01","segunda-feira","Dia do Trabalho"]
["2045-06-08","quinta-feira","Corpus Christi"]
["2045-09-07","quinta-feira","Independência do Brasil"]
["2045-10-12","quinta-feira","Nossa Sr.a Aparecida - Padroeira do Brasil"]
["2045-11-02","quinta-feira","Finados"]
["2045-11-15","quarta-feira","Proclamação da República"]
["2045-11-20","segunda-feira","Dia Nacional de Zumbi e da Consciência Negra"]
["2045-12-25","segunda-feira","Natal"]
["2046-01-01","segunda-feira","Confraternização Universal"]
["2046-02-05","segunda-feira","Carnaval"]
["2046-02-06","terça-feira","Carnaval"]
["2046-03-23","sexta-feira","Paixão de Cristo"]
["2046-04-21","sábado","Tiradentes"]
["2046-05-01","terça-feira","Dia do Trabalho"]
["2046-05-24","quinta-feira","Corpus Christi"]
["2046-09-07","sexta-feira","Independência do Brasil"]
["2046-10-12","sexta-feira","Nossa Sr.a Aparecida - Padroeira do Brasil"]
["2046-11-02","sexta-feira","Finados"]
["2046-11-15","quinta-feira","Proclamação da República"]
["2046-11-20","terça-feira","Dia Nacional de Zumbi e da Consciência Negra"]
["2046-12-25","terça-feira","Natal"]
["2047-01-01","terça-feira","Confraternização Universal"]
["2047-02-25","segunda-feira","Carnaval"]
["2047-02-26","terça-feira","Carnaval"]
["2047-04-12","sexta-feira","Paixão de Cristo"]
["2047-04-21","domingo","Tiradentes"]
["2047-05-01","quarta-feira","Dia do Trabalho"]
["2047-06-13","quinta-feira","Corpus Christi"]
["2047-09-07","sábado","Independência do Brasil"]
["2047-10-12","sábado","Nossa Sr.a Aparecida - Padroeira do Brasil"]
["2047-11-02","sábado","Finados"]
["2047-11-15","sexta-feira","Proclamação da República"]
["2047-11-20","quarta-feira","Dia Nacional de Zumbi e da Consciência Negra"]
["2047-12-25","quarta-feira","Natal"]
["2048-01-01","quarta-feira","Confraternização Universal"]
["2048-02-17","segunda-feira","Carnaval"]
["2048-02-18","terça-feira","Carnaval"]
["2048-04-03","sexta-feira","Paixão de Cristo"]
["2048-04-21","terça-feira","Tiradentes"]
["2048-05-01","sexta-feira","Dia do Trabalho"]
["2048-06-04","quinta-feira","Corpus Christi"]
["2048-09-07","segunda-feira","Independência do Brasil"]
["2048-10-12","segunda-feira","Nossa Sr.a Aparecida - Padroeira do Brasil"]
["2048-11-02","segunda-feira","Finados"]
["2048-11-15","domingo","Proclamação da República"]
["2048-11-20","sexta-feira","Dia Nacional de Zumbi e da Consciência Negra"]
["2048-12-25","sexta-feira","Natal"]
["2049-01-01","sexta-feira","Confraternização Universal"]
["2049-03-01","segunda-feira","Carnaval"]
["2049-03-02","terça-feira","Carnaval"]
["2049-04-16","sexta-feira","Paixão de Cristo"]
["2049-04-21","quarta-feira","Tiradentes"]
["2049-05-01","sábado","Dia do Trabalho"]
["2049-06-17","quinta-feira","Corpus Christi"]
["2049-09-07","terça-feira","Independência do Brasil"]
["2049-10-12","terça-feira","Nossa Sr.a Aparecida - Padroeira do Brasil"]
["2049-11-02","terça-feira","Finados"]
["2049-11-15","segunda-feira","Proclamação da República"]
["2049-11-20","sábado","Dia Nacional de Zumbi e da Consciência Negra"]
["2049-12-25","sábado","Natal"]
["2050-01-01","sábado","Confraternização Universal"]
["2050-02-21","segunda-feira","Carnaval"]
["2050-02-22","terça-feira","Carnaval"]
["2050-04-08","sexta-feira","Paixão de Cristo"]
["2050-04-21","quinta-feira","Tiradentes"]
["2050-05-01","domingo","Dia do Trabalho"]
["2050-06-09","quinta-feira","Corpus Christi"]
["2050-09-07","quarta-feira","Independência do Brasil"]
["2050-10-12","quarta-feira","Nossa Sr.a Aparecida - Padroeira do Brasil"]
["2050-11-02","quarta-feira","Finados"]
["2050-11-15","terça-feira","Proclamação da República"]
["2050-11-20","domingo","Dia Nacional de Zumbi e da Consciência Negra"]
["2050-12-25","domingo","Natal"]
["2051-01-01","domingo","Confraternização Universal"]
["2051-02-13","segunda-feira","Carnaval"]
["2051-02-14","terça-feira","Carnaval"]
["2051-03-31","sexta-feira","Paixão de Cristo"]
["2051-04-21","sexta-feira","Tiradentes"]
["2051-05-01","segunda-feira","Dia do Trabalho"]
["2051-06-01","quinta-feira","Corpus Christi"]
["2051-09-07","quinta-feira","Independência do Brasil"]
["2051-10-12","quinta-feira","Nossa Sr.a Aparecida - Padroeira do Brasil"]
["2051-11-02","quinta-feira","Finados"]
["2051-11-15","quarta-feira","Proclamação da República"]
["2051-11-20","segunda-feira","Dia Nacional de Zumbi e da Consciência Negra"]
["2051-12-25","segunda-feira","Natal"]
["2052-01-01","segunda-feira","Confraternização Universal"]
["2052-03-04","segunda-feira","Carnaval"]
["2052-03-05","terça-feira","Carnaval"]
["2052-04-19","sexta-feira","Paixão de Cristo"]
["2052-04-21","domingo","Tiradentes"]
["2052-05-01","quarta-feira","Dia do Trabalho"]
["2052-06-20","quinta-feira","Corpus Christi"]
["2052-09-07","sábado","Independência do Brasil"]
["2052-10-12","sábado","Nossa Sr.a Aparecida - Padroeira do Brasil"]
["2052-11-02","sábado","Finados"]
["2052-11-15","sexta-feira","Proclamação da República"]
["2052-11-20","quarta-feira","Dia Nacional de Zumbi e da Consciência Negra"]
["2052-12-25","quarta-feira","Natal"]
["2053-01-01","quarta-feira","Confraternização Universal"]
["2053-02-17","segunda-feira","Carnaval"]
["2053-02-18","terça-feira","Carnaval"]
["2053-04-04","sexta-feira","Paixão de Cristo"]
["2053-04-21","segunda-feira","Tiradentes"]
["2053-05-01","quinta-feira","Dia do Trabalho"]
["2053-06-05","quinta-feira","Corpus Christi"]
["2053-09-07","domingo","Independência do Brasil"]
["2053-10-12","domingo","Nossa Sr.a Aparecida - Padroeira do Brasil"]
["2053-11-02","domingo","Finados"]
["2053-11-15","sábado","Proclamação da República"]
["2053-11-20","quinta-feira","Dia Nacional de Zumbi e da Consciência Negra"]
["2053-12-25","quinta-feira","Natal"]
["2054-01-01","quinta-feira","Confraternização Universal"]
["2054-02-09","segunda-feira","Carnaval"]
["2054-02-10","terça-feira","Carnaval"]
["2054-03-27","sexta-feira","Paixão de Cristo"]
["2054-04-21","terça-feira","Tiradentes"]
["2054-05-01","sexta-feira","Dia do Trabalho"]
["2054-05-28","quinta-feira","Corpus Christi"]
["2054-09-07","segunda-feira","Independência do Brasil"]
["2054-10-12","segunda-feira","Nossa Sr.a Aparecida - Padroeira do Brasil"]
["2054-11-02","segunda-feira","Finados"]
["2054-11-15","domingo","Proclamação da República"]
["2054-11-20","sexta-feira","Dia Nacional de Zumbi e da Consciência Negra"]
["2054-12-25","sexta-feira","Natal"]
["2055-01-01","sexta-feira","Confraternização Universal"]
["2055-03-01","segunda-feira","Carnaval"]
["2055-03-02","terça-feira","Carnaval"]
["2055-04-16","sexta-feira","Paixão de Cristo"]
["2055-04-21","quarta-feira","Tiradentes"]
["2055-05-01","sábado","Dia do Trabalho"]
["2055-06-17","quinta-feira","Corpus Christi"]
["2055-09-07","terça-feira","Independência do Brasil"]
["2055-10-12","terça-feira","Nossa Sr.a Aparecida - Padroeira do Brasil"]
["2055-11-02","terça-feira","Finados"]
["2055-11-15","segunda-feira","Proclamação da República"]
["2055-11-20","sábado","Dia Nacional de Zumbi e da Consciência Negra"]
["2055-12-25","sábado","Natal"]
["2056-01-01","sábado","Confraternização Universal"]
["2056-02-14","segunda-feira","Carnaval"]
["2056-02-15","terça-feira","Carnaval"]
["2056-03-31","sexta-feira","Paixão de Cristo"]
["2056-04-21","sexta-feira","Tiradentes"]
["2056-05-01","segunda-feira","Dia do Trabalho"]
["2056-06-01","quinta-feira","Corpus Christi"]
["2056-09-07","quinta-feira","Independência do Brasil"]
["2056-10-12","quinta-feira","Nossa Sr.a Aparecida - Padroeira do Brasil"]
["2056-11-02","quinta-feira","Finados"]
["2056-11-15","quarta-feira","Proclamação da República"]
["2056-11-20","segunda-feira","Dia Nacional de Zumbi e da Consciência Negra"]
["2056-12-25","segunda-feira","Natal"]
["2057-01-01","segunda-feira","Confraternização Universal"]
["2057-03-05","segunda-feira","Carnaval"]
["2057-03-06","terça-feira","Carnaval"]
["2057-04-20","sexta-feira","Paixão de Cristo"]
["2057-04-21","sábado","Tiradentes"]
["2057-05-01","terça-feira","Dia do Trabalho"]
["2057-06-21","quinta-feira","Corpus Christi"]
["2057-09-07","sexta-feira","Independência do Brasil"]
["2057-10-12","sexta-feira","Nossa Sr.a Aparecida - Padroeira do Brasil"]
["2057-11-02","sexta-feira","Finados"]
["2057-11-15","quinta-feira","Proclamação da República"]
["2057-11-20","terça-feira","Dia Nacional de Zumbi e da Consciência Negra"]
["2057-12-25","terça-feira","Natal"]
["2058-01-01","terça-feira","Confraternização Universal"]
["2058-02-25","segunda-feira","Carnaval"]
["2058-02-26","terça-feira","Carnaval"]
["2058-04-12","sexta-feira","Paixão de Cristo"]
["2058-04-21","domingo","Tiradentes"]
["2058-05-01","quarta-feira","Dia do Trabalho"]
["2058-06-13","quinta-feira","Corpus Christi"]
["2058-09-07","sábado","Independência do Brasil"]
["2058-10-12","sábado","Nossa Sr.a Aparecida - Padroeira do Brasil"]
["2058-11-02","sábado","Finados"]
["2058-11-15","sexta-feira","Proclamação da República"]
["2058-11-20","quarta-feira","Dia Nacional de Zumbi e da Consciência Negra"]
["2058-12-25","quarta-feira","Natal"]
["2059-01-01","quarta-feira","Confraternização Universal"]
["2059-02-10","segunda-feira","Carnaval"]
["2059-02-11","terça-feira","Carnaval"]
["2059-03-28","sexta-feira","Paixão de Cristo"]
["2059-04-21","segunda-feira","Tiradentes"]
["2059-05-01","quinta-feira","Dia do Trabalho"]
["2059-05-29","quinta-feira","Corpus Christi"]
["2059-09-07","domingo","Independência do Brasil"]
["2059-10-12","domingo","Nossa Sr.a Aparecida - Padroeira do Brasil"]
["2059-11-02","domingo","Finados"]
["2059-11-15","sábado","Proclamação da República"]
["2059-11-20","quinta-feira","Dia Nacional de Zumbi e da Consciência Negra"]
["2059-12-25","quinta-feira","Natal"]
["2060-01-01","quinta-feira","Confraternização Universal"]
["2060-03-01","segunda-feira","Carnaval"]
["2060-03-02","terça-feira","Carnaval"]
["2060-04-16","sexta-feira","Paixão de Cristo"]
["2060-04-21","quarta-feira","Tiradentes"]
["2060-05-01","sábado","Dia do Trabalho"]
["2060-06-17","quinta-feira","Corpus Christi"]
["2060-09-07","terça-feira","Independência do Brasil"]
["2060-10-12","terça-feira","Nossa Sr.a Aparecida - Padroeira do Brasil"]
["2060-11-02","terça-feira","Finados"]
["2060-11-15","segunda-feira","Proclamação da República"]
["2060-11-20","sábado","Dia Nacional de Zumbi e da Consciência Negra"]
["2060-12-25","sábado","Natal"]
["2061-01-01","sábado","Confraternização Universal"]
["2061-02-21","segunda-feira","Carnaval"]
["2061-02-22","terça-feira","Carnaval"]
["2061-04-08","sexta-feira","Paixão de Cristo"]
["2061-04-21","quinta-feira","Tiradentes"]
["2061-05-01","domingo","Dia do Trabalho"]
["2061-06-09","quinta-feira","Corpus Christi"]
["2061-09-07","quarta-feira","Independência do Brasil"]
["2061-10-12","quarta-feira","Nossa Sr.a Aparecida - Padroeira do Brasil"]
["2061-11-02","quarta-feira","Finados"]
["2061-11-15","terça-feira","Proclamação da República"]
["2061-11-20","domingo","Dia Nacional de Zumbi e da Consciência Negra"]
["2061-12-25","domingo","Natal"]
["2062-01-01","domingo","Confraternização Universal"]
["2062-02-06","segunda-feira","Carnaval"]
["2062-02-07","terça-feira","Carnaval"]
["2062-03-24","sexta-feira","Paixão de Cristo"]
["2062-04-21","sexta-feira","Tiradentes"]
["2062-05-01","segunda-feira","Dia do Trabalho"]
["2062-05-25","quinta-feira","Corpus Christi"]
["2062-09-07","quinta-feira","Independência do Brasil"]
["2062-10-12","quinta-feira","Nossa Sr.a Aparecida - Padroeira do Brasil"]
["2062-11-02","quinta-feira","Finados"]
["2062-11-15","quarta-feira","Proclamação da República"]
["2062-11-20","segunda-feira","Dia Nacional de Zumbi e da Consciência Negra"]
["2062-12-25","segunda-feira","Natal"]
["2063-01-01","segunda-feira","Confraternização Universal"]
["2063-02-26","segunda-feira","Carnaval"]
["2063-02-27","terça-feira","Carnaval"]
["2063-04-13","sexta-feira","Paixão de Cristo"]
["2063-04-21","sábado","Tiradentes"]
["2063-05-01","terça-feira","Dia do Trabalho"]
["2063-06-14","quinta-feira","Corpus Christi"]
["2063-09-07","sexta-feira","Independência do Brasil"]
["2063-10-12","sexta-feira","Nossa Sr.a Aparecida - Padroeira do Brasil"]
["2063-11-02","sexta-feira","Finados"]
["2063-11-15","quinta-feira","Proclamação da República"]
["2063-11-20","terça-feira","Dia Nacional de Zumbi e da Consciência Negra"]
["2063-12-25","terça-feira","Natal"]
["2064-01-01","terça-feira","Confraternização Universal"]
["2064-02-18","segunda-feira","Carnaval"]
["2064-02-19","terça-feira","Carnaval"]
["2064-04-04","sexta-feira","Paixão de Cristo"]
["2064-04-21","segunda-feira","Tiradentes"]
["2064-05-01","quinta-feira","Dia do Trabalho"]
["2064-06-05","quinta-feira","Corpus Christi"]
["2064-09-07","domingo","Independência do Brasil"]
["2064-10-12","domingo","Nossa Sr.a Aparecida - Padroeira do Brasil"]
["2064-11-02","domingo","Finados"]
["2064-11-15","sábado","Proclamação da República"]
["2064-11-20","quinta-feira","Dia Nacional de Zumbi e da Consciência Negra"]
["2064-12-25","quinta-feira","Natal"]
["2065-01-01","quinta-feira","Confraternização Universal"]
["2065-02-09","segunda-feira","Carnaval"]
["2065-02-10","terça-feira","Carnaval"]
["2065-03-27","sexta-feira","Paixão de Cristo"]
["2065-04-21","terça-feira","Tiradentes"]
["2065-05-01","sexta-feira","Dia do Trabalho"]
["2065-05-28","quinta-feira","Corpus Christi"]
["2065-09-07","segunda-feira","Independência do Brasil"]
["2065-10-12","segunda-feira","Nossa Sr.a Aparecida - Padroeira do Brasil"]
["2065-11-02","segunda-feira","Finados"]
["2065-11-15","domingo","Proclamação da República"]
["2065-11-20","sexta-feira","Dia Nacional de Zumbi e da Consciência Negra"]
["2065-12-25","sexta-feira","Natal"]
["2066-01-01","sexta-feira","Confraternização Universal"]
["2066-02-22","segunda-feira","Carnaval"]
["2066-02-23","terça-feira","Carnaval"]
["2066-04-09","sexta-feira","Paixão de Cristo"]
["2066-04-21","quarta-feira","Tiradentes"]
["2066-05-01","sábado","Dia do Trabalho"]
["2066-06-10","quinta-feira","Corpus Christi"]
["2066-09-07","terça-feira","Independência do Brasil"]
["2066-10-12","terça-feira","Nossa Sr.a Aparecida - Padroeira do Brasil"]
["2066-11-02","terça-feira","Finados"]
["2066-11-15","segunda-feira","Proclamação da República"]
["2066-11-20","sábado","Dia Nacional de Zumbi e da Consciência Negra"]
["2066-12-25","sábado","Natal"]
["2067-01-01","sábado","Confraternização Universal"]
["2067-02-14","segunda-feira","Carnaval"]
["2067-02-15","terça-feira","Carnaval"]
["2067-04-01","sexta-feira","Paixão de Cristo"]
["2067-04-21","quinta-feira","Tiradentes"]
["2067-05-01","domingo","Dia do Trabalho"]
["2067-06-02","quinta-feira","Corpus Christi"]
["2067-09-07","quarta-feira","Independência do Brasil"]
["2067-10-12","quarta-feira","Nossa Sr.a Aparecida - Padroeira do Brasil"]
["2067-11-02","quarta-feira","Finados"]
["2067-11-15","terça-feira","Proclamação da República"]
["2067-11-20","domingo","Dia Nacional de Zumbi e da Consciência Negra"]
["2067-12-25","domingo","Natal"]
["2068-01-01","domingo","Confraternização Universal"]
["2068-03-05","segunda-feira","Carnaval"]
["2068-03-06","terça-feira","Carnaval"]
["2068-04-20","sexta-feira","Paixão de Cristo"]
["2068-04-21","sábado","Tiradentes"]
["2068-05-01","terça-feira","Dia do Trabalho"]
["2068-06-21","quinta-feira","Corpus Christi"]
["2068-09-07","sexta-feira","Independência do Brasil"]
["2068-10-12","sexta-feira","Nossa Sr.a Aparecida - Padroeira do Brasil"]
["2068-11-02","sexta-feira","Finados"]
["2068-11-15","quinta-feira","Proclamação da República"]
["2068-11-20","terça-feira","Dia Nacional de Zumbi e da Consciência Negra"]
["2068-12-25","terça-feira","Natal"]
["2069-01-01","terça-feira","Confraternização Universal"]
["2069-02-25","segunda-feira","Carnaval"]
["2069-02-26","terça-feira","Carnaval"]
["2069-04-12","sexta-feira","Paixão de Cristo"]
["2069-04-21","domingo","Tiradentes"]
["2069-05-01","quarta-feira","Dia do Trabalho"]
["2069-06-13","quinta-feira","Corpus Christi"]
["2069-09-07","sábado","Independência do Brasil"]
["2069-10-12","sábado","Nossa Sr.a Aparecida - Padroeira do Brasil"]
["2069-11-02","sábado","Finados"]
["2069-11-15","sexta-feira","Proclamação da República"]
["2069-11-20","quarta-feira","Dia Nacional de Zumbi e da Consciência Negra"]
["2069-12-25","quarta-feira","Natal"]
["2070-01-01","quarta-feira","Confraternização Universal"]
["2070-02-10","segunda-feira","Carnaval"]
["2070-02-11","terça-feira","Carnaval"]
["2070-03-28","sexta-feira","Paixão de Cristo"]
["2070-04-21","segunda-feira","Tiradentes"]
["2070-05-01","quinta-feira","Dia do Trabalho"]
["2070-05-29","quinta-feira","Corpus Christi"]
["2070-09-07","domingo","Independência do Brasil"]
["2070-10-12","domingo","Nossa Sr.a Aparecida - Padroeira do Brasil"]
["2070-11-02","domingo","Finados"]
["2070-11-15","sábado","Proclamação da República"]
["2070-11-20","quinta-feira","Dia Nacional de Zumbi e da Consciência Negra"]
["2070-12-25","quinta-feira","Natal"]
["2071-01-01","quinta-feira","Confraternização Universal"]
["2071-03-02","segunda-feira","Carnaval"]
["2071-03-03","terça-feira","Carnaval"]
["2071-04-17","sexta-feira","Paixão de Cristo"]
["2071-04-21","terça-feira","Tiradentes"]
["2071-05-01","sexta-feira","Dia do Trabalho"]
["2071-06-18","quinta-feira","Corpus Christi"]
["2071-09-07","segunda-feira","Independência do Brasil"]
["2071-10-12","segunda-feira","Nossa Sr.a Aparecida - Padroeira do Brasil"]
["2071-11-02","segunda-feira","Finados"]
["2071-11-15","domingo","Proclamação da República"]
["2071-11-20","sexta-feira","Dia Nacional de Zumbi e da Consciência Negra"]
["2071-12-25","sexta-feira","Natal"]
["2072-01-01","sexta-feira","Confraternização Universal"]
["2072-02-22","segunda-feira","Carnaval"]
["2072-02-23","terça-feira","Carnaval"]
["2072-04-08","sexta-feira","Paixão de Cristo"]
["2072-04-21","quinta-feira","Tiradentes"]
["2072-05-01","domingo","Dia do Trabalho"]
["2072-06-09","quinta-feira","Corpus Christi"]
["2072-09-07","quarta-feira","Independência do Brasil"]
["2072-10-12","quarta-feira","Nossa Sr.a Aparecida - Padroeira do Brasil"]
["2072-11-02","quarta-feira","Finados"]
["2072-11-15","terça-feira","Proclamação da República"]
["2072-11-20","domingo","Dia Nacional de Zumbi e da Consciência Negra"]
["2072-12-25","domingo","Natal"]
["2073-01-01","domingo","Confraternização Universal"]
["2073-02-06","segunda-feira","Carnaval"]
["2073-02-07","terça-feira","Carnaval"]
["2073-03-24","sexta-feira","Paixão de Cristo"]
["2073-04-21","sexta-feira","Tiradentes"]
["2073-05-01","segunda-feira","Dia do Trabalho"]
["2073-05-25","quinta-feira","Corpus Christi"]
["2073-09-07","quinta-feira","Independência do Brasil"]
["2073-10-12","quinta-feira","Nossa Sr.a Aparecida - Padroeira do Brasil"]
["2073-11-02","quinta-feira","Finados"]
["2073-11-15","quarta-feira","Proclamação da República"]
["2073-11-20","segunda-feira","Dia Nacional de Zumbi e da Consciência Negra"]
["2073-12-25","segunda-feira","Natal"]
["2074-01-01","segunda-feira","Confraternização Universal"]
["2074-02-26","segunda-feira","Carnaval"]
["2074-02-27","terça-feira","Carnaval"]
["2074-04-13","sexta-feira","Paixão de Cristo"]
["2074-04-21","sábado","Tiradentes"]
["2074-05-01","terça-feira","Dia do Trabalho"]
["2074-06-14","quinta-feira","Corpus Christi"]
["2074-09-07","sexta-feira","Independência do Brasil"]
["2074-10-12","sexta-feira","Nossa Sr.a Aparecida - Padroeira do Brasil"]
["2074-11-02","sexta-feira","Finados"]
["2074-11-15","quinta-feira","Proclamação da República"]
["2074-11-20","terça-feira","Dia Nacional de Zumbi e da Consciência Negra"]
["2074-12-25","terça-feira","Natal"]
["2075-01-01","terça-feira","Confraternização Universal"]
["2075-02-18","segunda-feira","Carnaval"]
["2075-02-19","terça-feira","Carnaval"]
["2075-04-05","sexta-feira","Paixão de Cristo"]
["2075-04-21","domingo","Tiradentes"]
["2075-05-01","quarta-feira","Dia do Trabalho"]
["2075-06-06","quinta-feira","Corpus Christi"]
["2075-09-07","sábado","Independência do Brasil"]
["2075-10-12","sábado","Nossa Sr.a Aparecida - Padroeira do Brasil"]
["2075-11-02","sábado","Finados"]
["2075-11-15","sexta-feira","Proclamação da República"]
["2075-11-20","quarta-feira","Dia Nacional de Zumbi e da Consciência Negra"]
["2075-12-25","quarta-feira","Natal"]
["2076-01-01","quarta-feira","Confraternização Universal"]
["2076-03-02","segunda-feira","Carnaval"]
["2076-03-03","terça-feira","Carnaval"]
["2076-04-17","sexta-feira","Paixão de Cristo"]
["2076-04-21","terça-feira","Tiradentes"]
["2076-05-01","sexta-feira","Dia do Trabalho"]
["2076-06-18","quinta-feira","Corpus Christi"]
["2076-09-07","segunda-feira","Independência do Brasil"]
["2076-10-12","segunda-feira","Nossa Sr.a Aparecida - Padroeira do Brasil"]
["2076-11-02","segunda-feira","Finados"]
["2076-11-15","domingo","Proclamação da República"]
["2076-11-20","sexta-feira","Dia Nacional de Zumbi e da Consciência Negra"]
["2076-12-25","sexta-feira","Natal"]
["2077-01-01","sexta-feira","Confraternização Universal"]
["2077-02-22","segunda-feira","Carnaval"]
["2077-02-23","terça-feira","Carnaval"]
["2077-04-09","sexta-feira","Paixão de Cristo"]
["2077-04-21","quarta-feira","Tiradentes"]
["2077-05-01","sábado","Dia do Trabalho"]
["2077-06-10","quinta-feira","Corpus Christi"]
["2077-09-07","terça-feira","Independência do Brasil"]
["2077-10-12","terça-feira","Nossa Sr.a Aparecida - Padroeira do Brasil"]
["2077-11-02","terça-feira","Finados"]
["2077-11-15","segunda-feira","Proclamação da República"]
["2077-11-20","sábado","Dia Nacional de Zumbi e da Consciência Negra"]
["2077-12-25","sábado","Natal"]
["2078-01-01","sábado","Confraternização Universal"]
["2078-02-14","segunda-feira","Carnaval"]
["2078-02-15","terça-feira","Carnaval"]
["2078-04-01","sexta-feira","Paixão de Cristo"]
["2078-04-21","quinta-feira","Tiradentes"]
["2078-05-01","domingo","Dia do Trabalho"]
["2078-06-02","quinta-feira","Corpus Christi"]
["2078-09-07","quarta-feira","Independência do Brasil"]
["2078-10-12","quarta-feira","Nossa Sr.a Aparecida - Padroeira do Brasil"]
["2078-11-02","quarta-feira","Finados"]
["2078-11-15","terça-feira","Proclamação da República"]
["2078-11-20","domingo","Dia Nacional de Zumbi e da Consciência Negra"]
["2078-12-25","domingo","Natal"]
["2079-01-01","domingo","Confraternização Universal"]
["2079-03-06","segunda-feira","Carnaval"]
["2079-03-07","terça-feira","Carnaval"]
["2079-04-21","sexta-feira","Paixão de Cristo"]
["2079-04-21","sexta-feira","Tiradentes"]
["2079-05-01","segunda-feira","Dia do Trabalho"]
["2079-06-22","quinta-feira","Corpus Christi"]
["2079-09-07","quinta-feira","Independência do Brasil"]
["2079-10-12","quinta-feira","Nossa Sr.a Aparecida - Padroeira do Brasil"]
["2079-11-02","quinta-feira","Finados"]
["2079-11-15","quarta-feira","Proclamação da República"]
["2079-11-20","segunda-feira","Dia Nacional de Zumbi e da Consciência Negra"]
["2079-12-25","segunda-feira","Natal"]
["2080-01-01","segunda-feira","Confraternização Universal"]
["2080-02-19","segunda-feira","Carnaval"]
["2080-02-20","terça-feira","Carnaval"]
["2080-04-05","sexta-feira","Paixão de Cristo"]
["2080-04-21","domingo","Tiradentes"]
["2080-05-01","quarta-feira","Dia do Trabalho"]
["2080-06-06","quinta-feira","Corpus Christi"]
["2080-09-07","sábado","Independência do Brasil"]
["2080-10-12","sábado","Nossa Sr.a Aparecida - Padroeira do Brasil"]
["2080-11-02","sábado","Finados"]
["2080-11-15","sexta-feira","Proclamação da República"]
["2080-11-20","quarta-feira","Dia Nacional de Zumbi e da Consciência Negra"]
["2080-12-25","quarta-feira","Natal"]
["2081-01-01","quarta-feira","Confraternização Universal"]
["2081-02-10","segunda-feira","Carnaval"]
["2081-02-11","terça-feira","Carnaval"]
["2081-03-28","sexta-feira","Paixão de Cristo"]
["2081-04-21","segunda-feira","Tiradentes"]
["2081-05-01","quinta-feira","Dia do Trabalho"]
["2081-05-29","quinta-feira","Corpus Christi"]
["2081-09-07","domingo","Independência do Brasil"]
["2081-10-12","domingo","Nossa Sr.a Aparecida - Padroeira do Brasil"]
["2081-11-02","domingo","Finados"]
["2081-11-15","sábado","Proclamação da República"]
["2081-11-20","quinta-feira","Dia Nacional de Zumbi e da Consciência Negra"]
["2081-12-25","quinta-feira","Natal"]
["2082-01-01","quinta-feira","Confraternização Universal"]
["2082-03-02","segunda-feira","Carnaval"]
["2082-03-03","terça-feira","Carnaval"]
["2082-04-17","sexta-feira","Paixão de Cristo"]
["2082-04-21","terça-feira","Tiradentes"]
["2082-05-01","sexta-feira","Dia do Trabalho"]
["2082-06-18","quinta-feira","Corpus Christi"]
["2082-09-07","segunda-feira","Independência do Brasil"]
["2082-10-12","segunda-feira","Nossa Sr.a Aparecida - Padroeira do Brasil"]
["2082-11-02","segunda-feira","Finados"]
["2082-11-15","domingo","Proclamação da República"]
["2082-11-20","sexta-feira","Dia Nacional de Zumbi e da Consciência Negra"]
["2082-12-25","sexta-feira","Natal"]
["2083-01-01","sexta-feira","Confraternização Universal"]
["2083-02-15","segunda-feira","Carnaval"]
["2083-02-16","terça-feira","Carnaval"]
["2083-04-02","sexta-feira","Paixão de Cristo"]
["2083-04-21","quarta-feira","Tiradentes"]
["2083-05-01","sábado","Dia do Trabalho"]
["2083-06-03","quinta-feira","Corpus Christi"]
["2083-09-07","terça-feira","Independência do Brasil"]
["2083-10-12","terça-feira","Nossa Sr.a Aparecida - Padroeira do Brasil"]
["2083-11-02","terça-feira","Finados"]
["2083-11-15","segunda-feira","Proclamação da República"]
["2083-11-20","sábado","Dia Nacional de Zumbi e da Consciência Negra"]
["2083-12-25","sábado","Natal"]
["2084-01-01","sábado","Confraternização Universal"]
["2084-02-07","segunda-feira","Carnaval"]
["2084-02-08","terça-feira","Carnaval"]
["2084-03-24","sexta-feira","Paixão de Cristo"]
["2084-04-21","sexta-feira","Tiradentes"]
["2084-05-01","segunda-feira","Dia do Trabalho"]
["2084-05-25","quinta-feira","Corpus Christi"]
["2084-09-07","quinta-feira","Independência do Brasil"]
["2084-10-12","quinta-feira","Nossa Sr.a Aparecida - Padroeira do Brasil"]
["2084-11-02","quinta-feira","Finados"]
["2084-11-15","quarta-feira","Proclamação da República"]
["2084-11-20","segunda-feira","Dia Nacional de Zumbi e da Consciência Negra"]
["2084-12-25","segunda-feira","Natal"]
["2085-01-01","segunda-feira","Confraternização Universal"]
["2085-02-26","segunda-feira","Carnaval"]
["2085-02-27","terça-feira","Carnaval"]
["2085-04-13","sexta-feira","Paixão de Cristo"]
["2085-04-21","sábado","Tiradentes"]
["2085-05-01","terça-feira","Dia do Trabalho"]
["2085-06-14","quinta-feira","Corpus Christi"]
["2085-09-07","sexta-feira","Independência do Brasil"]
["2085-10-12","sexta-feira","Nossa Sr.a Aparecida - Padroeira do Brasil"]
["2085-11-02","sexta-feira","Finados"]
["2085-11-15","quinta-feira","Proclamação da República"]
["2085-11-20","terça-feira","Dia Nacional de Zumbi e da Consciência Negra"]
["2085-12-25","terça-feira","Natal"]
["2086-01-01","terça-feira","Confraternização Universal"]
["2086-02-11","segunda-feira","Carnaval"]
["2086-02-12","terça-feira","Carnaval"]
["2086-03-29","sexta-feira","Paixão de Cristo"]
["2086-04-21","domingo","Tiradentes"]
["2086-05-01","quarta-feira","Dia do Trabalho"]
["2086-05-30","quinta-feira","Corpus Christi"]
["2086-09-07","sábado","Independência do Brasil"]
["2086-10-12","sábado","Nossa Sr.a Aparecida - Padroeira do Brasil"]
["2086-11-02","sábado","Finados"]
["2086-11-15","sexta-feira","Proclamação da República"]
["2086-11-20","quarta-feira","Dia Nacional de Zumbi e da Consciência Negra"]
["2086-12-25","quarta-feira","Natal"]
["2087-01-01","quarta-feira","Confraternização Universal"]
["2087-03-03","segunda-feira","Carnaval"]
["2087-03-04","terça-feira","Carnaval"]
["2087-04-18","sexta-feira","Paixão de Cristo"]
["2087-04-21","segunda-feira","Tiradentes"]
["2087-05-01","quinta-feira","Dia do Trabalho"]
["2087-06-19","quinta-feira","Corpus Christi"]
["2087-09-07","domingo","Independência do Brasil"]
["2087-10-12","domingo","Nossa Sr.a Aparecida - Padroeira do Brasil"]
["2087-11-02","domingo","Finados"]
["2087-11-15","sábado","Proclamação da República"]
["2087-11-20","quinta-feira","Dia Nacional de Zumbi e da Consciência Negra"]
["2087-12-25","quinta-feira","Natal"]
["2088-01-01","quinta-feira","Confraternização Universal"]
["2088-02-23","segunda-feira","Carnaval"]
["2088-02-24","terça-feira","Carnaval"]
["2088-04-09","sexta-feira","Paixão de Cristo"]
["2088-04-21","quarta-feira","Tiradentes"]
["2088-05-01","sábado","Dia do Trabalho"]
["2088-06-10","quinta-feira","Corpus Christi"]
["2088-09-07","terça-feira","Independência do Brasil"]
["2088-10-12","terça-feira","Nossa Sr.a Aparecida - Padroeira do Brasil"]
["2088-11-02","terça-feira","Finados"]
["2088-11-15","segunda-feira","Proclamação da República"]
["2088-11-20","sábado","Dia Nacional de Zumbi e da Consciência Negra"]
["2088-12-25","sábado","Natal"]
["2089-01-01","sábado","Confraternização Universal"]
["2089-02-14","segunda-feira","Carnaval"]
["2089-02-15","terça-feira","Carnaval"]
["2089-04-01","sexta-feira","Paixão de Cristo"]
["2089-04-21","quinta-feira","Tiradentes"]
["2089-05-01","domingo","Dia do Trabalho"]
["2089-06-02","quinta-feira","Corpus Christi"]
["2089-09-07","quarta-feira","Independência do Brasil"]
["2089-10-12","quarta-feira","Nossa Sr.a Aparecida - Padroeira do Brasil"]
["2089-11-02","quarta-feira","Finados"]
["2089-11-15","terça-feira","Proclamação da República"]
["2089-11-20","domingo","Dia Nacional de Zumbi e da Consciência Negra"]
["2089-12-25","domingo","Natal"]
["2090-01-01","domingo","Confraternização Universal"]
["2090-02-27","segunda-feira","Carnaval"]
["2090-02-28","terça-feira","Carnaval"]
["2090-04-14","sexta-feira","Paixão de Cristo"]
["2090-04-21","sexta-feira","Tiradentes"]
["2090-05-01","segunda-feira","Dia do Trabalho"]
["2090-06-15","quinta-feira","Corpus Christi"]
["2090-09-07","quinta-feira","Independência do Brasil"]
["2090-10-12","quinta-feira","Nossa Sr.a Aparecida - Padroeira do Brasil"]
["2090-11-02","quinta-feira","Finados"]
["2090-11-15","quarta-feira","Proclamação da República"]
["2090-11-20","segunda-feira","Dia Nacional de Zumbi e da Consciência Negra"]
["2090-12-25","segunda-feira","Natal"]
["2091-01-01","segunda-feira","Confraternização Universal"]
["2091-02-19","segunda-feira","Carnaval"]
["2091-02-20","terça-feira","Carnaval"]
["2091-04-06","sexta-feira","Paixão de Cristo"]
["2091-04-21","sábado","Tiradentes"]
["2091-05-01","terça-feira","Dia do Trabalho"]
["2091-06-07","quinta-feira","Corpus Christi"]
["2091-09-07","sexta-feira","Independência do Brasil"]
["2091-10-12","sexta-feira","Nossa Sr.a Aparecida - Padroeira do Brasil"]
["2091-11-02","sexta-feira","Finados"]
["2091-11-15","quinta-feira","Proclamação da República"]
["2091-11-20","terça-feira","Dia Nacional de Zumbi e da Consciência Negra"]
["2091-12-25","terça-feira","Natal"]
["2092-01-01","terça-feira","Confraternização Universal"]
["2092-02-11","segunda-feira","Carnaval"]
["2092-02-12","terça-feira","Carnaval"]
["2092-03-28","sexta-feira","Paixão de Cristo"]
["2092-04-21","segunda-feira","Tiradentes"]
["2092-05-01","quinta-feira","Dia do Trabalho"]
["2092-05-29","quinta-feira","Corpus Christi"]
["2092-09-07","domingo","Independência do Brasil"]
["2092-10-12","domingo","Nossa Sr.a Aparecida - Padroeira do Brasil"]
["2092-11-02","domingo","Finados"]
["2092-11-15","sábado","Proclamação da República"]
["2092-11-20","quinta-feira","Dia Nacional de Zumbi e da Consciência Negra"]
["2092-12-25","quinta-feira","Natal"]
["2093-01-01","quinta-feira","Confraternização Universal"]
["2093-02-23","segunda-feira","Carnaval"]
["2093-02-24","terça-feira","Carnaval"]
["2093-04-10","sexta-feira","Paixão de Cristo"]
["2093-04-21","terça-feira","Tiradentes"]
["2093-05-01","sexta-feira","Dia do Trabalho"]
["2093-06-11","quinta-feira","Corpus Christi"]
["2093-09-07","segunda-feira","Independência do Brasil"]
["2093-10-12","segunda-feira","Nossa Sr.a Aparecida - Padroeira do Brasil"]
["2093-11-02","segunda-feira","Finados"]
["2093-11-15","domingo","Proclamação da República"]
["2093-11-20","sexta-feira","Dia Nacional de Zumbi e da Consciência Negra"]
["2093-12-25","sexta-feira","Natal"]
["2094-01-01","sexta-feira","Confraternização Universal"]
["2094-02-15","segunda-feira","Carnaval"]
["2094-02-16","terça-feira","Carnaval"]
["2094-04-02","sexta-feira","Paixão de Cristo"]
["2094-04-21","quarta-feira","Tiradentes"]
["2094-05-01","sábado","Dia do Trabalho"]
["2094-06-03","quinta-feira","Corpus Christi"]
["2094-09-07","terça-feira","Independência do Brasil"]
["2094-10-12","terça-feira","Nossa Sr.a Aparecida - Padroeira do Brasil"]
["2094-11-02","terça-feira","Finados"]
["2094-11-15","segunda-feira","Proclamação da República"]
["2094-11-20","sábado","Dia Nacional de Zumbi e da Consciência Negra"]
["2094-12-25","sábado","Natal"]
["2095-01-01","sábado","Confraternização Universal"]
["2095-03-07","segunda-feira","Carnaval"]
["2095-03-08","terça-feira","Carnaval"]
["2095-04-21","quinta-feira","Tiradentes"]
["2095-04-22","sexta-feira","Paixão de Cristo"]
["2095-05-01","domingo","Dia do Trabalho"]
["2095-06-23","quinta-feira","Corpus Christi"]
["2095-09-07","quarta-feira","Independência do Brasil"]
["2095-10-12","quarta-feira","Nossa Sr.a Aparecida - Padroeira do Brasil"]
["2095-11-02","quarta-feira","Finados"]
["2095-11-15","terça-feira","Proclamação da República"]
["2095-11-20","domingo","Dia Nacional de Zumbi e da Consciência Negra"]
["2095-12-25","domingo","Natal"]
["2096-01-01","domingo","Confraternização Universal"]
["2096-02-27","segunda-feira","Carnaval"]
["2096-02-28","terça-feira","Carnaval"]
["2096-04-13","sexta-feira","Paixão de Cristo"]
["2096-04-21","sábado","Tiradentes"]
["2096-05-01","terça-feira","Dia do Trabalho"]
["2096-06-14","quinta-feira","Corpus Christi"]
["2096-09-07","sexta-feira","Independência do Brasil"]
["2096-10-12","sexta-feira","Nossa Sr.a Aparecida - Padroeira do Brasil"]
["2096-11-02","sexta-feira","Finados"]
["2096-11-15","quinta-feira","Proclamação da República"]
["2096-11-20","terça-feira","Dia Nacional de Zumbi e da Consciência Negra"]
["2096-12-25","terça-feira","Natal"]
["2097-01-01","terça-feira","Confraternização Universal"]
["2097-02-11","segunda-feira","Carnaval"]
["2097-02-12","terça-feira","Carnaval"]
["2097-03-29","sexta-feira","Paixão de Cristo"]
["2097-04-21","domingo","Tiradentes"]
["2097-05-01","quarta-feira","Dia do Trabalho"]
["2097-05-30","quinta-feira","Corpus Christi"]
["2097-09-07","sábado","Independência do Brasil"]
["2097-10-12","sábado","Nossa Sr.a Aparecida - Padroeira do Brasil"]
["2097-11-02","sábado","Finados"]
["2097-11-15","sexta-feira","Proclamação da República"]
["2097-11-20","quarta-feira","Dia Nacional de Zumbi e da Consciência Negra"]
["2097-12-25","quarta-feira","Natal"]
["2098-01-01","quarta-feira","Confraternização Universal"]
["2098-03-03","segunda-feira","Carnaval"]
["2098-03-04","terça-feira","Carnaval"]
["2098-04-18","sexta-feira","Paixão de Cristo"]
["2098-04-21","segunda-feira","Tiradentes"]
["2098-05-01","quinta-feira","Dia do Trabalho"]
["2098-06-19","quinta-feira","Corpus Christi"]
["2098-09-07","domingo","Independência do Brasil"]
["2098-10-12","domingo","Nossa Sr.a Aparecida - Padroeira do Brasil"]
["2098-11-02","domingo","Finados"]
["2098-11-15","sábado","Proclamação da República"]
["2098-11-20","quinta-feira","Dia Nacional de Zumbi e da Consciência Negra"]
["2098-12-25","quinta-feira","Natal"]
["2099-01-01","quinta-feira","Confraternização Universal "]
["2099-02-23","segunda-feira","Carnaval"]
["2099-02-24","terça-feira","Carnaval"]
["2099-04-10","sexta-feira","Paixão de Cristo"]
["2099-04-21","terça-feira","Tiradentes"]
["2099-05-01","sexta-feira","Dia do Trabalho"]
["2099-06-11","quinta-feira","Corpus Christi"]
["2099-09-07","segunda-feira","Independência do Brasil"]
["2099-10-12","segunda-feira","Nossa Sr.a Aparecida - Padroeira do Brasil"]
["2099-11-02","segunda-feira","Finados"]
["2099-11-15","domingo","Proclamação da República"]
["2099-11-20","sexta-feira","Dia Nacional de Zumbi e da Consciência Negra"]
["2099-12-25","sexta-feira","Natal"]

{"sheet":"VL_PARC","index":3,"n_rows":1297,"n_cols":153,"rows_kept":1297,"cut":false,"hidden":true,"merged":[]}
["IOF ad",{"$f":"ROUND(3%/365,6)","v":8.2000000000000001E-5},null,null,null,null,null,null,null,null,null,null,null,null,null,null,null,null,null,null,"TETO",null,{"$f":"J16","v":1.6897391149092833E-2},{"$f":"IF($P$2=$AH$4,AH1,AP1)","v":"INSS"},{"$f":"IF($P$2=$AH$4,AI1,AQ1)","v":1.35E-2},{"$f":"IF($P$2=$AH$4,AJ1,AR1)","v":1.8499999999999999E-2},{"$f":"IF($P$2=$AH$4,AK1,AS1)","v":"Port"},{"$f":"'Simulador Port'!E18","v":"NORMAL"},null,null,null,null,null,"INSS",{"$f":"'Planilha 1'!AI1","v":1.35E-2},{"$f":"'Planilha 1'!AJ1","v":1.8499999999999999E-2},"Port",null,null,null,null,"SIAPE",{"$f":"'Planilha 1'!AQ1","v":1.6E-2},{"$f":"'Planilha 1'!AR1","v":1.7999999999999999E-2},"Port"]
["IOF adic.",3.8E-3,null,null,null,null,null,"CONVÊNIO",null,null,null,null,null,null,null,{"$f":"'Planilha 1'!P2","v":"INSS"},null,null,null,null,"TAXA TETO PONDERADO",{"$f":"((W1*W2)+(Z1*(Z2-W2)))/P3","v":1.7609661749496016E-2},{"$f":"J10","v":60},null,null,{"$f":"P3","v":108},null,null,null,null,null,null,null,null,null,null,null,null,null,null,null,null,96]
[null,null,null,null,null,null,null,null,null,null,null,null,null,null,"Prazo simulado (meses)",{"$f":"'Planilha 1'!P3","v":108},null,null,null,null,null,null,null,"Convenio","TxMax","TxMin","Nome",null,"Fator um jr","Novo Saldo","IOF","TROCO","VLR FIN","Convenio","TxMax","TxMin","Nome","Nome",null,null,null,"Convenio","TxMax","TxMin","Nome","Nome"]
[null,null,null,null,null,null,null,null,null,null,null,null,null,null,null,null,null,null,null,null,"Troco min %",0,{"$f":"IF(AND(X4=\"INSS\",$AB$1=\"NORMAL\",OR(AA4=$AK$8,AA4=$AK$9)),0,IF($I$17<$Y$1,0,IFERROR(IF(AG4<$V$6,0,IF(AND(Z4>$V$2,Y4>$V$2),0,IF(OR(AF4/AD4>$V$4,$AF4>=$V$5),W3+1,0))),0)))","v":0},{"$f":"IF($P$2=$AH$4,AH4,AP4)","v":"INSS"},{"$f":"IF($P$2=$AH$4,AI4,AQ4)","v":1.8499999999999999E-2},{"$f":"IF($P$2=$AH$4,AJ4,AR4)","v":1.78E-2},"Normal",{"$f":"IF($P$2=$AH$4,AL4,AT4)","v":"Tx1,850~1,78 (+90d Car) Normal-RfnP"},{"$f":"(1+MIN(Y4,$V$2))^(1/30)","v":1.0005820495985809},{"$f":"OFFSET($U$32,,ROW()-ROW($AD$4))","v":12125.074221916626},{"$f":"OFFSET($AH$29,,ROW()-ROW($AE$4))","v":92.319531811806996},{"$f":"AD4-AE4-$J$8","v":2032.7546142523988},{"$f":"SUM(AD4,AF4)","v":14157.828836169025},{"$f":"'Planilha 1'!AH4","v":"INSS"},{"$f":"'Planilha 1'!AI4","v":1.8499999999999999E-2},{"$f":"'Planilha 1'!AJ4","v":1.78E-2},{"$f":"'Planilha 1'!AK4","v":"Normal"},{"$f":"'Planilha 1'!AL4","v":"Tx1,850~1,78 (+90d Car) Normal-RfnP"},null,null,null,{"$f":"'Planilha 1'!AP4","v":"SIAPE"},{"$f":"'Planilha 1'!AQ4","v":1.7989999999999999E-2},{"$f":"'Planilha 1'!AR4","v":1.7989999999999999E-2},{"$f":"'Planilha 1'!AS4","v":"Normal"},{"$f":"'Planilha 1'!AT4","v":"SIAPE RfnPort Tx1.799 Normal Web"},null,null,null,{"$f":"AJ4<AI4","v":true}]
[null,null,null,null,null,null,null,null,null,null,null,null,null,null,null,null,null,null,null,null,"Troco min R$",50,{"$f":"IF(AND(X5=\"INSS\",$AB$1=\"NORMAL\",OR(AA5=$AK$8,AA5=$AK$9)),0,IF($I$17<$Y$1,0,IFERROR(IF(AG5<$V$6,0,IF(AND(Z5>$V$2,Y5>$V$2),0,IF(OR(AF5/AD5>$V$4,$AF5>=$V$5),W4+1,0))),0)))","v":1},"INSS",{"$f":"IF($P$2=$AH$4,AI5,AQ5)","v":1.779E-2},{"$f":"IF($P$2=$AH$4,AJ5,AR5)","v":1.7399999999999999E-2},"Flex 1","Tx1,779~1,74 (+90d Car) Flex1-RfnP",{"$f":"(1+MIN(Y5,$V$2))^(1/30)","v":1.0005820495985809},{"$f":"OFFSET($U$32,,ROW()-ROW($AD$4))","v":12125.074221916626},{"$f":"OFFSET($AH$29,,ROW()-ROW($AE$4))","v":92.319531811806996},{"$f":"AD5-AE5-$J$8","v":2032.7546142523988},{"$f":"SUM(AD5,AF5)","v":14157.828836169025},{"$f":"'Planilha 1'!AH5","v":"INSS"},{"$f":"'Planilha 1'!AI5","v":1.779E-2},{"$f":"'Planilha 1'!AJ5","v":1.7399999999999999E-2},{"$f":"'Planilha 1'!AK5","v":"Flex 1"},{"$f":"'Planilha 1'!AL5","v":"Tx1,779~1,74 (+90d Car) Flex1-RfnP"},null,null,null,{"$f":"'Planilha 1'!AP5","v":"SIAPE"},{"$f":"'Planilha 1'!AQ5","v":1.7979999999999999E-2},{"$f":"'Planilha 1'!AR5","v":1.7499999999999998E-2},{"$f":"'Planilha 1'!AS5","v":"Flex 1"},{"$f":"'Planilha 1'!AT5","v":"SIAPE RfnPort Tx1.798 ~ 1.75 Flex 1 Web"}]
[null,null,null,null,null,null,null,null,null,null,"Observação",null,"Tabela",null,"Val Fin Novo","Troco",null,null,null,null,"Ticket Min",2000,2,"INSS",1.7389999999999999E-2,1.7000000000000001E-2,"Flex 2","Tx1,739~1,70 (+90d Car) Flex2-RfnP",1.0005748493086513,12236.454167510979,94.317825693092928,2142.136265965466,14378.590433476445,{"$f":"'Planilha 1'!AH6","v":"INSS"},{"$f":"'Planilha 1'!AI6","v":1.7389999999999999E-2},{"$f":"'Planilha 1'!AJ6","v":1.7000000000000001E-2},{"$f":"'Planilha 1'!AK6","v":"Flex 2"},{"$f":"'Planilha 1'!AL6","v":"Tx1,739~1,70 (+90d Car) Flex2-RfnP"},null,null,null,{"$f":"'Planilha 1'!AP6","v":"SIAPE"},{"$f":"'Planilha 1'!AQ6","v":1.7489999999999999E-2},{"$f":"'Planilha 1'!AR6","v":1.6999999999999998E-2},{"$f":"'Planilha 1'!AS6","v":"Flex 2"},{"$f":"'Planilha 1'!AT6","v":"SIAPE RfnPort Tx1.749 ~ 1.70 Flex 2 Web"}]
[null,null,null,null,null,null,null,"Data Saldo",{"$f":"'Simulador Port'!C7","v":"2026-05-26"},{"$f":"TODAY()","v":"2026-05-26"},{"$f":"'Simulador Port'!D7","v":0},null,null,null,null,null,null,null,null,null,null,null,3,"INSS",1.6990000000000002E-2,1.6500000000000001E-2,"Flex 3","Tx1,699~1,65 (+90d Car) Flex3-RfnP",{"$f":"(1+MIN(Y7,$V$2))^(1/30)","v":1.0005617338526143},12443.232351143488,98.050681340323393,{"$f":"AD7-AE7-$J$8","v":2345.1815939507451},14788.413945094233,{"$f":"'Planilha 1'!AH7","v":"INSS"},{"$f":"'Planilha 1'!AI7","v":1.6990000000000002E-2},{"$f":"'Planilha 1'!AJ7","v":1.6500000000000001E-2},{"$f":"'Planilha 1'!AK7","v":"Flex 3"},{"$f":"'Planilha 1'!AL7","v":"Tx1,699~1,65 (+90d Car) Flex3-RfnP"},null,null,null,{"$f":"'Planilha 1'!AP7","v":"SIAPE"},{"$f":"'Planilha 1'!AQ7","v":1.6990000000000002E-2},{"$f":"'Planilha 1'!AR7","v":1.6500000000000001E-2},{"$f":"'Planilha 1'!AS7","v":"Flex 3"},{"$f":"'Planilha 1'!AT7","v":"SIAPE RfnPort Tx1.699 ~ 1.65 Flex 3 Web"}]
[null,null,null,null,null,null,null,"Saldo Portado",{"$f":"'Simulador Port'!C8","v":10000},{"$f":"SUM(VL_PARC!J35:J143)","v":10000.00007585242},{"$f":"T8","v":""},1,{"$f":"IFERROR(VLOOKUP(L8,$W$4:$AF$15,6,0),\"\")","v":"Tx1,779~1,74 (+90d Car) Flex1-RfnP"},null,{"$f":"IFERROR(VLOOKUP(L8,$W$4:$AF$15,8,0),\"\")","v":12125.074221916626},{"$f":"IFERROR(VLOOKUP(L8,$W$4:$AF$15,10,0),\"\")","v":2032.7546142523988},null,{"$f":"O8-$I$8","v":2125.0742219166259},null,{"$f":"IF(OR((J17-I17)/I17>2%,(J17-I17)/I17<-2%),\"Saldo e Parcela não correspondem à taxa informada\",\"\")","v":""},"TAXA TROCO",null,0,"INSS",1.6490000000000001E-2,1.6E-2,"Flex 4","Tx1,649~1,60 (+90d Car) Flex4-RfnP",{"$f":"(1+MIN(Y8,$V$2))^(1/30)","v":1.0005453325183937},{"$f":"OFFSET($U$32,,ROW()-ROW($AD$4))","v":12709.097215721285},102.89314393191702,{"$f":"AD8-AE8-$J$8","v":2606.2039959369486},15315.301211658234,{"$f":"'Planilha 1'!AH8","v":"INSS"},{"$f":"'Planilha 1'!AI8","v":1.6490000000000001E-2},{"$f":"'Planilha 1'!AJ8","v":1.6E-2},{"$f":"'Planilha 1'!AK8","v":"Flex 4"},{"$f":"'Planilha 1'!AL8","v":"Tx1,649~1,60 (+90d Car) Flex4-RfnP"}]
[null,null,null,null,null,null,null,"Valor Parcela",{"$f":"'Simulador Port'!E22","v":270},{"$f":"I9","v":270},{"$f":"'Simulador Port'!D9","v":0},{"$f":"L8+1","v":2},{"$f":"IFERROR(VLOOKUP(L9,$W$4:$AF$15,6,0),\"\")","v":"Tx1,739~1,70 (+90d Car) Flex2-RfnP"},null,{"$f":"IFERROR(VLOOKUP(L9,$W$4:$AF$15,8,0),\"\")","v":12236.454167510979},{"$f":"IFERROR(VLOOKUP(L9,$W$4:$AF$15,10,0),\"\")","v":2142.136265965466},null,{"$f":"O9-$I$8","v":2236.4541675109795},null,null,null,null,0,"INSS",1.5990000000000001E-2,1.55E-2,"Flex 5","Tx1,599~1,55 (+90d Car) Flex5-RfnP",1.0005289233836074,12983.474045695073,107.9398742041439,2875.5340956385098,15859.008141333583,{"$f":"'Planilha 1'!AH9","v":"INSS"},{"$f":"'Planilha 1'!AI9","v":1.5990000000000001E-2},{"$f":"'Planilha 1'!AJ9","v":1.55E-2},{"$f":"'Planilha 1'!AK9","v":"Flex 5"},{"$f":"'Planilha 1'!AL9","v":"Tx1,599~1,55 (+90d Car) Flex5-RfnP"}]
[null,null,null,null,null,null,null,"Nº de Parcelas Restantes",{"$f":"'Simulador Port'!C10","v":60},{"$f":"I10","v":60},{"$f":"T10","v":""},{"$f":"L9+1","v":3},"Tx1,699~1,65 (+90d Car) Flex3-RfnP",null,12443.232351143488,2345.1815939507451,null,2443.2323511434879,null,{"$f":"IF(P3-J10<12,\"Contrato com menos de 12 parcelas pagas\",\"\")","v":""},null,null,0,0,0,0,0,0,1,{"$error":"#N/A"},{"$error":"#N/A"},{"$error":"#N/A"},{"$error":"#N/A"},{"$f":"'Planilha 1'!AH10","v":0},{"$f":"'Planilha 1'!AI10","v":0},{"$f":"'Planilha 1'!AJ10","v":0},{"$f":"'Planilha 1'!AK10","v":0},{"$f":"'Planilha 1'!AL10","v":0}]
[null,null,null,null,null,null,null,null,null,null,null,4,"",null,"","",null,{"$error":"#VALUE!"},null,null,null,null,0,0,0,0,0,0,1,{"$error":"#N/A"},{"$error":"#N/A"},{"$error":"#N/A"},{"$error":"#N/A"},{"$f":"'Planilha 1'!AH11","v":0},{"$f":"'Planilha 1'!AI11","v":0},{"$f":"'Planilha 1'!AJ11","v":0},{"$f":"'Planilha 1'!AK11","v":0},{"$f":"'Planilha 1'!AL11","v":0}]
[null,null,null,null,null,null,null,null,null,null,null,5,"",null,"","",null,{"$error":"#VALUE!"},null,null,null,null,0,0,0,0,0,0,1,{"$error":"#N/A"},{"$error":"#N/A"},{"$error":"#N/A"},{"$error":"#N/A"},{"$f":"'Planilha 1'!AH12","v":0},{"$f":"'Planilha 1'!AI12","v":0},{"$f":"'Planilha 1'!AJ12","v":0},{"$f":"'Planilha 1'!AK12","v":0},{"$f":"'Planilha 1'!AL12","v":0},null,null,null,null,null,null,null,null,null,null,";"]
[null,null,null,null,null,null,null,null,null,null,null,6,"",null,"","",null,{"$error":"#VALUE!"},null,null,null,null,0,0,0,0,0,0,1,{"$error":"#N/A"},{"$error":"#N/A"},{"$error":"#N/A"},{"$error":"#N/A"},{"$f":"'Planilha 1'!AH13","v":0},{"$f":"'Planilha 1'!AI13","v":0},{"$f":"'Planilha 1'!AJ13","v":0},{"$f":"'Planilha 1'!AK13","v":0},{"$f":"'Planilha 1'!AL13","v":0}]
[null,null,null,null,null,null,null,null,null,null,null,7,"",null,"","",null,{"$error":"#VALUE!"},null,null,null,null,0,0,0,0,0,0,1,{"$error":"#N/A"},{"$error":"#N/A"},{"$error":"#N/A"},{"$error":"#N/A"},{"$f":"'Planilha 1'!AH14","v":0},{"$f":"'Planilha 1'!AI14","v":0},{"$f":"'Planilha 1'!AJ14","v":0},{"$f":"'Planilha 1'!AK14","v":0},{"$f":"'Planilha 1'!AL14","v":0},null,null,null,null,null,null,null,null,null,null,null,null,null,null,null,null,null,null,null,null,null,null,null,null,null,null,null,null,null,null,null,null,null,null,null,null,null,"Maior Parcela"]
[null,null,null,null,null,null,null,null,null,null,null,8,"",null,"","",null,{"$error":"#VALUE!"},null,null,null,null,0,0,0,0,0,0,1,{"$error":"#N/A"},{"$error":"#N/A"},{"$error":"#N/A"},{"$error":"#N/A"},{"$f":"'Planilha 1'!AH15","v":0},{"$f":"'Planilha 1'!AI15","v":0},{"$f":"'Planilha 1'!AJ15","v":0},{"$f":"'Planilha 1'!AK15","v":0},{"$f":"'Planilha 1'!AL15","v":0},null,null,null,null,null,null,null,null,null,null,null,null,null,null,null,null,null,null,null,null,null,null,null,null,null,null,null,null,null,null,null,null,null,null,null,null,null,"Pzo",{"$f":"I10","v":60}]
[null,null,null,null,null,null,null,null,null,{"$f":"J17","v":1.6897391149092833E-2},null,9,"",null,"","",null,{"$error":"#VALUE!"},null,null,null,null,null,null,null,null,null,null,null,null,null,null,null,null,null,null,null,null,null,null,null,null,null,null,null,null,null,null,null,null,null,null,null,null,null,null,null,null,null,null,null,null,null,null,null,null,null,null,null,null,null,null,null,null,null,"Parcela",{"$f":"BS36","v":270}]
[null,null,null,null,null,null,null,"Taxa de Juros",{"$f":"J17","v":1.6897391149092833E-2},{"$f":"(1+XIRR($I$35:$I$143,$M$35:$M$143))^(360/365)^(30/360)-1","v":1.6897391149092833E-2},{"$f":"T17","v":""},10,"",null,"","",null,{"$error":"#VALUE!"},null,{"$f":"IF(J17<VL_PARC!Y1,\"Taxa original inferior a mínima\",\"\")","v":""}]
[null,null,null,null,null,null,null,"Saldo Calculado pela Taxa",{"$f":"SUM(K36:K143)","v":10000.00007585242},{"$f":"SUM(J36:J143)","v":10000.00007585242},{"$f":"'Simulador Port'!F20","v":0},11,"",null,"","",null,null,null,null,null,null,null,null,null,null,null,null,null,null,null,null,null,null,null,null,null,null,null,null,null,null,null,null,null,null,null,null,null,null,null,null,null,null,null,null,null,null,null,null,null,null,null,null,null,null,null,null,null,null,null,null,null,null,null,"Maior Prazo"]
[null,null,null,null,null,null,null,null,null,null,null,12,"",null,"","",null,null,null,null,null,null,null,null,null,null,null,null,null,null,null,null,null,null,null,null,null,null,null,null,null,null,null,null,null,null,null,null,null,null,null,null,null,null,null,null,null,null,null,null,null,null,null,null,null,null,null,null,null,null,null,null,null,null,null,null,null,1,null,"Maior Prazo",{"$f":"MAX(BX29:EW29)-1","v":5}]
[]
[]
[null,null,null,null,null,null,null,"Taxa AP considerando base 365",{"$f":"J16","v":1.6897391149092833E-2}]
[null,null,null,null,null,null,null,"Taxa CET da PORT",{"$f":"J17","v":1.6897391149092833E-2},null,null,null,null,null,null,null,null,null,null,null,null,null,null,null,null,null,null,null,null,null,null,null,null,null,null,null,null,null,null,null,null,null,null,null,null,null,null,null,null,null,null,null,null,null,null,null,null,null,null,null,null,null,null,null,null,null,null,null,null,null,null,null,null,"Teto Conv",{"$f":"Z1","v":1.8499999999999999E-2}]
[null,null,null,null,null,null,null,null,null,null,null,null,null,null,null,null,null,null,null,null,null,null,null,null,null,null,null,null,null,null,null,null,null,null,null,null,null,null,null,null,null,null,null,null,null,null,null,null,null,null,null,null,null,null,null,null,null,null,null,null,null,null,null,null,null,null,null,null,null,null,null,null,null,"Pzo Conv",{"$f":"Z2","v":108},{"$f":"SUM(BX25:EW25)","v":4.5017499054881335E-3}]
[null,null,null,null,null,null,null,null,null,null,";",null,null,null,null,null,null,null,null,null,null,null,null,null,null,null,null,null,null,null,null,null,null,null,null,null,null,null,null,null,null,null,null,null,null,null,null,null,null,null,null,null,null,null,null,null,null,null,null,null,null,null,null,null,null,null,null,null,null,null,null,null,null,null,null,{"$f":"PRODUCT(BX26:BX28)","v":0},{"$f":"PRODUCT(BY26:BY28)","v":0},0,0,0,0,0,0,0,0,0,0,0,0,0,0,0,0,0,0,0,0,0,0,0,0,0,0,0,0,0,0,0,0,0,0,1.6447791799625976E-3,1.2899227901528986E-3,9.1820056709475233E-4,5.2860565599772806E-4,1.2024171228015683E-4,0,0,0,0,0,0,0,0,0,0,0,0,0,0,0,0,0,0,0,0,0,0,0,0,{"$f":"PRODUCT(EK26:EK28)","v":0},0,0,0,0,0,0,0,0,0,0,0,0]
[null,null,null,null,null,null,null,null,null,null,null,null,null,null,null,null,null,null,null,null,null,null,null,null,null,null,null,null,null,null,null,null,null,null,null,null,null,null,null,null,null,null,null,null,null,null,null,null,null,null,null,null,null,null,null,null,null,null,null,null,null,"SEM MUDA PRAZO","SOMAR 1 PARCELA","SOMAR 2 PARCELAS","TIRAR 1 PARCELA","TIRAR 2 PARCELAS",null,null,null,null,null,null,null,"Tx Alvo","Teto Pond",{"$f":"IF(((BX32*BX31)+($BW$23*($BW$24-BX31)))/$BW$24<$BW$23,1,0)","v":0},{"$f":"IF(((BY32*BY31)+($BW$23*($BW$24-BY31)))/$BW$24<$BW$23,1,0)","v":0},0,0,0,0,0,0,0,0,0,0,0,0,0,0,0,0,0,0,0,0,0,0,1,1,1,1,1,1,1,1,1,1,1,1,1,1,1,1,1,1,1,1,1,1,1,1,1,1,1,1,1,1,1,1,1,1,1,1,1,1,1,1,1,{"$f":"IF(((EK32*EK31)+($BW$23*($BW$24-EK31)))/$BW$24<$BW$23,1,0)","v":1},1,1,1,1,1,1,1,1,1,1,1,1]
[null,null,null,null,null,null,null,null,null,null,null,null,null,null,null,null,null,null,null,null,null,null,null,null,null,null,null,null,null,null,null,null,null,null,null,null,null,null,null,null,null,null,null,null,null,{"$f":"XIRR(AU$35:AU$143,$H$35:$H$143)","v":6.1476138234138486E-2},{"$f":"XIRR(AV$35:AV$143,$H$35:$H$143)","v":6.1476138234138486E-2},6.0273954272270197E-2,5.8066871762275707E-2,5.5275341868400565E-2,5.2447351813316362E-2,{"$error":"#N/A"},{"$error":"#N/A"},{"$error":"#N/A"},{"$error":"#N/A"},{"$error":"#N/A"},{"$error":"#N/A"},null,null,null,null,{"$f":"IF(K17<>\"\",\"Taxa original inferior a mínima\",\"\")","v":""},{"$f":"IF(BK32<VL_PARC!$Y$1,\"Taxa original inferior a mínima\",\"\")","v":""},{"$f":"IF(BL32<VL_PARC!$Y$1,\"Taxa original inferior a mínima\",\"\")","v":""},{"$f":"IF(BM32<VL_PARC!$Y$1,\"Taxa original inferior a mínima\",\"\")","v":""},{"$f":"IF(BN32<VL_PARC!$Y$1,\"Taxa original inferior a mínima\",\"\")","v":""},null,null,null,null,null,null,null,null,"VAlid1",{"$f":"IF(BX31>$P$3-12,0,IF(BX31>$I$10,0,1))","v":0},{"$f":"IF(BY31>$P$3-12,0,IF(BY31>$I$10,0,1))","v":0},0,0,0,0,0,0,0,0,0,0,0,0,0,0,0,0,0,0,0,0,0,0,0,0,0,0,0,0,0,0,0,0,0,0,1,1,1,1,1,1,1,1,1,1,1,1,1,1,1,1,1,1,1,1,1,1,1,1,1,1,1,1,1,{"$f":"IF(EK31>$P$3-12,0,IF(EK31>$I$10,0,1))","v":1},1,1,1,1,1,1,1,1,1,1,1,1]
[null,null,null,null,null,null,null,null,null,null,null,null,null,null,null,null,null,null,null,null,null,null,null,null,null,null,null,null,null,null,null,null,null,{"$f":"U32-$J$8","v":2125.0741460642057},{"$f":"V32-$J$8","v":2125.0741460642057},2236.4540916585593,2443.2322752910677,2709.0971398688653,2983.4739698426529,{"$error":"#N/A"},{"$error":"#N/A"},{"$error":"#N/A"},{"$error":"#N/A"},{"$error":"#N/A"},{"$error":"#N/A"},null,null,null,null,null,null,null,null,null,null,null,null,null,null,null,null,null,null,null,null,null,null,null,null,null,null,null,null,"Tx Alvo",{"$f":"Y1","v":1.35E-2},{"$f":"MAX((BX32-$BW$28)*BX27*BX26,0)","v":0},0,0,0,0,0,0,0,0,0,0,0,0,0,0,0,0,0,0,0,0,0,0,0,{"$f":"MAX((CV32-$BW$28)*CV27*CV26,0)","v":0},{"$f":"MAX((CW32-$BW$28)*CW27*CW26,0)","v":0},0,0,0,0,0,0,0,0,0,0,1.6447791799625976E-3,1.2899227901528986E-3,9.1820056709475233E-4,5.2860565599772806E-4,1.2024171228015683E-4,0,0,0,0,0,0,0,0,0,0,0,0,0,0,0,0,0,0,0,0,0,0,0,0,0,0,0,0,0,0,0,0,0,0,0,0,0]
[null,null,null,null,null,null,null,null,null,null,null,null,null,null,null,null,null,null,null,"Taxa REFIN",{"$f":"VLOOKUP(U34,$AA$4:$AC$15,3,0)","v":1.0005820495985809},{"$f":"VLOOKUP(V34,$AA$4:$AC$15,3,0)","v":1.0005820495985809},{"$f":"VLOOKUP(W34,$AA$4:$AC$15,3,0)","v":1.0005748493086513},{"$f":"VLOOKUP(X34,$AA$4:$AC$15,3,0)","v":1.0005617338526143},1.0005453325183937,1.0005289233836074,{"$error":"#N/A"},{"$error":"#N/A"},{"$error":"#N/A"},{"$error":"#N/A"},{"$error":"#N/A"},{"$error":"#N/A"},null,{"$f":"SUM(AH35:AH143)","v":92.319531811806996},{"$f":"SUM(AI35:AI143)","v":92.319531811806996},94.317825693092928,98.050681340323393,102.89314393191702,107.9398742041439,{"$error":"#N/A"},{"$error":"#N/A"},{"$error":"#N/A"},{"$error":"#N/A"},{"$error":"#N/A"},{"$error":"#N/A"},null,{"$f":"(1+AT27)^(30/365)-1","v":4.9156469434352701E-3},4.9156469434352701E-3,4.8220536960905669E-3,4.6499725681552473E-3,4.4318509451279908E-3,4.2103397725425928E-3,{"$error":"#N/A"},{"$error":"#N/A"},{"$error":"#N/A"},{"$error":"#N/A"},{"$error":"#N/A"},{"$error":"#N/A"},null,null,null,null,null,null,null,null,null,null,null,null,null,null,null,null,null,{"$f":"RANK(BX28,$BX$28:$EW$28,0)","v":6},6,6,6,6,6,6,6,6,6,6,6,6,6,6,6,6,6,6,6,6,6,6,6,6,6,6,6,6,6,6,6,6,6,6,6,1,2,3,4,5,6,6,6,6,6,6,6,6,6,6,6,6,6,6,6,6,6,6,6,6,6,6,6,6,{"$f":"RANK(EK28,$BX$28:$EW$28,0)","v":6},6,6,6,6,6,6,6,6,6,6,6,6]
[null,null,null,null,null,null,null,"dt ini fx pmt",{"$f":"EDATE(J31,-1)","v":"2026-09-07"},{"$f":"NETWORKDAYS(EOMONTH(I7,-1)+1,I7,$A$34:$A$1297)","v":17},null,null,null,null,null,null,null,null,null,null,null,null,null,null,null,null,null,null,null,null,null,null,null,null,null,null,null,null,null,null,null,null,null,null,null,null,null,null,null,null,null,null,null,null,null,null,null,null,null,null,null,"dt ini fx pmt",{"$f":"I30","v":"2026-09-07"}]
[null,null,null,null,null,null,null,"Prox Vencimento",null,{"$f":"'Planilha 1'!J31","v":"2026-10-07"},null,null,{"$f":"'Planilha 1'!M31","v":"2026-07-07"},null,null,null,null,null,null,null,{"$f":"U32-$I$8","v":2125.0742219166259},{"$f":"V32-$I$8","v":2125.0742219166259},2236.4541675109795,2443.2323511434879,2709.0972157212855,2983.4740456950731,{"$error":"#N/A"},{"$error":"#N/A"},{"$error":"#N/A"},{"$error":"#N/A"},{"$f":"AE32-$I$8","v":{"$error":"#N/A"}},{"$error":"#N/A"},null,null,null,null,null,null,null,null,null,null,null,null,null,null,null,null,null,null,null,null,null,null,null,null,null,null,null,null,null,"Prox Vencimento",null,{"$f":"J31","v":"2026-10-07"},null,null,null,null,null,{"$f":"(1+BR32)^((365/12)/30)-1","v":1.875933967020349E-2},null,null,null,null,"Pzo",{"$f":"COUNTIFS(BX36:BX131,\">\"&0)","v":96},{"$f":"COUNTIFS(BY36:BY131,\">\"&0)","v":95},{"$f":"COUNTIFS(BZ36:BZ131,\">\"&0)","v":94},93,92,91,90,89,88,87,86,85,84,83,82,81,80,79,78,77,76,75,74,73,72,71,70,69,68,67,66,65,64,63,62,61,60,59,58,57,56,55,54,53,52,51,50,49,48,47,46,45,44,43,42,41,40,39,38,37,36,35,34,33,32,31,{"$f":"COUNTIFS(EL36:EL131,\">\"&0)","v":30},29,28,27,26,25,24,23,22,21,20,19]
[null,null,null,null,null,null,null,"Fator Dia",{"$f":"(1+I17)^(1/30)","v":1.0005586966234388},{"$f":"(1+J17)^(1/30)","v":1.0005586966234388},null,null,null,null,null,null,null,null,null,"Vlr Troco",{"$f":"SUM(U36:U143)","v":12125.074221916626},{"$f":"SUM(V36:V143)","v":12125.074221916626},12236.454167510979,12443.232351143488,12709.097215721285,12983.474045695073,{"$error":"#N/A"},{"$error":"#N/A"},{"$error":"#N/A"},{"$error":"#N/A"},{"$error":"#N/A"},{"$error":"#N/A"},null,null,null,null,null,null,null,null,null,null,null,null,null,null,null,null,null,null,null,null,null,null,null,null,null,null,null,null,null,"XITR",{"$f":"(1+XIRR(BK$35:BK$143,$BJ$35:$BJ$143))^(30/360)-1","v":1.57006140892062E-2},{"$f":"(1+XIRR(BL$35:BL$143,$BJ$35:$BJ$143))^(30/360)-1","v":1.6029232818115968E-2},1.4996871089751673E-2,1.4619910158086391E-2,null,null,null,{"$f":"BW23","v":1.8499999999999999E-2},{"$f":"(1+XIRR(BS$35:BS$143,$BJ$35:$BJ$143))^(30/365)-1","v":1.5144779179962597E-2},null,null,null,"Tx",{"$f":"(1+XIRR(BX35:BX131,VL_PARC!$H$35:$H$131))^(30/365)-1","v":2.1639455764697058E-2},{"$f":"(1+XIRR(BY35:BY131,VL_PARC!$H$35:$H$131))^(30/365)-1","v":2.1552540905212414E-2},{"$f":"(1+XIRR(BZ35:BZ131,VL_PARC!$H$35:$H$131))^(30/365)-1","v":2.1462561378490452E-2},{"$f":"(1+XIRR(CA35:CA131,VL_PARC!$H$35:$H$131))^(30/365)-1","v":2.1369391371885316E-2},{"$f":"(1+XIRR(CB35:CB131,VL_PARC!$H$35:$H$131))^(30/365)-1","v":2.1272964666317007E-2},{"$f":"(1+XIRR(CC35:CC131,VL_PARC!$H$35:$H$131))^(30/365)-1","v":2.1173076415903713E-2},{"$f":"(1+XIRR(CD35:CD131,VL_PARC!$H$35:$H$131))^(30/365)-1","v":2.1069653265350485E-2},{"$f":"(1+XIRR(CE35:CE131,VL_PARC!$H$35:$H$131))^(30/365)-1","v":2.0962470369896957E-2},{"$f":"(1+XIRR(CF35:CF131,VL_PARC!$H$35:$H$131))^(30/365)-1","v":2.0851597879017802E-2},{"$f":"(1+XIRR(CG35:CG131,VL_PARC!$H$35:$H$131))^(30/365)-1","v":2.0736643064651172E-2},{"$f":"(1+XIRR(CH35:CH131,VL_PARC!$H$35:$H$131))^(30/365)-1","v":2.0617428394948734E-2},{"$f":"(1+XIRR(CI35:CI131,VL_PARC!$H$35:$H$131))^(30/365)-1","v":2.0493848298499096E-2},{"$f":"(1+XIRR(CJ35:CJ131,VL_PARC!$H$35:$H$131))^(30/365)-1","v":2.0365625518101726E-2},{"$f":"(1+XIRR(CK35:CK131,VL_PARC!$H$35:$H$131))^(30/365)-1","v":2.0232640420836612E-2},{"$f":"(1+XIRR(CL35:CL131,VL_PARC!$H$35:$H$131))^(30/365)-1","v":2.0094586826277849E-2},{"$f":"(1+XIRR(CM35:CM131,VL_PARC!$H$35:$H$131))^(30/365)-1","v":1.995123295812129E-2},{"$f":"(1+XIRR(CN35:CN131,VL_PARC!$H$35:$H$131))^(30/365)-1","v":1.9802432907942924E-2},{"$f":"(1+XIRR(CO35:CO131,VL_PARC!$H$35:$H$131))^(30/365)-1","v":1.964783393063696E-2},{"$f":"(1+XIRR(CP35:CP131,VL_PARC!$H$35:$H$131))^(30/365)-1","v":1.948726631041664E-2},{"$f":"(1+XIRR(CQ35:CQ131,VL_PARC!$H$35:$H$131))^(30/365)-1","v":1.9320343638431492E-2},{"$f":"(1+XIRR(CR35:CR131,VL_PARC!$H$35:$H$131))^(30/365)-1","v":1.9147092511773156E-2},{"$f":"(1+XIRR(CS35:CS131,VL_PARC!$H$35:$H$131))^(30/365)-1","v":1.8966871264327612E-2},{"$f":"(1+XIRR(CT35:CT131,VL_PARC!$H$35:$H$131))^(30/365)-1","v":1.8779339825460095E-2},{"$f":"(1+XIRR(CU35:CU131,VL_PARC!$H$35:$H$131))^(30/365)-1","v":1.8584257469549392E-2},{"$f":"(1+XIRR(CV35:CV131,VL_PARC!$H$35:$H$131))^(30/365)-1","v":1.8381124707592456E-2},{"$f":"(1+XIRR(CW35:CW131,VL_PARC!$H$35:$H$131))^(30/365)-1","v":1.8169662513100482E-2},{"$f":"(1+XIRR(CX35:CX131,VL_PARC!$H$35:$H$131))^(30/365)-1","v":1.7949318155577876E-2},{"$f":"(1+XIRR(CY35:CY131,VL_PARC!$H$35:$H$131))^(30/365)-1","v":1.7719631160948213E-2},{"$f":"(1+XIRR(CZ35:CZ131,VL_PARC!$H$35:$H$131))^(30/365)-1","v":1.7480255019325153E-2},{"$f":"(1+XIRR(DA35:DA131,VL_PARC!$H$35:$H$131))^(30/365)-1","v":1.7230537312988847E-2},{"$f":"(1+XIRR(DB35:DB131,VL_PARC!$H$35:$H$131))^(30/365)-1","v":1.6970072831798522E-2},{"$f":"(1+XIRR(DC35:DC131,VL_PARC!$H$35:$H$131))^(30/365)-1","v":1.6698130824759128E-2},{"$f":"(1+XIRR(DD35:DD131,VL_PARC!$H$35:$H$131))^(30/365)-1","v":1.6414396994524294E-2},{"$f":"(1+XIRR(DE35:DE131,VL_PARC!$H$35:$H$131))^(30/365)-1","v":1.611790169706806E-2},{"$f":"(1+XIRR(DF35:DF131,VL_PARC!$H$35:$H$131))^(30/365)-1","v":1.5807927882070194E-2},{"$f":"(1+XIRR(DG35:DG131,VL_PARC!$H$35:$H$131))^(30/365)-1","v":1.54838806587414E-2},{"$f":"(1+XIRR(DH35:DH131,VL_PARC!$H$35:$H$131))^(30/365)-1","v":1.5144779179962597E-2},{"$f":"(1+XIRR(DI35:DI131,VL_PARC!$H$35:$H$131))^(30/365)-1","v":1.4789922790152898E-2},{"$f":"(1+XIRR(DJ35:DJ131,VL_PARC!$H$35:$H$131))^(30/365)-1","v":1.4418200567094752E-2},{"$f":"(1+XIRR(DK35:DK131,VL_PARC!$H$35:$H$131))^(30/365)-1","v":1.4028605655997728E-2},{"$f":"(1+XIRR(DL35:DL131,VL_PARC!$H$35:$H$131))^(30/365)-1","v":1.3620241712280157E-2},{"$f":"(1+XIRR(DM35:DM131,VL_PARC!$H$35:$H$131))^(30/365)-1","v":1.3191760973156219E-2},{"$f":"(1+XIRR(DN35:DN131,VL_PARC!$H$35:$H$131))^(30/365)-1","v":1.2742103482776601E-2},{"$f":"(1+XIRR(DO35:DO131,VL_PARC!$H$35:$H$131))^(30/365)-1","v":1.2269728226032672E-2},{"$f":"(1+XIRR(DP35:DP131,VL_PARC!$H$35:$H$131))^(30/365)-1","v":1.1773768923732497E-2},{"$f":"(1+XIRR(DQ35:DQ131,VL_PARC!$H$35:$H$131))^(30/365)-1","v":1.1252060554749255E-2},{"$f":"(1+XIRR(DR35:DR131,VL_PARC!$H$35:$H$131))^(30/365)-1","v":1.0702897407647738E-2},{"$f":"(1+XIRR(DS35:DS131,VL_PARC!$H$35:$H$131))^(30/365)-1","v":1.0124629309634869E-2},{"$f":"(1+XIRR(DT35:DT131,VL_PARC!$H$35:$H$131))^(30/365)-1","v":9.5150493842630635E-3},{"$f":"(1+XIRR(DU35:DU131,VL_PARC!$H$35:$H$131))^(30/365)-1","v":8.8721761882055716E-3},{"$f":"(1+XIRR(DV35:DV131,VL_PARC!$H$35:$H$131))^(30/365)-1","v":8.1934385662723042E-3},{"$f":"(1+XIRR(DW35:DW131,VL_PARC!$H$35:$H$131))^(30/365)-1","v":7.4762585853980212E-3},{"$f":"(1+XIRR(DX35:DX131,VL_PARC!$H$35:$H$131))^(30/365)-1","v":6.7179987487562265E-3},{"$f":"(1+XIRR(DY35:DY131,VL_PARC!$H$35:$H$131))^(30/365)-1","v":5.9153942266683135E-3},{"$f":"(1+XIRR(DZ35:DZ131,VL_PARC!$H$35:$H$131))^(30/365)-1","v":5.0652324977829011E-3},{"$f":"(1+XIRR(EA35:EA131,VL_PARC!$H$35:$H$131))^(30/365)-1","v":4.1636511562028744E-3},{"$f":"(1+XIRR(EB35:EB131,VL_PARC!$H$35:$H$131))^(30/365)-1","v":3.2069211584837554E-3},{"$f":"(1+XIRR(EC35:EC131,VL_PARC!$H$35:$H$131))^(30/365)-1","v":2.1901143183928884E-3},{"$f":"(1+XIRR(ED35:ED131,VL_PARC!$H$35:$H$131))^(30/365)-1","v":1.108289725388234E-3},{"$f":"(1+XIRR(EE35:EE131,VL_PARC!$H$35:$H$131))^(30/365)-1","v":-4.4004181582679713E-5},{"$f":"(1+XIRR(EF35:EF131,VL_PARC!$H$35:$H$131))^(30/365)-1","v":-1.2728950584002252E-3},{"$f":"(1+XIRR(EG35:EG131,VL_PARC!$H$35:$H$131))^(30/365)-1","v":-2.5852014041162219E-3},{"$f":"(1+XIRR(EH35:EH131,VL_PARC!$H$35:$H$131))^(30/365)-1","v":-3.9883976448875647E-3},{"$f":"(1+XIRR(EI35:EI131,VL_PARC!$H$35:$H$131))^(30/365)-1","v":-5.4908024315601933E-3},{"$f":"(1+XIRR(EJ35:EJ131,VL_PARC!$H$35:$H$131))^(30/365)-1","v":-7.1020871419477105E-3},{"$f":"(1+XIRR(EK35:EK131,VL_PARC!$H$35:$H$131))^(30/365)-1","v":-8.832484347156111E-3},{"$f":"(1+XIRR(EL35:EL131,VL_PARC!$H$35:$H$131))^(30/365)-1","v":-1.069436712828109E-2},{"$f":"(1+XIRR(EM35:EM131,VL_PARC!$H$35:$H$131))^(30/365)-1","v":-1.2700550375850383E-2},{"$f":"(1+XIRR(EN35:EN131,VL_PARC!$H$35:$H$131))^(30/365)-1","v":-1.4869303996144168E-2},{"$f":"(1+XIRR(EO35:EO131,VL_PARC!$H$35:$H$131))^(30/365)-1","v":-1.721582137916966E-2},{"$f":"(1+XIRR(EP35:EP131,VL_PARC!$H$35:$H$131))^(30/365)-1","v":-1.9759712432263932E-2},{"$f":"(1+XIRR(EQ35:EQ131,VL_PARC!$H$35:$H$131))^(30/365)-1","v":-2.2525533943206999E-2},{"$f":"(1+XIRR(ER35:ER131,VL_PARC!$H$35:$H$131))^(30/365)-1","v":-2.5537725500724973E-2},{"$f":"(1+XIRR(ES35:ES131,VL_PARC!$H$35:$H$131))^(30/365)-1","v":-2.8829352855156531E-2},{"$f":"(1+XIRR(ET35:ET131,VL_PARC!$H$35:$H$131))^(30/365)-1","v":-3.2432915058612011E-2},{"$f":"(1+XIRR(EU35:EU131,VL_PARC!$H$35:$H$131))^(30/365)-1","v":-3.6388547433218288E-2},{"$f":"(1+XIRR(EV35:EV131,VL_PARC!$H$35:$H$131))^(30/365)-1","v":-4.074932933168296E-2},{"$f":"(1+XIRR(EW35:EW131,VL_PARC!$H$35:$H$131))^(30/365)-1","v":-4.5566534203971831E-2}]
["Data","Dia da Semana","Feriado",null,null,null,null,"OPERAÇÃO ORIGINAL",null,null,null,null,null,null,null,null,null,null,null,"REFINANCIAMENTO",null,null,null,null,null,null,null,null,null,null,null,null,null,"IOF",null,null,null,null,null,null,null,null,null,null,null,null,"REFINANCIAMENTO",null,null,null,null,null,null,null,null,null,null,null,null,null,null,"OPERAÇÃO ORIGINAL",null,null,null,null,null,null,null,{"$f":"(1+BR32)^(1/30)","v":1.000611218607504},{"$f":"(1+XIRR(BR$35:BR$143,$BP$35:$BP$143))^(30/365)-1","v":1.8496216817239564E-2},null,null,null,null,96,{"$f":"BX33-1","v":95},{"$f":"BY33-1","v":94},93,92,91,90,89,88,87,86,85,84,83,82,81,80,79,78,77,76,75,74,73,72,71,70,69,68,67,66,65,64,63,62,61,60,59,58,57,56,55,54,53,52,51,50,49,48,47,46,45,44,43,42,41,40,39,38,37,36,35,34,33,32,31,{"$f":"EK33-1","v":30},29,28,27,26,25,24,23,22,21,20,19]
["2001-01-01","segunda-feira","Confraternização Universal",null,null,null,null,"DATA EV","FLUXO","Principal","Principal2","IOF","Data Sld",null,null,null,null,null,null,"FX Refin","Normal","Flex 1","Flex 2","Flex 3","Flex 4","Flex 5","Flex 6","Flex 7","Flex 8","Flex 9","Flex 10","Flex 11",null,"Normal","Flex 1","Flex 2","Flex 3","Flex 4","Flex 5","Flex 6","Flex 7","Flex 8","Flex 9","Flex 10","Flex 11",null,"Normal","Flex 1","Flex 2","Flex 3","Flex 4","Flex 5","Flex 6","Flex 7","Flex 8","Flex 9","Flex 10","Flex 11",null,null,null,"DATA EV","FLUXO1","FLUXO2","FLUXO3","FLUXO4",null,null,null,"FLUX06",null,null,null,null,null,"FLUXO","FLUXO","FLUXO","FLUXO","FLUXO","FLUXO","FLUXO","FLUXO","FLUXO","FLUXO","FLUXO","FLUXO","FLUXO","FLUXO","FLUXO","FLUXO","FLUXO","FLUXO","FLUXO","FLUXO","FLUXO","FLUXO","FLUXO","FLUXO","FLUXO","FLUXO","FLUXO","FLUXO","FLUXO","FLUXO","FLUXO","FLUXO","FLUXO","FLUXO","FLUXO","FLUXO","FLUXO","FLUXO","FLUXO","FLUXO","FLUXO","FLUXO","FLUXO","FLUXO","FLUXO","FLUXO","FLUXO","FLUXO","FLUXO","FLUXO","FLUXO","FLUXO","FLUXO","FLUXO","FLUXO","FLUXO","FLUXO","FLUXO","FLUXO","FLUXO","FLUXO","FLUXO","FLUXO","FLUXO","FLUXO","FLUXO","FLUXO","FLUXO","FLUXO","FLUXO","FLUXO","FLUXO","FLUXO","FLUXO","FLUXO","FLUXO","FLUXO","FLUXO"]
["2001-02-26","segunda-feira","Carnaval",null,null,null,0,{"$f":"I7","v":"2026-05-26"},{"$f":"-I8","v":-10000},null,null,{"$f":"I35*-0.38%","v":38},{"$f":"I7","v":"2026-05-26"},null,null,null,null,null,null,{"$f":"I35","v":-10000},null,null,null,null,null,null,null,null,null,null,null,null,null,{"$f":"(U31)*$B$2","v":8.0752820432831776},{"$f":"(V31)*$B$2","v":8.0752820432831776},8.498525836541722,9.2842829343452546,10.294569419740885,11.337201373641278,{"$error":"#N/A"},{"$error":"#N/A"},{"$error":"#N/A"},{"$error":"#N/A"},{"$error":"#N/A"},{"$error":"#N/A"},null,{"$f":"-U32+$I$35","v":-22125.074221916628},{"$f":"-V32+$I$35","v":-22125.074221916628},-22236.454167510979,-22443.232351143488,-22709.097215721285,-22983.474045695075,{"$error":"#N/A"},{"$error":"#N/A"},{"$error":"#N/A"},{"$error":"#N/A"},{"$error":"#N/A"},{"$error":"#N/A"},null,null,0,{"$f":"H35","v":"2026-05-26"},{"$f":"I35","v":-10000},{"$f":"BK35","v":-10000},{"$f":"BL35","v":-10000},{"$f":"BM35","v":-10000},null,{"$f":"EDATE(BJ36,-1)","v":"2026-09-07"},{"$f":"-BJ35+BP35","v":104},{"$f":"-((-BN35)*BR33^BQ35)","v":-10656.099055472079},{"$f":"BN35","v":-10000},null,null,null,null,{"$f":"BN35","v":-10000},{"$f":"BX35","v":-10000},{"$f":"BY35","v":-10000},-10000,-10000,-10000,-10000,-10000,-10000,-10000,-10000,-10000,-10000,-10000,-10000,-10000,-10000,-10000,-10000,-10000,-10000,-10000,-10000,-10000,-10000,-10000,-10000,-10000,-10000,-10000,-10000,-10000,-10000,-10000,-10000,-10000,-10000,-10000,-10000,-10000,-10000,-10000,-10000,-10000,-10000,-10000,-10000,-10000,-10000,-10000,-10000,-10000,-10000,-10000,-10000,-10000,-10000,-10000,-10000,-10000,-10000,-10000,-10000,-10000,-10000,-10000,{"$f":"EK35","v":-10000},-10000,-10000,-10000,-10000,-10000,-10000,-10000,-10000,-10000,-10000,-10000]
["2001-02-27","terça-feira","Carnaval",null,null,{"$f":"H36-$H$35","v":134},1,{"$f":"J31","v":"2026-10-07"},{"$f":"IF($G36>$I$10,0,$I$9)","v":270},{"$f":"I36/($J$32^(M36-$M$35))","v":263.73986390338524},{"$f":"I36/($I$32^(M36-$M$35))","v":263.73986390338524},{"$f":"J36*0.0082%*MIN(F36,365)","v":2.8979736245703971},{"$f":"M31","v":"2026-07-07"},null,null,null,null,null,1,{"$f":"IF($G36>$P$3,0,$J$9)","v":270},{"$f":"$T36/((U$29)^($H36-$H$35))","v":249.74739882540274},{"$f":"$T36/((V$29)^($H36-$H$35))","v":249.74739882540274},249.98834166218865,250.4278252722282,250.97851033191017,251.53067817216245,{"$error":"#N/A"},{"$error":"#N/A"},{"$error":"#N/A"},{"$error":"#N/A"},{"$f":"IF($I36<>0,$J36,$T36/((AE$29)^($H36-$H$35)))","v":263.73986390338524},263.73986390338524,null,{"$f":"IF($I36<>0,0,U36*$B$1*MIN($F36,365))","v":0},{"$f":"IF($I36<>0,0,V36*$B$1*MIN($F36,365))","v":0},0,0,0,0,0,0,0,0,0,0,null,{"$f":"$T36","v":270},270,270,270,270,270,270,270,270,270,270,270,null,{"$f":"BJ36-$H$35","v":134},1,{"$f":"BL31","v":"2026-10-07"},{"$f":"I36","v":270},{"$f":"BK36","v":270},{"$f":"I37","v":270},{"$f":"BM37","v":270},null,{"$f":"BJ36","v":"2026-10-07"},null,{"$f":"IF(I36=0,0,PMT($BR$31,$I$10,$BR$35))","v":297.41546844866377},{"$f":"MIN(BR36,$I$9)","v":270},null,null,null,null,{"$f":"IF($G36>BX$33,0,$I$9)","v":270},270,270,270,270,270,270,270,270,270,270,270,270,270,270,270,{"$f":"IF($G36>CN$33,0,$I$9)","v":270},270,270,270,270,270,270,270,270,270,270,270,270,270,270,270,{"$f":"IF($G36>DD$33,0,$I$9)","v":270},270,270,270,270,270,270,270,270,270,270,270,270,270,270,270,{"$f":"IF($G36>DT$33,0,$I$9)","v":270},270,270,270,270,270,270,270,270,270,270,270,270,270,270,270,270,270,270,270,270,270,270,270,270,270,270,270,270,270]
["2001-04-13","sexta-feira","Paixão de Cristo",null,null,{"$f":"H37-$H$35","v":165},{"$f":"G36+1","v":2},{"$f":"EDATE(H36,1)","v":"2026-11-07"},{"$f":"IF($G37>$I$10,0,$I$9)","v":270},{"$f":"I37/($J$32^(M37-$M$35))","v":259.21257926760569},{"$f":"I37/($I$32^(M37-$M$35))","v":259.21257926760569},{"$f":"J37*0.0082%*MIN(F37,365)","v":3.5071461974907052},{"$f":"EDATE(M36,1)","v":"2026-08-07"},null,null,null,null,null,{"$f":"S36+1","v":2},270,245.28277137589933,245.28277137589933,245.57418354655687,246.10589136766495,246.7724406398622,247.44112446558725,{"$error":"#N/A"},{"$error":"#N/A"},{"$error":"#N/A"},{"$error":"#N/A"},259.21257926760569,{"$f":"IF($I37<>0,$J37,$T37/((AF$29)^($H37-$H$35)))","v":259.21257926760569},null,0,0,0,0,0,0,0,0,0,0,0,0,null,270,270,270,270,270,270,270,270,270,270,270,270,null,{"$f":"BJ37-$H$35","v":165},{"$f":"BI36+1","v":2},{"$f":"EDATE(BJ36,1)","v":"2026-11-07"},{"$f":"I36","v":270},{"$f":"BK36","v":270},{"$f":"I38","v":270},{"$f":"BM38","v":270},null,{"$f":"BJ37","v":"2026-11-07"},null,{"$f":"IF(I37=0,0,PMT($BR$31,$I$10,$BR$35))","v":297.41546844866377},{"$f":"MIN(BR37,$I$9)","v":270},null,null,null,null,270,270,270,270,270,270,270,270,270,270,270,270,270,270,270,270,270,270,270,270,270,270,270,270,270,270,270,270,270,270,270,270,270,270,270,270,270,270,270,270,270,270,270,270,270,270,270,270,270,270,270,270,270,270,270,270,270,270,270,270,270,270,270,270,270,270,270,270,270,270,270,270,270,270,270,270,270,270]
["2001-04-21","sábado","Tiradentes",null,null,195,{"$f":"G37+1","v":3},{"$f":"EDATE(H37,1)","v":"2026-12-07"},{"$f":"IF($G38>$I$10,0,$I$9)","v":270},254.76300873188674,254.76300873188674,4.0736605096228686,{"$f":"EDATE(M37,1)","v":"2026-09-07"},null,null,null,null,null,3,270,241.03817072078846,241.03817072078846,241.37664371239754,241.99440640288086,242.76917691257378,243.54681095836341,{"$error":"#N/A"},{"$error":"#N/A"},{"$error":"#N/A"},{"$error":"#N/A"},254.76300873188674,254.76300873188674,null,0,0,0,0,0,0,0,0,0,0,0,0,null,270,270,270,270,270,270,270,270,270,270,270,270,null,195,{"$f":"BI37+1","v":3},{"$f":"EDATE(BJ37,1)","v":"2026-12-07"},{"$f":"I37","v":270},{"$f":"BK37","v":270},270,270,null,"2026-12-07",null,297.41546844866377,270,null,null,null,null,270,270,270,270,270,270,270,270,270,270,270,270,270,270,270,270,270,270,270,270,270,270,270,270,270,270,270,270,270,270,270,270,270,270,270,270,270,270,270,270,270,270,270,270,270,270,270,270,270,270,270,270,270,270,270,270,270,270,270,270,270,270,270,270,270,270,270,270,270,270,270,270,270,270,270,270,270,270]
["2001-05-01","terça-feira","Dia do Trabalho",null,null,226,4,"2027-01-07",270,250.52971022376803,250.52971022376803,4.642816589866869,"2026-10-07",null,null,null,null,null,4,270,236.72923441779045,236.72923441779045,237.11454627344244,237.8180181416709,238.7006848499465,239.58706429558208,{"$error":"#N/A"},{"$error":"#N/A"},{"$error":"#N/A"},{"$error":"#N/A"},250.52971022376803,250.52971022376803,null,0,0,0,0,0,0,0,0,0,0,0,0,null,270,270,270,270,270,270,270,270,270,270,270,270,null,226,4,"2027-01-07",270,270,270,270,null,"2027-01-07",null,297.41546844866377,270,null,null,null,null,270,270,270,270,270,270,270,270,270,270,270,270,270,270,270,270,270,270,270,270,270,270,270,270,270,270,270,270,270,270,270,270,270,270,270,270,270,270,270,270,270,270,270,270,270,270,270,270,270,270,270,270,270,270,270,270,270,270,270,270,270,270,270,270,270,270,270,270,270,270,270,270,270,270,270,270,270,270]
["2001-06-14","quinta-feira","Corpus Christi",null,null,257,5,"2027-02-07",270,246.22918738616676,246.22918738616676,5.1890338949760784,"2026-11-07",null,null,null,null,null,5,270,232.49732712645377,232.49732712645377,232.92770663200977,233.71370683119568,234.70037536252974,235.6916978378699,{"$error":"#N/A"},{"$error":"#N/A"},{"$error":"#N/A"},{"$error":"#N/A"},246.22918738616676,246.22918738616676,null,0,0,0,0,0,0,0,0,0,0,0,0,null,270,270,270,270,270,270,270,270,270,270,270,270,null,257,5,"2027-02-07",270,270,270,270,null,"2027-02-07",null,297.41546844866377,270,null,null,null,null,270,270,270,270,270,270,270,270,270,270,270,270,270,270,270,270,270,270,270,270,270,270,270,270,270,270,270,270,270,270,270,270,270,270,270,270,270,270,270,270,270,270,270,270,270,270,270,270,270,270,270,270,270,270,270,270,270,270,270,270,270,270,270,270,270,270,270,270,270,270,270,270,270,270,270,270,270,270]
["2001-09-07","sexta-feira","Independência do Brasil",null,null,285,6,"2027-03-07",270,242.13769209096827,242.13769209096827,5.6587578641659286,"2026-12-07",null,null,null,null,null,6,270,228.74002143805473,228.74002143805473,229.20962488880218,230.06750349586903,231.1448461401778,232.22776747367982,{"$error":"#N/A"},{"$error":"#N/A"},{"$error":"#N/A"},{"$error":"#N/A"},242.13769209096827,242.13769209096827,null,0,0,0,0,0,0,0,0,0,0,0,0,null,270,270,270,270,270,270,270,270,270,270,270,270,null,285,6,"2027-03-07",270,270,270,270,null,"2027-03-07",null,297.41546844866377,270,null,null,null,null,270,270,270,270,270,270,270,270,270,270,270,270,270,270,270,270,270,270,270,270,270,270,270,270,270,270,270,270,270,270,270,270,270,270,270,270,270,270,270,270,270,270,270,270,270,270,270,270,270,270,270,270,270,270,270,270,270,270,270,270,270,270,270,270,270,270,270,270,270,270,270,270,270,270,270,270,270,270]
["2001-10-12","sexta-feira","Nossa Sr.a Aparecida - Padroeira do Brasil",null,null,316,7,"2027-04-07",270,237.98122428620692,237.98122428620692,6.166569483704194,"2027-01-07",null,null,null,null,null,7,270,224.6509338907355,224.6509338907355,225.16236604802376,226.09695212995695,227.27116257046669,228.45205337731971,{"$error":"#N/A"},{"$error":"#N/A"},{"$error":"#N/A"},{"$error":"#N/A"},237.98122428620692,237.98122428620692,null,0,0,0,0,0,0,0,0,0,0,0,0,null,270,270,270,270,270,270,270,270,270,270,270,270,null,316,7,"2027-04-07",270,270,270,270,null,"2027-04-07",null,297.41546844866377,270,null,null,null,null,270,270,270,270,270,270,270,270,270,270,270,270,270,270,270,270,270,270,270,270,270,270,270,270,270,270,270,270,270,270,270,270,270,270,270,270,270,270,270,270,270,270,270,270,270,270,270,270,270,270,270,270,270,270,270,270,270,270,270,270,270,270,270,270,270,270,270,270,270,270,270,270,270,270,270,270,270,270]
["2001-11-02","sexta-feira","Finados",null,null,346,8,"2027-05-07",270,233.89610524364286,233.89610524364286,6.6361002979726349,"2027-02-07",null,null,null,null,null,8,270,220.76336569418024,220.76336569418024,221.31372044940792,222.31973975157848,223.58425815351512,224.85659640087005,{"$error":"#N/A"},{"$error":"#N/A"},{"$error":"#N/A"},{"$error":"#N/A"},233.89610524364286,233.89610524364286,null,0,0,0,0,0,0,0,0,0,0,0,0,null,270,270,270,270,270,270,270,270,270,270,270,270,null,346,8,"2027-05-07",270,270,270,270,null,"2027-05-07",null,297.41546844866377,270,null,null,null,null,270,270,270,270,270,270,270,270,270,270,270,270,270,270,270,270,270,270,270,270,270,270,270,270,270,270,270,270,270,270,270,270,270,270,270,270,270,270,270,270,270,270,270,270,270,270,270,270,270,270,270,270,270,270,270,270,270,270,270,270,270,270,270,270,270,270,270,270,270,270,270,270,270,270,270,270,270,270]
["2001-11-15","quinta-feira","Proclamação da República",null,null,377,9,"2027-06-07",270,230.2666269172891,230.2666269172891,6.891880143634463,"2027-03-07",null,null,null,null,null,9,270,216.81687341054271,216.81687341054271,217.40588319297095,218.48290085461673,219.83728009314305,221.20072772536147,{"$error":"#N/A"},{"$error":"#N/A"},{"$error":"#N/A"},{"$error":"#N/A"},230.2666269172891,230.2666269172891,null,0,0,0,0,0,0,0,0,0,0,0,0,null,270,270,270,270,270,270,270,270,270,270,270,270,null,377,9,"2027-06-07",270,270,270,270,null,"2027-06-07",null,297.41546844866377,270,null,null,null,null,270,270,270,270,270,270,270,270,270,270,270,270,270,270,270,270,270,270,270,270,270,270,270,270,270,270,270,270,270,270,270,270,270,270,270,270,270,270,270,270,270,270,270,270,270,270,270,270,270,270,270,270,270,270,270,270,270,270,270,270,270,270,270,{"$f":"IF($G44>EI$33,0,$I$9)","v":270},270,270,270,270,270,270,270,270,270,270,270,270,270,270]
["2001-12-25","terça-feira","Natal",null,null,407,10,"2027-07-07",270,226.31393449246366,226.31393449246366,6.7735760593594367,"2027-04-07",null,null,null,null,null,10,270,213.06487306516539,213.06487306516539,213.68981727063391,214.83289005262347,216.2709717686775,217.71939460561794,{"$error":"#N/A"},{"$error":"#N/A"},{"$error":"#N/A"},{"$error":"#N/A"},226.31393449246366,226.31393449246366,null,0,0,0,0,0,0,0,0,0,0,0,0,null,270,270,270,270,270,270,270,270,270,270,270,270,null,407,10,"2027-07-07",270,270,270,270,null,"2027-07-07",null,297.41546844866377,270,null,null,null,null,270,270,270,270,270,270,270,270,270,270,270,270,270,270,270,270,270,270,270,270,270,270,270,270,270,270,270,270,270,270,270,270,270,270,270,270,270,270,270,270,270,270,270,270,270,270,270,270,{"$f":"IF($G45>DT$33,0,$I$9)","v":270},270,270,270,270,270,270,270,270,270,270,270,270,270,270,270,270,270,270,270,270,270,270,270,270,270,270,270,270,270]
["2002-01-01","terça-feira","Confraternização Universal",null,null,438,11,"2027-08-07",270,222.55336326188254,222.55336326188254,6.6610221624281447,"2027-05-07",null,null,null,null,null,11,270,209.25600344215604,209.25600344215604,209.91659874827704,211.12526071740714,212.64655476810231,214.17956732223078,{"$error":"#N/A"},{"$error":"#N/A"},{"$error":"#N/A"},{"$error":"#N/A"},222.55336326188254,222.55336326188254,null,0,0,0,0,0,0,0,0,0,0,0,0,null,270,270,270,270,270,270,270,270,270,270,270,270,null,438,11,"2027-08-07",270,270,270,270,null,"2027-08-07",null,297.41546844866377,270,null,null,null,null,270,270,270,270,270,270,270,270,270,270,270,270,270,270,270,270,270,270,270,270,270,270,270,270,270,270,270,270,270,270,270,270,270,270,270,270,270,270,270,270,270,270,270,270,270,270,270,270,270,270,270,270,270,270,270,270,270,270,270,270,270,270,270,270,270,270,270,270,270,270,270,270,270,270,270,270,270,270]
["2002-02-11","segunda-feira","Carnaval",null,null,469,12,"2027-09-07",270,218.73307456064288,218.73307456064288,6.5466809216000419,"2027-06-07",null,null,null,null,null,12,270,205.51522335261302,205.51522335261302,206.21000566553778,207.48161839686054,209.08287822884117,210.69729291427254,{"$error":"#N/A"},{"$error":"#N/A"},{"$error":"#N/A"},{"$error":"#N/A"},218.73307456064288,218.73307456064288,null,0,0,0,0,0,0,0,0,0,0,0,0,null,270,270,270,270,270,270,270,270,270,270,270,270,null,469,12,"2027-09-07",270,270,270,270,null,"2027-09-07",null,297.41546844866377,270,null,null,null,null,270,270,270,270,270,270,270,270,270,270,270,270,270,270,270,270,270,270,270,270,270,270,270,270,270,270,270,270,270,270,270,270,270,270,270,270,270,270,270,270,270,270,270,270,270,270,270,270,270,270,270,270,270,270,270,270,270,270,270,270,270,270,270,270,270,270,270,270,270,270,270,270,270,270,270,270,270,270]
["2002-02-12","terça-feira","Carnaval",null,null,499,13,"2027-10-07",270,215.09847155127008,215.09847155127008,6.4378972535295134,"2027-07-07",null,null,null,null,null,13,270,201.95879724577935,201.95879724577935,202.68530815669229,204.01539680514199,205.69103309313533,207.38126646352114,{"$error":"#N/A"},{"$error":"#N/A"},{"$error":"#N/A"},{"$error":"#N/A"},215.09847155127008,215.09847155127008,null,0,0,0,0,0,0,0,0,0,0,0,0,null,270,270,270,270,270,270,270,270,270,270,270,270,null,499,13,"2027-10-07",270,270,270,270,null,"2027-10-07",null,297.41546844866377,270,null,null,null,null,270,270,270,270,270,270,270,270,270,270,270,270,270,270,270,270,270,270,270,270,270,270,270,270,270,270,270,270,270,270,270,270,270,270,270,270,270,270,270,270,270,270,270,270,270,270,270,270,270,270,270,270,270,270,270,270,270,270,270,270,270,270,270,270,270,270,270,270,270,270,270,270,270,270,270,270,270,270]
["2002-03-29","sexta-feira","Paixão de Cristo",null,null,530,14,"2027-11-07",270,211.40615143317643,211.40615143317643,6.3273861123949713,"2027-08-07",null,null,null,null,null,14,270,198.34846619090996,198.34846619090996,199.10640126859346,200.49445794961917,202.24392194774308,204.0095233699823,{"$error":"#N/A"},{"$error":"#N/A"},{"$error":"#N/A"},{"$error":"#N/A"},211.40615143317643,211.40615143317643,null,0,0,0,0,0,0,0,0,0,0,0,0,null,270,270,270,270,270,270,270,270,270,270,270,270,null,530,14,"2027-11-07",270,270,270,270,null,"2027-11-07",null,297.41546844866377,270,null,null,null,null,270,270,270,270,270,270,270,270,270,270,270,270,270,270,270,270,270,270,270,270,270,270,270,270,270,270,270,270,270,270,270,270,270,270,270,270,270,270,270,270,270,270,270,270,270,270,270,270,270,270,270,270,270,270,270,270,270,270,270,270,270,270,270,270,270,270,270,270,270,270,270,270,270,270,270,270,270,270]
["2002-04-21","domingo","Tiradentes",null,null,560,15,"2027-12-07",270,207.77721264808895,207.77721264808895,6.2187719745573027,"2027-09-07",null,null,null,null,null,15,270,194.91606029949116,194.91606029949116,195.70312394322036,197.14496499436564,198.96302171958703,200.79875133611802,{"$error":"#N/A"},{"$error":"#N/A"},{"$error":"#N/A"},{"$error":"#N/A"},207.77721264808895,207.77721264808895,null,0,0,0,0,0,0,0,0,0,0,0,0,null,270,270,270,270,270,270,270,270,270,270,270,270,null,560,15,"2027-12-07",270,270,270,270,null,"2027-12-07",null,297.41546844866377,270,null,null,null,null,270,270,270,270,270,270,270,270,270,270,270,270,270,270,270,270,270,270,270,270,270,270,270,270,270,270,270,270,270,270,270,270,270,270,270,270,270,270,270,270,270,270,270,270,270,270,270,270,270,270,270,270,270,270,270,270,270,270,270,270,270,270,270,270,270,270,270,270,270,270,270,270,270,270,270,270,270,270]
["2002-05-01","quarta-feira","Dia do Trabalho",null,null,591,16,"2028-01-07",270,204.32465896416741,204.32465896416741,6.1154370427975309,"2027-10-07",null,null,null,null,null,16,270,191.43162924133011,191.43162924133011,192.2475046648789,193.74259743638009,195.62866319468247,197.53403116850407,{"$error":"#N/A"},{"$error":"#N/A"},{"$error":"#N/A"},{"$error":"#N/A"},204.32465896416741,204.32465896416741,null,0,0,0,0,0,0,0,0,0,0,0,0,null,270,270,270,270,270,270,270,270,270,270,270,270,null,591,16,"2028-01-07",270,270,270,270,null,"2028-01-07",null,297.41546844866377,270,null,null,null,null,270,270,270,270,270,270,270,270,270,270,270,270,270,270,270,{"$f":"IF($G51>CM$33,0,$I$9)","v":270},270,270,270,270,270,270,270,270,270,270,270,270,270,270,270,{"$f":"IF($G51>DC$33,0,$I$9)","v":270},270,270,270,270,270,270,270,270,270,270,270,270,270,270,270,270,270,270,270,270,270,270,270,270,270,270,270,270,270,270,270,270,270,270,270,270,270,270,270,270,270,270,270,270,270,270]
["2002-05-30","quinta-feira","Corpus Christi",null,null,622,17,"2028-02-07",270,200.81727909542585,200.81727909542585,6.0104611633260951,"2027-11-07",null,null,null,null,null,17,270,{"$f":"$T52/((U$29)^($H52-$H$35))","v":188.00948786715117},188.00948786715117,188.85290283151352,190.3989486237603,192.3501841325872,194.3223910011485,{"$error":"#N/A"},{"$error":"#N/A"},{"$error":"#N/A"},{"$error":"#N/A"},{"$f":"IF($I52<>0,$J52,$T52/((AE$29)^($H52-$H$35)))","v":200.81727909542585},{"$f":"IF($I52<>0,$J52,$T52/((AF$29)^($H52-$H$35)))","v":200.81727909542585},null,0,0,0,0,0,0,0,0,0,0,0,0,null,{"$f":"$T52","v":270},270,270,270,270,270,270,270,270,270,270,270,null,622,17,"2028-02-07",270,270,270,270,null,"2028-02-07",null,297.41546844866377,270,null,null,null,null,{"$f":"IF($G52>BX$33,0,$I$9)","v":270},270,270,270,270,270,270,270,270,270,270,270,270,270,270,270,{"$f":"IF($G52>CN$33,0,$I$9)","v":270},270,270,270,270,270,270,270,270,270,270,270,270,270,270,270,270,270,270,270,270,270,270,270,270,270,270,270,270,270,270,270,270,270,270,270,270,270,270,270,270,270,270,270,270,270,270,270,270,270,270,270,270,270,270,270,270,270,270,270,270,270]
["2002-09-07","sábado","Independência do Brasil",null,null,651,18,"2028-03-07",270,197.48037593891706,197.48037593891706,5.9105876518517881,"2027-12-07",null,null,null,null,null,18,270,184.86353440343245,184.86353440343245,185.73159240030122,187.32327963766127,189.33297813349242,191.36524243123245,{"$error":"#N/A"},{"$error":"#N/A"},{"$error":"#N/A"},{"$error":"#N/A"},{"$f":"IF($I53<>0,$J53,$T53/((AE$29)^($H53-$H$35)))","v":197.48037593891706},197.48037593891706,null,0,0,0,0,0,0,0,0,0,0,0,0,null,270,270,270,270,270,270,270,270,270,270,270,270,null,651,18,"2028-03-07",270,270,270,270,null,"2028-03-07",null,297.41546844866377,270,null,null,null,null,270,270,270,270,270,270,270,270,270,270,270,270,270,270,270,270,270,270,270,270,270,270,270,270,270,270,270,270,270,270,270,270,270,270,270,270,270,270,270,270,270,270,270,270,270,270,270,270,270,270,270,270,270,270,270,270,270,270,270,270,270,270,270,270,270,270,270,270,270,270,270,270,270,270,270,270,270,270]
["2002-10-12","sábado","Nossa Sr.a Aparecida - Padroeira do Brasil",null,null,682,19,"2028-04-07",270,194.09048311564723,194.09048311564723,5.8091281596513218,"2028-01-07",null,null,null,null,null,19,270,181.55880805196091,181.55880805196091,182.45204500032335,184.09041670599657,186.16000647157875,188.2538985499161,{"$error":"#N/A"},{"$error":"#N/A"},{"$error":"#N/A"},{"$error":"#N/A"},194.09048311564723,194.09048311564723,null,0,0,0,0,0,0,0,0,0,0,0,0,null,270,270,270,270,270,270,270,270,270,270,270,270,null,682,19,"2028-04-07",270,270,270,270,null,"2028-04-07",null,297.41546844866377,270,null,null,null,null,270,270,270,270,270,270,270,270,270,270,270,270,270,270,270,270,270,270,270,270,270,270,270,270,270,270,270,270,270,270,270,270,270,270,270,270,270,270,270,270,270,270,270,270,270,270,270,270,270,270,270,270,270,270,270,270,270,270,270,270,270,270,270,270,270,270,270,270,270,270,270,270,270,270,270,270,270,270]
["2002-11-02","sábado","Finados",null,null,712,20,"2028-05-07",270,190.75878024314403,190.75878024314403,5.7094102926773012,"2028-02-07",null,null,null,null,null,20,270,178.41694598282487,178.41694598282487,179.33343653891117,181.01497232617555,183.14002741943222,185.2910939575354,{"$error":"#N/A"},{"$error":"#N/A"},{"$error":"#N/A"},{"$error":"#N/A"},190.75878024314403,190.75878024314403,null,0,0,0,0,0,0,0,0,0,0,0,0,null,270,270,270,270,270,270,270,270,270,270,270,270,null,712,20,"2028-05-07",270,270,270,270,null,"2028-05-07",null,297.41546844866377,270,null,null,null,null,270,270,270,270,270,270,270,270,270,270,270,270,270,270,270,270,270,270,270,270,270,270,270,270,270,270,270,270,270,270,270,270,270,270,270,270,270,270,270,270,270,270,270,270,270,270,270,270,270,270,270,270,270,270,270,270,270,270,270,270,270,270,270,270,270,270,270,270,270,270,270,270,270,270,270,270,270,0]
["2002-11-15","sexta-feira","Proclamação da República",null,null,743,21,"2028-06-07",270,187.69382062617004,187.69382062617004,5.6176760513412693,"2028-03-07",null,null,null,null,null,21,270,175.22746253579865,175.22746253579865,176.16686429382585,177.8909794340932,180.07084146518051,182.27850763766418,{"$error":"#N/A"},{"$error":"#N/A"},{"$error":"#N/A"},{"$error":"#N/A"},187.69382062617004,187.69382062617004,null,0,0,0,0,0,0,0,0,0,0,0,0,null,270,270,270,270,270,270,270,270,270,270,270,270,null,743,21,"2028-06-07",270,270,270,270,null,"2028-06-07",null,297.41546844866377,270,null,null,null,null,270,270,270,270,270,270,270,270,270,270,270,270,270,270,270,270,270,270,270,270,270,270,270,270,270,270,270,270,270,270,270,270,270,270,270,270,270,270,270,270,270,270,270,270,270,270,270,270,270,270,270,270,270,270,270,270,{"$f":"IF($G56>EB$33,0,$I$9)","v":270},270,270,270,270,270,270,270,270,270,270,270,270,270,270,270,270,270,270,270,0,0]
["2002-12-25","quarta-feira","Natal",null,null,773,22,"2028-07-07",270,184.47192107039066,184.47192107039066,5.5212445976367928,"2028-04-07",null,null,null,null,null,22,270,172.19516394384814,172.19516394384814,173.15568689865773,174.91910385952059,177.14964383828709,179.40974580228581,{"$error":"#N/A"},{"$error":"#N/A"},{"$error":"#N/A"},{"$error":"#N/A"},184.47192107039066,184.47192107039066,null,0,0,0,0,0,0,0,0,0,0,0,0,null,270,270,270,270,270,270,270,270,270,270,270,270,null,773,22,"2028-07-07",270,270,270,270,null,"2028-07-07",null,297.41546844866377,270,null,null,null,null,270,270,270,270,270,270,270,270,270,270,270,270,270,270,270,270,270,270,270,270,270,270,270,270,270,270,270,270,270,270,270,270,{"$f":"IF($G57>DD$33,0,$I$9)","v":270},270,270,270,270,270,270,270,270,270,270,270,270,270,270,270,270,270,270,270,270,270,270,270,270,270,270,270,270,270,270,270,270,270,270,270,270,270,270,270,270,270,270,0,0,0]
["2003-01-01","quarta-feira","Confraternização Universal",null,null,804,23,"2028-08-07",270,181.40662241441936,181.40662241441936,5.4295002088635718,"2028-05-07",null,null,null,null,null,23,270,169.11690463371653,169.11690463371653,170.09819799533776,171.90031469460058,174.1808488330098,176.49278236755421,{"$error":"#N/A"},{"$error":"#N/A"},{"$error":"#N/A"},{"$error":"#N/A"},181.40662241441936,181.40662241441936,null,0,0,0,0,0,0,0,0,0,0,0,0,null,270,270,270,270,270,270,270,270,270,270,270,270,null,804,23,"2028-08-07",270,270,270,270,null,"2028-08-07",null,297.41546844866377,270,null,null,null,null,270,270,270,270,270,270,270,270,270,270,270,270,270,270,270,270,270,270,270,270,270,270,270,270,270,270,270,270,270,270,270,270,270,270,270,270,270,270,270,270,270,270,270,270,270,270,270,270,270,270,270,270,270,270,270,270,270,270,270,270,270,270,270,270,270,270,270,270,270,270,270,270,270,270,0,0,0,0]
["2003-03-03","segunda-feira","Carnaval",null,null,835,24,"2028-09-07",270,178.29264714223098,178.29264714223098,5.3362989289669729,"2028-06-07",null,null,null,null,null,24,270,166.09367404891839,166.09367404891839,167.09469656745881,168.93362440179436,171.26180692682084,173.62324487192933,{"$error":"#N/A"},{"$error":"#N/A"},{"$error":"#N/A"},{"$error":"#N/A"},178.29264714223098,178.29264714223098,null,0,0,0,{"$f":"IF($I59<>0,0,X59*$B$1*MIN($F59,365))","v":0},0,0,0,0,0,0,0,0,null,270,270,270,270,270,270,270,270,270,270,270,270,null,835,24,"2028-09-07",270,270,270,270,null,"2028-09-07",null,297.41546844866377,270,null,null,null,null,270,270,270,270,270,270,270,270,270,270,270,270,270,270,270,270,270,270,270,270,270,270,270,270,270,270,270,270,270,270,270,270,270,270,270,270,270,270,270,270,270,270,270,270,270,270,270,270,270,270,270,270,270,270,270,270,270,270,270,270,270,270,270,270,270,270,270,270,270,270,270,270,270,0,0,0,0,0]
["2003-03-04","terça-feira","Carnaval",null,null,865,25,"2028-10-07",270,175.33002709423943,175.33002709423943,5.247627710930586,"2028-07-07",null,null,null,null,null,25,270,163.21943500749225,163.21943500749225,164.23858753030635,166.11139185419225,168.48351378451414,170.89070253834143,{"$error":"#N/A"},{"$error":"#N/A"},{"$error":"#N/A"},{"$error":"#N/A"},175.33002709423943,175.33002709423943,null,0,{"$f":"IF($I60<>0,0,V60*$B$1*MIN($F60,365))","v":0},{"$f":"IF($I60<>0,0,W60*$B$1*MIN($F60,365))","v":0},0,0,0,0,0,0,0,0,0,null,270,270,270,270,270,270,270,270,270,270,270,270,null,865,25,"2028-10-07",270,270,270,270,null,"2028-10-07",null,297.41546844866377,270,null,null,null,null,270,270,270,270,270,270,270,270,270,270,270,270,270,270,270,270,270,270,270,270,270,270,270,270,270,270,270,270,270,270,270,270,270,270,270,270,270,270,270,270,270,270,270,270,270,270,270,270,270,270,270,270,270,270,270,270,270,270,270,270,270,270,270,270,270,270,270,270,270,270,270,270,0,0,0,0,0,0]
["2003-04-18","sexta-feira","Paixão de Cristo",null,null,896,26,"2028-11-07",270,172.32036095539075,172.32036095539075,5.1575484033948449,"2028-08-07",null,null,null,null,null,26,270,160.30163096527153,160.30163096527153,161.33855191573963,163.2446079590384,165.65995171937314,168.11224739695086,{"$error":"#N/A"},{"$error":"#N/A"},{"$error":"#N/A"},{"$error":"#N/A"},172.32036095539075,172.32036095539075,null,0,0,0,0,0,0,0,0,0,0,0,0,null,270,270,270,270,270,270,270,270,270,270,270,270,null,896,26,"2028-11-07",270,270,270,270,null,"2028-11-07",null,297.41546844866377,270,null,null,null,null,270,270,270,270,270,270,270,270,270,270,270,270,270,270,270,270,270,270,270,270,270,270,270,270,270,270,270,270,270,270,270,270,270,270,270,270,270,270,270,270,270,270,270,270,270,270,270,270,270,270,270,270,270,270,270,270,270,270,270,270,270,270,270,270,270,270,270,270,270,270,270,0,0,0,0,0,0,0]
["2003-04-21","segunda-feira","Tiradentes",null,null,926,27,"2028-12-07",270,169.36235790253747,169.36235790253747,5.0690153720229469,"2028-09-07",null,null,null,null,null,27,270,157.52762281136097,157.52762281136097,158.58083126012562,160.51741704347049,162.97253462343264,165.4664390367534,{"$error":"#N/A"},{"$error":"#N/A"},{"$error":"#N/A"},{"$error":"#N/A"},169.36235790253747,169.36235790253747,null,0,0,0,0,0,0,0,0,0,0,0,0,null,270,270,270,270,270,270,270,270,270,270,270,270,null,926,27,"2028-12-07",270,270,270,270,null,"2028-12-07",null,297.41546844866377,270,null,null,null,null,270,270,270,270,270,270,270,270,270,270,270,270,270,270,270,270,270,270,270,270,270,270,270,270,270,270,270,270,270,270,270,270,270,270,270,270,270,270,270,270,270,270,270,270,270,270,270,270,270,270,270,270,270,270,270,270,270,{"$f":"IF($G62>EC$33,0,$I$9)","v":270},270,270,270,270,270,270,270,270,270,270,270,270,0,0,0,0,0,0,0,0]
["2003-05-01","quinta-feira","Dia do Trabalho",null,null,957,28,"2029-01-07",270,166.54812902131553,166.54812902131553,4.9847855016079743,"2028-10-07",null,null,null,null,null,28,270,154.71156886178488,154.71156886178488,155.78069722732965,157.7471750935635,160.24132931980188,162.77617519301904,{"$error":"#N/A"},{"$error":"#N/A"},{"$error":"#N/A"},{"$error":"#N/A"},166.54812902131553,166.54812902131553,null,0,0,0,0,0,0,0,0,0,0,0,0,null,270,270,270,270,270,270,270,270,270,270,270,270,null,957,28,"2029-01-07",270,270,270,270,null,"2029-01-07",null,297.41546844866377,270,null,null,null,null,270,270,270,270,270,270,270,270,270,270,270,270,270,270,270,270,270,270,270,270,270,270,270,270,270,270,270,270,270,270,270,270,{"$f":"IF($G63>DD$33,0,$I$9)","v":270},270,270,270,270,270,270,270,270,270,270,270,270,270,270,270,270,270,270,270,270,270,270,270,270,270,270,270,270,270,270,270,270,270,270,270,270,0,0,0,0,0,0,0,0,0]
["2003-06-19","quinta-feira","Corpus Christi",null,null,988,29,"2029-02-07",270,163.68921048516185,163.68921048516185,4.8992180698208943,"2028-11-07",null,null,null,null,null,29,270,151.94585630443831,151.94585630443831,153.03000643770071,155.02474253781682,157.55589542438915,160.12965145507923,{"$error":"#N/A"},{"$error":"#N/A"},{"$error":"#N/A"},{"$error":"#N/A"},163.68921048516185,163.68921048516185,null,0,0,0,0,0,0,0,0,0,0,0,0,null,270,270,270,270,270,270,270,270,270,270,270,270,null,988,29,"2029-02-07",270,270,270,270,null,"2029-02-07",null,297.41546844866377,270,null,null,null,null,270,270,270,270,270,270,270,270,270,270,270,270,270,270,270,270,270,270,270,270,270,270,270,270,270,270,270,270,270,270,270,270,270,270,270,270,270,270,270,270,270,270,270,270,270,270,270,270,270,270,270,270,270,270,270,270,270,270,270,270,270,270,270,270,270,270,270,270,0,0,0,0,0,0,0,0,0,0]
["2003-09-07","domingo","Independência do Brasil",null,null,1016,30,"2029-03-07",270,160.96925010319279,160.96925010319279,4.8178096555885608,"2028-12-07",null,null,null,null,null,30,270,149.49031396647925,149.49031396647925,150.58728254999315,152.60617778625175,155.16904542694061,157.77624670229923,{"$error":"#N/A"},{"$error":"#N/A"},{"$error":"#N/A"},{"$error":"#N/A"},160.96925010319279,160.96925010319279,null,0,0,0,0,0,0,0,0,0,0,0,0,null,270,270,270,270,270,270,270,270,270,270,270,270,null,1016,30,"2029-03-07",270,270,270,270,null,"2029-03-07",null,297.41546844866377,270,null,null,null,null,270,270,270,270,270,270,270,270,270,270,270,270,270,270,270,270,270,270,270,270,270,270,270,270,270,270,270,270,270,270,270,270,270,270,270,270,270,270,270,270,270,270,270,270,270,270,270,270,270,270,270,270,270,270,270,270,270,270,270,270,270,270,270,270,270,270,270,0,0,0,0,0,0,0,0,0,0,0]
["2003-10-12","domingo","Nossa Sr.a Aparecida - Padroeira do Brasil",null,null,1047,31,"2029-04-07",270,158.20609704002101,158.20609704002101,4.7351084844078288,"2029-01-07",null,null,null,null,null,31,270,146.81793955013464,146.81793955013464,147.9282942509418,149.97246959866021,152.56861633740954,155.21101514009095,{"$error":"#N/A"},{"$error":"#N/A"},{"$error":"#N/A"},{"$error":"#N/A"},158.20609704002101,158.20609704002101,null,0,0,0,0,0,0,0,0,0,0,0,0,null,270,270,270,270,270,270,270,270,270,270,270,270,null,1047,31,"2029-04-07",270,270,270,270,null,"2029-04-07",null,297.41546844866377,270,null,null,null,null,270,270,270,270,270,270,270,270,270,270,270,270,270,270,270,270,270,270,270,270,270,270,270,270,270,270,270,270,270,270,270,270,270,270,270,270,270,270,270,270,270,270,270,270,270,270,270,270,270,270,270,270,270,270,270,270,270,270,270,270,270,270,270,270,270,270,0,0,0,0,0,0,0,0,0,0,0,0]
["2003-11-02","domingo","Finados",null,null,1077,32,"2029-05-07",270,155.49037548843069,155.49037548843069,4.6538269383687298,"2029-02-07",null,null,null,null,null,32,270,144.27726570296301,144.27726570296301,145.39979187031662,147.46700518064165,150.09357331347033,152.76825080964488,{"$error":"#N/A"},{"$error":"#N/A"},{"$error":"#N/A"},{"$error":"#N/A"},155.49037548843069,155.49037548843069,null,0,0,0,0,0,0,0,0,0,0,0,0,null,270,270,270,270,270,270,270,270,270,270,270,270,null,1077,32,"2029-05-07",270,270,270,270,null,"2029-05-07",null,297.41546844866377,270,null,null,null,null,270,270,270,270,270,270,270,270,270,270,270,270,270,270,270,{"$f":"IF($G67>CM$33,0,$I$9)","v":270},270,270,270,270,270,270,270,270,270,270,270,270,270,270,270,{"$f":"IF($G67>DC$33,0,$I$9)","v":270},270,270,270,270,270,270,270,270,270,270,270,270,270,270,270,270,270,270,270,270,270,270,270,270,270,270,270,270,270,270,270,270,270,0,0,0,0,0,0,0,0,0,0,0,0,0]
["2003-11-15","sábado","Proclamação da República",null,null,1108,33,"2029-06-07",270,153.07755656951804,153.07755656951804,4.5816112681256751,"2029-03-07",null,null,null,null,null,33,270,{"$f":"$T68/((U$29)^($H68-$H$35))","v":141.69808272117322},141.69808272117322,142.8324014591156,144.92198987013532,147.57820246020449,150.28444258837513,{"$error":"#N/A"},{"$error":"#N/A"},{"$error":"#N/A"},{"$error":"#N/A"},153.07755656951804,153.07755656951804,null,{"$f":"IF($I68<>0,0,U68*$B$1*MIN($F68,365))","v":0},0,0,0,0,0,0,0,0,0,0,0,null,{"$f":"$T68","v":270},270,270,270,270,270,270,270,270,270,270,270,null,1108,33,"2029-06-07",270,270,270,270,null,"2029-06-07",null,297.41546844866377,270,null,null,null,null,{"$f":"IF($G68>BX$33,0,$I$9)","v":270},270,270,270,270,270,270,270,270,270,270,270,270,270,270,270,270,270,270,270,270,270,270,270,270,270,270,270,270,270,270,270,270,270,270,270,270,270,270,270,270,270,270,270,270,270,270,270,270,270,270,270,270,270,270,270,270,270,270,270,270,270,270,270,0,0,0,0,0,0,0,0,{"$f":"IF($G68>ER$33,0,$I$9)","v":0},0,0,0,0,0]
["2003-12-25","quinta-feira","Natal",null,null,1138,34,"2029-07-07",270,150.44987010724799,150.44987010724799,4.5029646123099321,"2029-04-07",null,null,null,null,null,34,270,139.24600762689556,139.24600762689556,140.39100193545761,142.5008995861669,145.18411638108043,147.91921435090435,{"$error":"#N/A"},{"$error":"#N/A"},{"$error":"#N/A"},{"$error":"#N/A"},{"$f":"IF($I69<>0,$J69,$T69/((AE$29)^($H69-$H$35)))","v":150.44987010724799},150.44987010724799,null,0,0,0,0,0,0,0,0,0,0,0,0,null,270,270,270,270,270,270,270,270,270,270,270,270,null,1138,34,"2029-07-07",270,270,270,270,null,"2029-07-07",null,297.41546844866377,270,null,null,null,null,270,270,270,270,270,270,270,270,270,270,270,270,270,270,270,270,270,270,270,270,270,270,270,270,270,270,270,270,270,270,270,270,270,270,270,270,270,270,270,270,270,270,270,270,270,270,270,{"$f":"IF($G69>DS$33,0,$I$9)","v":270},270,270,270,270,270,270,270,270,270,270,270,270,270,270,270,0,0,0,0,0,0,0,0,0,0,0,0,0,0,0]
["2004-01-01","quinta-feira","Confraternização Universal",null,null,1169,35,"2029-08-07",270,147.94990273034387,147.94990273034387,4.4281405887191916,"2029-05-07",null,null,null,null,null,35,270,136.75676629421841,136.75676629421841,137.91205401158805,140.04159032737056,142.75102156802387,145.51424500196322,{"$error":"#N/A"},{"$error":"#N/A"},{"$error":"#N/A"},{"$error":"#N/A"},147.94990273034387,147.94990273034387,null,0,0,0,0,0,0,0,0,0,0,0,0,null,270,270,270,270,270,270,270,270,270,270,270,270,null,1169,35,"2029-08-07",270,270,270,270,null,"2029-08-07",null,297.41546844866377,270,null,null,null,null,270,270,270,270,270,270,270,270,270,270,270,270,270,270,270,270,270,270,270,270,270,270,270,270,270,270,270,270,270,270,270,270,270,270,270,270,270,270,270,270,270,270,270,270,270,270,270,270,270,270,270,270,270,270,270,270,270,270,270,270,270,270,0,0,0,0,0,0,0,0,0,0,0,0,0,0,0,0]
["2004-02-23","segunda-feira","Carnaval",null,null,1200,36,"2029-09-07",270,145.41023613772919,145.41023613772919,4.3521283676022344,"2029-06-07",null,null,null,null,null,36,270,134.31202406437308,134.31202406437308,135.47687800133502,137.62472432365519,140.35870222350263,143.14837725043611,{"$error":"#N/A"},{"$error":"#N/A"},{"$error":"#N/A"},{"$error":"#N/A"},145.41023613772919,145.41023613772919,null,0,0,0,0,0,0,0,0,0,0,0,0,null,270,270,270,270,270,270,270,270,270,270,270,270,null,1200,36,"2029-09-07",270,270,270,270,null,"2029-09-07",null,297.41546844866377,270,null,null,null,null,270,270,270,270,270,270,270,270,270,270,270,270,270,270,270,270,270,270,270,270,270,270,270,270,270,270,270,270,270,270,270,270,270,270,270,270,270,270,270,270,270,270,270,270,270,270,270,270,270,270,270,270,270,270,270,270,270,270,270,270,270,0,0,0,0,0,0,0,0,0,0,0,0,0,0,0,0,0]
["2004-02-24","terça-feira","Carnaval",null,null,1230,37,"2029-10-07",270,142.99401041182384,142.99401041182384,4.2798107316258873,"2029-07-07",null,null,null,null,null,37,270,131.9877641820546,131.9877641820546,133.16120465242886,135.32554334227049,138.08173442286943,140.89545886321355,{"$error":"#N/A"},{"$error":"#N/A"},{"$error":"#N/A"},{"$error":"#N/A"},142.99401041182384,142.99401041182384,null,0,0,0,0,0,0,0,0,0,0,0,0,null,270,270,270,270,270,270,270,270,270,270,270,270,null,1230,37,"2029-10-07",270,270,270,270,null,"2029-10-07",null,297.41546844866377,270,null,null,null,null,270,270,270,270,270,270,270,270,270,270,270,270,270,270,270,270,270,270,270,270,270,270,270,270,270,270,270,270,270,270,270,270,270,270,270,270,270,270,270,270,270,270,270,270,270,270,270,270,270,270,270,270,270,270,270,270,270,270,270,270,0,0,0,0,0,0,0,0,0,0,0,0,0,0,0,0,0,0]
["2004-04-09","sexta-feira","Paixão de Cristo",null,null,1261,38,"2029-11-07",270,140.53941527870774,140.53941527870774,4.2063446992917228,"2029-08-07",null,null,null,null,null,38,270,129.62827536360351,129.62827536360351,130.80991655516985,132.99006782836301,135.76766618884656,138.60468642058021,{"$error":"#N/A"},{"$error":"#N/A"},{"$error":"#N/A"},{"$error":"#N/A"},140.53941527870774,140.53941527870774,null,0,0,0,0,0,0,0,0,0,0,0,0,null,270,270,270,270,270,270,270,270,270,270,270,270,null,1261,38,"2029-11-07",270,270,270,270,null,"2029-11-07",null,297.41546844866377,270,null,null,null,null,270,270,270,270,270,270,270,270,270,270,270,270,270,270,270,270,270,270,270,270,270,270,270,270,270,270,270,270,270,270,270,270,270,270,270,270,270,270,270,270,270,270,270,270,270,270,270,270,270,270,270,270,270,270,270,270,270,270,270,0,0,0,0,0,0,0,0,0,0,0,0,0,0,0,0,0,0,0]
["2004-04-21","quarta-feira","Tiradentes",null,null,1291,39,"2029-12-07",270,138.12695503816627,138.12695503816627,4.1341397642923159,"2029-09-07",null,null,null,null,null,39,270,127.38506741449719,127.38506741449719,128.57401444398849,130.76831417060487,133.56517642952375,136.42327820212842,{"$error":"#N/A"},{"$error":"#N/A"},{"$error":"#N/A"},{"$error":"#N/A"},138.12695503816627,138.12695503816627,null,0,0,0,0,0,0,0,0,0,0,0,0,null,270,270,270,270,270,270,270,270,270,270,270,270,null,1291,39,"2029-12-07",270,270,270,270,null,"2029-12-07",null,297.41546844866377,270,null,null,null,null,270,270,270,270,270,270,270,270,270,270,270,270,270,270,270,270,270,270,270,270,270,270,270,270,270,270,270,270,270,270,270,270,270,270,270,270,270,270,270,270,270,270,270,270,270,270,270,270,270,270,270,270,270,270,270,270,270,270,0,0,0,0,0,0,0,0,0,0,0,0,0,0,0,0,0,0,0,0]
["2004-05-01","sábado","Dia do Trabalho",null,null,1322,40,"2030-01-07",270,135.83175278096016,135.83175278096016,4.0654443607341371,"2029-10-07",null,null,null,null,null,40,270,125.10785903791188,125.10785903791188,126.30372445548889,128.5114882366571,131.32679976631729,134.20521745864809,{"$error":"#N/A"},{"$error":"#N/A"},{"$error":"#N/A"},{"$error":"#N/A"},135.83175278096016,135.83175278096016,null,0,0,0,0,0,0,0,0,0,0,0,0,null,270,270,270,270,270,270,270,270,270,270,270,270,null,1322,40,"2030-01-07",270,270,270,270,null,"2030-01-07",null,297.41546844866377,270,null,null,null,null,270,270,270,270,270,270,270,270,270,270,270,270,270,270,270,270,270,270,270,270,270,270,270,270,270,270,270,270,270,270,270,270,270,270,270,270,270,270,270,270,270,270,270,270,270,270,270,270,270,270,270,270,270,270,270,270,270,0,0,0,0,0,0,0,0,0,0,0,0,0,0,0,0,0,0,0,0,0]
["2004-06-10","quinta-feira","Corpus Christi",null,null,1353,41,"2030-02-07",270,133.5001029563378,133.5001029563378,3.9956580814831901,"2029-11-07",null,null,null,null,null,41,270,122.87135934167382,122.87135934167382,124.07352201231612,126.29361105974141,129.12593535158999,132.02321942767998,{"$error":"#N/A"},{"$error":"#N/A"},{"$error":"#N/A"},{"$error":"#N/A"},133.5001029563378,133.5001029563378,null,0,0,0,0,0,0,0,0,0,0,0,0,null,270,270,270,270,270,270,270,270,270,270,270,270,null,1353,41,"2030-02-07",270,270,270,270,null,"2030-02-07",null,297.41546844866377,270,null,null,null,null,270,270,270,270,270,270,270,270,270,270,270,270,270,270,270,270,270,270,270,270,270,270,270,270,270,270,270,270,270,270,270,270,270,270,270,270,270,270,270,270,270,270,270,270,270,270,270,270,270,270,270,270,270,270,270,270,0,0,0,0,0,0,0,0,0,0,0,0,0,0,0,0,0,0,0,0,0,0]
["2004-09-07","terça-feira","Independência do Brasil",null,null,1381,42,"2030-03-07",270,131.28178331294907,131.28178331294907,3.9292637745565657,"2029-12-07",null,null,null,null,null,42,270,120.88567949278378,120.88567949278378,122.09301267884182,124.32328509075973,127.16977726791873,130.08289126699839,{"$error":"#N/A"},{"$error":"#N/A"},{"$error":"#N/A"},{"$error":"#N/A"},131.28178331294907,131.28178331294907,null,0,0,0,0,0,0,0,0,0,0,0,0,null,270,270,270,270,270,270,270,270,270,270,270,270,null,1381,42,"2030-03-07",270,270,270,270,null,"2030-03-07",null,297.41546844866377,270,null,null,null,null,270,270,270,270,270,270,270,270,270,270,270,270,270,270,270,270,270,270,270,270,270,270,270,270,270,270,270,270,270,270,270,270,270,270,270,270,270,270,270,270,270,270,270,270,270,270,270,270,270,270,270,270,270,270,{"$f":"IF($G77>DZ$33,0,$I$9)","v":270},0,0,0,0,0,0,0,0,0,0,0,0,0,0,0,0,0,0,0,0,0,0,0]
["2004-10-12","terça-feira","Nossa Sr.a Aparecida - Padroeira do Brasil",null,null,1412,43,"2030-04-07",270,129.02823698986393,129.02823698986393,3.8618151331066275,"2030-01-07",null,null,null,null,null,43,270,118.72465789474643,118.72465789474643,119.93716069312593,122.17768876824108,125.03857908205123,127.96791676763004,{"$error":"#N/A"},{"$error":"#N/A"},{"$error":"#N/A"},{"$error":"#N/A"},129.02823698986393,129.02823698986393,null,0,0,0,0,0,0,0,0,0,0,0,0,null,270,270,270,270,270,270,270,270,270,270,270,270,null,1412,43,"2030-04-07",270,270,270,270,null,"2030-04-07",null,297.41546844866377,270,null,null,null,null,270,270,270,270,270,270,270,270,270,270,270,270,270,270,270,270,270,270,270,270,270,270,270,270,270,270,270,270,270,270,270,270,270,270,270,270,270,270,270,270,270,270,270,270,270,270,270,{"$f":"IF($G78>DS$33,0,$I$9)","v":270},270,270,270,270,270,270,0,0,0,0,0,0,0,0,0,0,0,0,0,0,0,0,0,0,0,0,0,0,0,0]
["2004-11-02","terça-feira","Finados",null,null,1442,44,"2030-05-07",270,126.81337441178994,126.81337441178994,3.795524296144873,"2030-02-07",null,null,null,null,null,44,270,116.67013625895829,116.67013625895829,117.88710395534221,120.1365684699373,123.0101418430592,125.95391368776286,{"$error":"#N/A"},{"$error":"#N/A"},{"$error":"#N/A"},{"$error":"#N/A"},126.81337441178994,126.81337441178994,null,0,0,0,0,0,0,0,0,0,0,0,0,null,270,270,270,270,270,270,270,270,270,270,270,270,null,1442,44,"2030-05-07",270,270,270,270,null,"2030-05-07",null,297.41546844866377,270,null,null,null,null,270,270,270,270,270,270,270,270,270,270,270,270,270,270,270,270,270,270,270,270,270,270,270,270,270,270,270,270,270,270,270,270,270,270,270,270,270,270,270,270,270,270,270,270,270,270,270,270,270,270,270,270,270,0,0,0,0,0,0,0,0,0,0,0,0,0,0,0,0,0,0,0,0,0,0,0,0,0]
["2004-11-15","segunda-feira","Proclamação da República",null,null,1473,45,"2030-06-07",270,124.84555030698101,124.84555030698101,3.7366273206879419,"2030-03-07",null,null,null,null,null,45,270,114.58447412462232,114.58447412462232,115.80551761738414,118.06322734706612,120.94865367526189,123.90607086269452,{"$error":"#N/A"},{"$error":"#N/A"},{"$error":"#N/A"},{"$error":"#N/A"},124.84555030698101,124.84555030698101,null,0,0,0,0,0,0,0,0,0,0,0,0,null,270,270,270,270,270,270,270,270,270,270,270,270,null,1473,45,"2030-06-07",270,270,270,270,null,"2030-06-07",null,297.41546844866377,270,null,null,null,null,270,270,270,270,270,270,270,270,270,270,270,270,270,270,270,270,270,270,270,270,270,270,270,270,270,270,270,270,270,270,270,270,270,270,270,270,270,270,270,270,270,270,270,270,270,270,270,270,270,270,270,270,0,0,0,0,0,0,0,0,0,0,0,0,0,0,0,0,0,0,0,0,0,0,0,0,0,0]
["2004-12-25","sábado","Natal",null,null,1503,46,"2030-07-07",270,122.70248655702282,122.70248655702282,3.6724854226516932,"2030-04-07",null,null,null,null,null,46,270,112.60159807015397,112.60159807015397,113.82608205052517,116.09084390905174,118.98656521486866,121.95599451047225,{"$error":"#N/A"},{"$error":"#N/A"},{"$error":"#N/A"},{"$error":"#N/A"},122.70248655702282,122.70248655702282,null,0,0,0,0,0,0,0,0,0,0,0,0,null,270,270,270,270,270,270,270,270,270,270,270,270,null,1503,46,"2030-07-07",270,270,270,270,null,"2030-07-07",null,297.41546844866377,270,null,null,null,null,270,270,270,270,270,270,270,270,270,270,270,270,270,270,270,270,270,270,270,270,270,270,270,270,270,270,270,270,270,270,270,270,270,270,270,270,270,270,270,270,270,270,270,270,270,270,270,270,270,270,270,0,0,0,0,0,0,0,0,0,0,0,0,0,0,0,0,0,0,0,0,0,0,0,0,0,0,0]
["2005-01-01","sábado","Confraternização Universal",null,null,1534,47,"2030-08-07",270,120.66358673451781,120.66358673451781,3.6114611509641179,"2030-05-07",null,null,null,null,null,47,270,110.58866745319328,110.58866745319328,111.81620302771515,114.0873247164282,116.9925068986833,119.97315252470068,{"$error":"#N/A"},{"$error":"#N/A"},{"$error":"#N/A"},{"$error":"#N/A"},120.66358673451781,120.66358673451781,null,0,0,0,0,0,0,0,0,0,0,0,0,null,270,270,270,270,270,270,270,270,270,270,270,270,null,1534,47,"2030-08-07",270,270,270,270,null,"2030-08-07",null,297.41546844866377,270,null,null,null,null,270,270,270,270,270,270,270,270,270,270,270,270,270,270,270,270,270,270,270,270,270,270,270,270,270,270,270,270,270,270,270,270,270,270,270,270,270,270,270,270,270,270,270,270,270,270,270,270,270,270,0,0,0,0,0,0,0,0,0,0,0,0,0,0,0,0,0,0,0,0,0,0,0,0,0,0,0,0]
["2005-02-07","segunda-feira","Carnaval",null,null,1565,48,"2030-09-07",270,118.59230939996453,118.59230939996453,3.5494678203409382,"2030-06-07",null,null,null,null,null,48,270,108.61172113608387,108.61172113608387,109.84181335509236,112.11838266201852,115.03186637686129,118.02254890782865,{"$error":"#N/A"},{"$error":"#N/A"},{"$error":"#N/A"},{"$error":"#N/A"},118.59230939996453,118.59230939996453,null,0,0,0,0,0,0,0,0,0,0,0,0,null,270,270,270,270,270,270,270,270,270,270,270,270,null,1565,48,"2030-09-07",270,270,270,270,null,"2030-09-07",null,297.41546844866377,270,null,null,null,null,270,270,270,270,270,270,270,270,270,270,270,270,270,270,270,270,{"$f":"IF($G83>CN$33,0,$I$9)","v":270},270,270,270,270,270,270,270,270,270,270,270,270,270,270,270,270,270,270,270,270,270,270,270,270,270,270,270,270,270,270,270,270,0,0,0,0,0,0,0,0,0,0,0,0,0,0,0,0,0,0,0,0,0,0,0,0,0,0,0,0,0]
["2005-02-08","terça-feira","Carnaval",null,null,1595,49,"2030-10-07",270,116.62170680362937,116.62170680362937,3.4904876846326269,"2030-07-07",null,null,null,null,null,49,270,{"$f":"$T84/((U$29)^($H84-$H$35))","v":106.73220314099227},106.73220314099227,107.96431393574936,110.24531476417556,113.16576294588366,116.16506944736544,{"$error":"#N/A"},{"$error":"#N/A"},{"$error":"#N/A"},{"$error":"#N/A"},116.62170680362937,116.62170680362937,null,0,0,0,0,0,0,0,0,0,0,0,0,null,{"$f":"$T84","v":270},270,270,270,270,270,270,270,270,270,270,270,null,1595,49,"2030-10-07",270,270,270,270,null,"2030-10-07",null,297.41546844866377,270,null,null,null,null,{"$f":"IF($G84>BX$33,0,$I$9)","v":270},270,270,270,270,270,270,270,270,270,270,270,270,270,270,270,270,270,270,270,270,270,270,270,270,270,270,270,270,270,270,270,270,270,270,270,270,270,270,270,270,270,270,270,270,270,270,270,0,0,0,0,0,0,0,0,0,0,0,0,0,0,0,0,0,0,0,0,0,0,0,0,0,0,0,0,0,0]
["2005-03-25","sexta-feira","Paixão de Cristo",null,null,1626,50,"2030-11-07",270,114.61981124792425,114.61981124792425,3.430570950650373,"2030-08-07",null,null,null,null,null,50,270,104.82419718725509,104.82419718725509,106.05793882485678,108.3426788922209,111.26925361895084,114.27638018772818,{"$error":"#N/A"},{"$error":"#N/A"},{"$error":"#N/A"},{"$error":"#N/A"},{"$f":"IF($I85<>0,$J85,$T85/((AE$29)^($H85-$H$35)))","v":114.61981124792425},114.61981124792425,null,0,0,0,0,0,0,0,0,0,0,0,0,null,270,270,270,270,270,270,270,270,270,270,270,270,null,1626,50,"2030-11-07",270,270,270,270,null,"2030-11-07",null,297.41546844866377,270,null,null,null,null,270,270,270,270,270,270,270,270,270,270,270,270,270,270,270,270,270,270,270,270,270,270,270,270,270,270,270,270,270,270,270,270,270,270,270,270,270,270,270,270,270,270,270,270,270,270,270,0,0,0,0,0,0,0,0,0,0,0,0,0,0,0,0,0,0,0,0,0,0,0,0,0,0,0,0,0,0,0]
["2005-04-21","quinta-feira","Tiradentes",null,null,1656,51,"2030-12-07",270,112.65227967063952,112.65227967063952,3.3716827305422408,"2030-09-07",null,null,null,null,null,51,270,103.01022202072933,103.01022202072933,104.24511625321313,106.53268851436226,109.46418914003169,112.47785921881942,{"$error":"#N/A"},{"$error":"#N/A"},{"$error":"#N/A"},{"$error":"#N/A"},112.65227967063952,112.65227967063952,null,0,0,0,0,0,0,0,0,0,0,0,0,null,270,270,270,270,270,270,270,270,270,270,270,270,null,1656,51,"2030-12-07",270,270,270,270,null,"2030-12-07",null,297.41546844866377,270,null,null,null,null,270,270,270,270,270,270,270,270,270,270,270,270,270,270,270,270,270,270,270,270,270,270,270,270,270,270,270,270,270,270,270,270,270,270,270,270,270,270,270,270,270,270,270,270,270,270,0,0,0,0,0,0,0,0,0,0,0,0,0,0,0,0,0,0,0,0,0,0,0,0,0,0,0,0,0,0,0,0]
["2005-05-01","domingo","Dia do Trabalho",null,null,1687,52,"2031-01-07",270,110.78038025384561,110.78038025384561,3.3156567809975992,"2030-10-07",null,null,null,null,null,52,270,101.16875233185101,101.16875233185101,102.40441271134188,104.69412589483713,107.62971332097604,110.64911908493758,{"$error":"#N/A"},{"$error":"#N/A"},{"$error":"#N/A"},{"$error":"#N/A"},110.78038025384561,110.78038025384561,null,0,0,0,0,0,0,{"$f":"IF($I87<>0,0,AA87*$B$1*MIN($F87,365))","v":0},0,0,0,0,0,null,270,270,270,270,270,270,270,270,270,270,270,270,null,1687,52,"2031-01-07",270,270,270,270,null,"2031-01-07",null,297.41546844866377,270,null,null,null,null,270,270,270,270,270,270,270,270,270,270,270,270,270,270,270,270,270,270,270,270,270,270,270,{"$f":"IF($G87>CU$33,0,$I$9)","v":270},270,270,270,270,270,270,270,270,270,270,270,270,270,270,270,{"$f":"IF($G87>DK$33,0,$I$9)","v":270},270,270,270,270,270,0,0,0,0,0,0,0,0,0,0,0,0,0,0,0,0,0,0,0,0,0,0,0,0,0,0,0,0,0,0,0,0,0]
["2005-05-26","quinta-feira","Corpus Christi",null,null,1718,53,"2031-02-07",270,108.87875527366144,108.87875527366144,3.2587411453406867,"2030-11-07",null,null,null,null,null,53,270,99.360201809134438,99.360201809134438,100.59621131106576,102.88729355972563,105.82598090354917,108.8501118291572,{"$error":"#N/A"},{"$error":"#N/A"},{"$error":"#N/A"},{"$error":"#N/A"},108.87875527366144,108.87875527366144,null,0,0,0,{"$f":"IF($I88<>0,0,X88*$B$1*MIN($F88,365))","v":0},{"$f":"IF($I88<>0,0,Y88*$B$1*MIN($F88,365))","v":0},{"$f":"IF($I88<>0,0,Z88*$B$1*MIN($F88,365))","v":0},0,0,0,0,0,0,null,270,270,270,270,270,270,270,270,270,270,270,270,null,1718,53,"2031-02-07",270,270,270,270,null,"2031-02-07",null,297.41546844866377,270,null,null,null,null,270,270,270,270,270,270,270,270,270,270,270,270,270,270,270,270,{"$f":"IF($G88>CN$33,0,$I$9)","v":270},270,270,270,270,270,270,270,270,270,270,270,270,270,270,270,270,270,270,270,270,270,270,270,270,270,270,270,0,0,0,0,0,0,0,0,0,0,0,0,0,0,0,0,0,0,0,0,0,0,0,0,0,0,0,0,0,0,0,0,0,0]
["2005-09-07","quarta-feira","Independência do Brasil",null,null,1746,54,"2031-03-07",270,107.06955905416291,107.06955905416291,3.2045919024910954,"2030-12-07",null,null,null,null,null,54,270,97.754477321579841,97.754477321579841,98.990455851057604,101.28213313491936,104.22279911483061,107.2503558302426,{"$error":"#N/A"},{"$error":"#N/A"},{"$error":"#N/A"},{"$error":"#N/A"},107.06955905416291,107.06955905416291,null,0,0,0,0,0,0,0,0,0,0,0,0,null,270,270,270,270,270,270,270,270,270,270,270,270,null,1746,54,"2031-03-07",270,270,270,270,null,"2031-03-07",null,297.41546844866377,270,null,null,null,null,270,270,270,270,270,270,270,270,270,270,270,270,270,270,270,270,270,270,270,270,270,270,270,270,270,270,270,270,270,270,270,270,270,270,270,270,270,270,270,270,270,270,270,0,0,0,0,0,0,0,0,0,0,0,0,0,0,0,0,0,0,0,0,0,0,0,0,0,0,0,0,0,0,0,0,0,0,0]
["2005-10-12","quarta-feira","Nossa Sr.a Aparecida - Padroeira do Brasil",null,null,1777,55,"2031-04-07",270,105.23163299136951,105.23163299136951,3.1495827754316892,"2031-01-07",null,null,null,null,null,55,270,96.006962333177896,96.006962333177896,97.24253624344847,99.53418565884931,102.47616209798971,105.50660793672769,{"$error":"#N/A"},{"$error":"#N/A"},{"$error":"#N/A"},{"$error":"#N/A"},105.23163299136951,105.23163299136951,null,0,0,0,0,0,0,0,0,0,0,0,0,null,270,270,270,270,270,270,270,270,270,270,270,270,null,1777,55,"2031-04-07",270,270,270,270,null,"2031-04-07",null,297.41546844866377,270,null,null,null,null,270,270,270,270,270,270,270,270,270,270,270,270,270,270,270,270,270,270,270,270,270,270,270,270,270,270,270,270,270,270,270,270,270,270,270,270,270,270,270,270,270,270,0,0,0,0,0,0,0,0,0,0,0,0,0,0,0,0,0,0,0,0,0,0,0,0,0,0,0,0,0,0,0,0,0,0,0,0]
["2005-11-02","quarta-feira","Finados",null,null,1807,56,"2031-05-07",270,103.42525625260564,103.42525625260564,3.0955179196404869,"2031-02-07",null,null,null,null,null,56,270,94.345568779408538,94.345568779408538,95.580393205602732,97.871351398587706,100.81374346819909,103.84610865926622,{"$error":"#N/A"},{"$error":"#N/A"},{"$error":"#N/A"},{"$error":"#N/A"},103.42525625260564,103.42525625260564,null,0,0,0,0,0,0,0,0,0,0,0,0,null,270,270,270,270,270,270,270,270,270,270,270,270,null,1807,56,"2031-05-07",270,270,270,270,null,"2031-05-07",null,297.41546844866377,270,null,null,null,null,270,270,270,270,270,270,270,270,270,270,270,270,270,270,270,270,270,270,270,270,270,270,270,270,270,270,270,270,270,270,270,270,270,270,270,270,270,270,270,270,270,0,0,0,0,0,0,0,0,0,0,0,0,0,0,0,0,0,0,0,0,0,0,0,0,0,0,0,0,0,0,0,0,0,0,0,0,0]
["2005-11-15","terça-feira","Proclamação da República",null,null,1838,57,"2031-06-07",270,101.82035682268403,101.82035682268403,3.047483279702933,"2031-03-07",null,null,null,null,null,57,270,92.658993391265966,92.658993391265966,93.892686628733969,96.182267881469869,99.124237739669852,102.15770928918926,{"$error":"#N/A"},{"$error":"#N/A"},{"$error":"#N/A"},{"$error":"#N/A"},101.82035682268403,101.82035682268403,null,0,0,0,0,0,0,0,0,0,0,0,0,null,270,270,270,270,270,270,270,270,270,270,270,270,null,1838,57,"2031-06-07",270,270,270,270,null,"2031-06-07",null,297.41546844866377,270,null,null,null,null,270,270,270,270,270,270,270,270,270,270,270,270,270,270,270,270,270,270,270,270,270,270,270,270,270,270,270,270,270,270,270,270,270,270,270,270,270,270,270,270,0,0,0,0,0,0,0,0,0,0,0,0,0,0,0,0,0,0,0,0,0,0,0,0,0,0,0,0,0,0,0,0,0,0,0,0,0,0]
["2005-12-25","domingo","Natal",null,null,1868,58,"2031-07-07",270,100.07253709520519,100.07253709520519,2.9951710352594918,"2031-04-07",null,null,null,null,null,58,270,91.055536198393057,91.055536198393057,92.287801756193502,94.575431303621698,97.516195673021699,100.54991613026644,{"$error":"#N/A"},{"$error":"#N/A"},{"$error":"#N/A"},{"$error":"#N/A"},100.07253709520519,100.07253709520519,null,0,0,0,0,0,0,0,0,0,0,0,0,null,270,270,270,270,270,270,270,270,270,270,270,270,null,1868,58,"2031-07-07",270,270,270,270,null,"2031-07-07",null,297.41546844866377,270,null,null,null,null,270,270,270,270,270,270,270,270,270,270,270,270,270,270,270,270,270,270,270,270,270,270,270,270,270,270,270,270,270,270,270,270,270,270,270,270,270,270,270,0,0,0,0,0,0,0,0,0,0,0,0,0,0,0,0,0,0,0,0,0,{"$f":"IF($G93>EF$33,0,$I$9)","v":0},0,0,0,0,0,0,0,0,0,0,0,0,0,0,0,0,0]
["2006-01-01","domingo","Confraternização Universal",null,null,1899,59,"2031-08-07",270,98.409670401576861,98.409670401576861,2.9454014351191957,"2031-05-07",null,null,null,null,null,59,270,89.427775315787031,89.427775315787031,90.658233967602769,92.943229440088828,95.881952507892947,98.915108459112716,{"$error":"#N/A"},{"$error":"#N/A"},{"$error":"#N/A"},{"$error":"#N/A"},98.409670401576861,98.409670401576861,null,0,0,0,0,0,0,0,0,0,0,0,0,null,270,270,270,270,270,270,270,270,270,270,270,270,null,1899,59,"2031-08-07",270,270,270,0,null,"2031-08-07",null,297.41546844866377,270,null,null,null,null,270,270,270,270,270,270,270,270,270,270,270,270,270,270,270,270,270,270,270,270,270,270,270,270,270,270,270,270,270,270,270,270,270,270,270,270,270,270,0,{"$f":"IF($G94>DK$33,0,$I$9)","v":0},0,0,0,0,0,0,0,0,0,0,0,0,0,0,0,0,0,0,0,0,0,0,0,0,0,0,0,0,0,0,0,0,0,0,0,0,0,0]
["2006-02-27","segunda-feira","Carnaval",null,null,1930,60,"2031-09-07",270,96.72039756194124,96.72039756194124,2.8948414990289013,"2031-06-07",null,null,null,null,null,60,270,87.82911321840119,87.82911321840119,89.057440200356965,91.33919644543235,94.275097108502393,97.306880582597529,{"$error":"#N/A"},{"$error":"#N/A"},{"$error":"#N/A"},{"$error":"#N/A"},96.72039756194124,96.72039756194124,null,0,0,0,0,0,0,0,0,0,0,0,0,null,270,270,270,270,270,270,270,270,270,270,270,270,null,1930,60,"2031-09-07",270,270,0,0,null,"2031-09-07",null,297.41546844866377,270,null,null,null,null,270,270,270,270,270,270,270,270,270,270,270,270,270,270,270,270,270,270,270,270,270,270,270,270,270,270,270,270,270,270,270,270,270,270,270,270,270,0,0,0,0,0,0,0,0,0,0,0,0,0,0,0,0,0,0,0,0,0,0,0,0,0,0,0,0,0,0,0,0,0,0,0,0,0,0,0,0,0]
["2006-02-28","terça-feira","Carnaval",null,null,1960,61,"2031-10-07",0,0,0,0,"2031-07-07",null,null,null,null,null,61,270,86.309236753317904,86.309236753317904,87.53520301984166,89.813269005037085,92.745720182689823,95.775431433968478,{"$error":"#N/A"},{"$error":"#N/A"},{"$error":"#N/A"},{"$error":"#N/A"},{"$error":"#N/A"},{"$error":"#N/A"},null,2.5832354560268049,2.5832354560268049,2.6199286263838606,2.6881111413207601,2.7758794050679065,2.8665586628186768,{"$error":"#N/A"},{"$error":"#N/A"},{"$error":"#N/A"},{"$error":"#N/A"},{"$error":"#N/A"},{"$error":"#N/A"},null,270,270,270,270,270,270,270,270,270,270,270,270,null,1960,61,"2031-10-07",270,270,0,0,null,"2031-10-07",null,0,0,null,null,null,null,270,270,270,270,270,270,270,270,270,270,270,270,270,270,270,270,270,270,270,270,270,270,270,270,270,270,270,270,270,270,270,270,270,270,270,270,0,0,0,0,0,0,0,0,0,0,0,0,0,0,0,0,0,0,0,0,0,0,0,0,0,0,0,0,0,0,0,0,0,0,0,0,0,0,0,0,0,0]
["2006-04-14","sexta-feira","Paixão de Cristo",null,null,1991,62,"2031-11-07",0,0,0,0,"2031-08-07",null,null,null,null,null,62,270,84.766323436234913,84.766323436234913,85.989554033795542,88.263253498690815,91.19142391161985,94.218250522813278,{"$error":"#N/A"},{"$error":"#N/A"},{"$error":"#N/A"},{"$error":"#N/A"},{"$error":"#N/A"},{"$error":"#N/A"},null,2.5370560604465111,2.5370560604465111,2.5736673522315008,2.6417191772158164,2.7293593176747821,2.8199522381478013,{"$error":"#N/A"},{"$error":"#N/A"},{"$error":"#N/A"},{"$error":"#N/A"},{"$error":"#N/A"},{"$error":"#N/A"},null,270,270,270,270,270,270,270,270,270,270,270,270,null,1991,62,"2031-11-07",0,270,0,0,null,"2031-11-07",null,0,0,null,null,null,null,270,270,270,270,270,270,270,270,270,270,270,270,270,270,270,270,270,270,270,270,270,270,270,270,270,270,270,270,270,270,270,270,270,270,270,0,0,0,0,0,0,0,0,0,0,0,0,0,0,0,0,0,0,0,0,0,0,0,0,0,0,0,0,0,0,0,0,0,0,0,0,0,0,0,0,0,0,0]
["2006-04-21","sexta-feira","Tiradentes",null,null,2021,63,"2031-12-07",0,0,0,0,"2031-09-07",null,null,null,null,null,63,270,83.299448327271875,83.299448327271875,84.519755485895573,86.788713260397003,89.712071846865015,92.735411296187351,{"$error":"#N/A"},{"$error":"#N/A"},{"$error":"#N/A"},{"$error":"#N/A"},{"$error":"#N/A"},{"$error":"#N/A"},null,2.4931524884352472,2.4931524884352472,2.5296762816928546,2.5975861878836821,2.6850823103766701,2.7755708600948874,{"$error":"#N/A"},{"$error":"#N/A"},{"$error":"#N/A"},{"$error":"#N/A"},{"$error":"#N/A"},{"$error":"#N/A"},null,270,270,270,270,270,270,270,270,270,270,270,270,null,2021,63,"2031-12-07",0,0,0,0,null,"2031-12-07",null,0,0,null,null,null,null,270,270,270,270,270,270,270,270,270,270,270,270,270,270,270,270,270,270,270,270,270,270,270,270,270,270,270,270,270,270,270,270,270,270,0,0,0,0,0,0,0,0,0,0,0,0,0,0,0,0,0,0,0,0,0,0,0,0,0,0,0,0,0,0,0,0,0,0,0,0,0,0,0,0,0,0,0,0]
["2006-05-01","segunda-feira","Dia do Trabalho",null,null,2052,64,"2032-01-07",0,0,0,0,"2031-10-07",null,null,null,null,null,64,270,81.810339710807668,81.810339710807668,83.027351631665297,85.290896146960094,88.208615531394344,91.22765706217892,{"$error":"#N/A"},{"$error":"#N/A"},{"$error":"#N/A"},{"$error":"#N/A"},{"$error":"#N/A"},{"$error":"#N/A"},null,2.4485834675444735,2.4485834675444735,2.4850086343357423,2.5527565216785155,2.6400838628546328,2.7304437758710152,{"$error":"#N/A"},{"$error":"#N/A"},{"$error":"#N/A"},{"$error":"#N/A"},{"$error":"#N/A"},{"$error":"#N/A"},null,270,270,270,270,270,270,270,270,270,270,270,270,null,2052,64,"2032-01-07",0,0,0,0,null,"2032-01-07",null,0,0,null,null,null,null,270,270,270,270,270,270,270,270,270,270,270,270,270,270,270,{"$f":"IF($G99>CM$33,0,$I$9)","v":270},270,270,270,270,270,270,270,270,270,270,270,270,270,270,270,270,270,0,0,0,0,0,0,0,0,0,0,0,0,0,0,0,0,0,0,0,0,0,0,0,0,0,0,0,0,0,0,0,0,0,0,0,0,0,0,0,0,0,0,0,0,0]
["2006-06-15","quinta-feira","Corpus Christi",null,null,2083,65,"2032-02-07",0,0,0,0,"2031-11-07",null,null,null,null,null,65,{"$f":"IF($G100>$P$3,0,$J$9)","v":270},{"$f":"$T100/((U$29)^($H100-$H$35))","v":80.34785125229358},80.34785125229358,81.561299832659486,83.81892866328522,86.730355166100665,89.744416903197447,{"$error":"#N/A"},{"$error":"#N/A"},{"$error":"#N/A"},{"$error":"#N/A"},{"$error":"#N/A"},{"$error":"#N/A"},null,2.4048111879811471,2.4048111879811471,2.4411297039914985,2.5087005348921267,2.5958395301213928,2.6860503979126995,{"$error":"#N/A"},{"$error":"#N/A"},{"$error":"#N/A"},{"$error":"#N/A"},{"$error":"#N/A"},{"$error":"#N/A"},null,{"$f":"$T100","v":270},270,270,270,270,270,270,270,270,270,270,270,null,2083,65,"2032-02-07",0,0,0,0,null,"2032-02-07",null,0,0,null,null,null,null,{"$f":"IF($G100>BX$33,0,$I$9)","v":270},270,270,270,270,270,270,270,270,270,270,270,270,270,270,270,270,270,270,270,270,270,270,270,270,270,270,270,270,270,270,270,0,0,0,0,0,0,0,0,0,0,0,0,0,0,0,0,0,0,0,0,0,0,0,0,0,0,0,0,{"$f":"IF($G100>EF$33,0,$I$9)","v":0},0,0,0,0,0,0,0,0,0,0,0,0,0,0,0,0,0]
["2006-09-07","quinta-feira","Independência do Brasil",null,null,{"$f":"H101-$H$35","v":2112},66,"2032-03-07",0,{"$f":"I101/($J$32^(M101-$M$35))","v":0},{"$f":"I101/($I$32^(M101-$M$35))","v":0},{"$f":"J101*0.0082%*MIN(F101,365)","v":0},"2031-12-07",null,null,null,null,null,{"$f":"S100+1","v":66},270,79.003394630359068,79.003394630359068,80.213276412664541,82.4649333749649,85.369902359201333,88.378709262734745,{"$error":"#N/A"},{"$error":"#N/A"},{"$error":"#N/A"},{"$error":"#N/A"},{"$f":"IF($I101<>0,$J101,$T101/((AE$29)^($H101-$H$35)))","v":{"$error":"#N/A"}},{"$error":"#N/A"},null,{"$f":"IF($I101<>0,0,U101*$B$1*MIN($F101,365))","v":2.3645716012866469},2.3645716012866469,2.4007833630310498,2.4681754559126996,2.555121177610896,2.6451747682336513,{"$error":"#N/A"},{"$error":"#N/A"},{"$error":"#N/A"},{"$error":"#N/A"},{"$error":"#N/A"},{"$error":"#N/A"},null,270,270,270,270,270,270,270,270,270,270,270,270,null,{"$f":"BJ101-$H$35","v":2112},66,"2032-03-07",0,0,{"$f":"I102","v":0},{"$f":"BM102","v":0},null,{"$f":"BJ101","v":"2032-03-07"},null,{"$f":"IF(I101=0,0,PMT($BR$31,$I$10,$BR$35))","v":0},{"$f":"MIN(BR101,$I$9)","v":0},null,null,null,null,270,270,270,270,270,270,270,270,270,270,270,270,270,270,270,270,270,270,270,270,270,270,270,270,270,270,270,270,270,270,270,0,0,0,0,0,0,0,0,{"$f":"IF($G101>DK$33,0,$I$9)","v":0},0,0,0,0,0,0,0,0,0,0,0,0,0,0,0,0,0,0,0,0,0,0,0,0,0,0,0,0,0,0,0,0,0,0,0,0,0,0]
["2006-10-12","quinta-feira","Nossa Sr.a Aparecida - Padroeira do Brasil",null,null,2143,{"$f":"G101+1","v":67},{"$f":"EDATE(H101,1)","v":"2032-04-07"},{"$f":"IF($G102>$I$10,0,$I$9)","v":0},0,0,0,{"$f":"EDATE(M101,1)","v":"2032-01-07"},null,null,null,null,null,67,270,77.591084728716282,77.591084728716282,78.79691402270619,81.041736926633419,83.939215092585258,86.941789199249072,{"$error":"#N/A"},{"$error":"#N/A"},{"$error":"#N/A"},{"$error":"#N/A"},{"$error":"#N/A"},{"$error":"#N/A"},null,2.3223011659304786,2.3223011659304786,2.3583916366995963,2.4255791862141383,2.5123007077210771,2.6021677507335248,{"$error":"#N/A"},{"$error":"#N/A"},{"$error":"#N/A"},{"$error":"#N/A"},{"$error":"#N/A"},{"$error":"#N/A"},null,270,270,270,270,270,270,270,270,270,270,270,270,null,2143,{"$f":"BI101+1","v":67},{"$f":"EDATE(BJ101,1)","v":"2032-04-07"},{"$f":"I101","v":0},{"$f":"BK101","v":0},0,0,null,"2032-04-07",null,0,0,null,null,null,null,270,270,270,270,270,270,270,270,270,270,270,270,270,270,270,270,270,270,270,270,270,270,270,270,270,270,270,270,270,270,0,0,0,0,0,0,0,0,0,0,0,0,0,0,0,0,0,0,0,0,0,0,0,0,0,0,0,0,0,0,0,0,0,0,0,0,0,0,0,0,0,0,0,0,0,0,0,0]
["2006-11-02","quinta-feira","Finados",null,null,2173,68,"2032-05-07",0,0,0,0,"2032-02-07",null,null,null,null,null,68,270,76.248376607706206,76.248376607706206,77.450057522391589,79.687840516262412,82.577511921007797,85.573469423172639,{"$error":"#N/A"},{"$error":"#N/A"},{"$error":"#N/A"},{"$error":"#N/A"},{"$error":"#N/A"},{"$error":"#N/A"},null,2.2821139118686466,2.2821139118686466,2.3180802216451801,2.3850570666517341,2.4715449317957634,2.5612139398355573,{"$error":"#N/A"},{"$error":"#N/A"},{"$error":"#N/A"},{"$error":"#N/A"},{"$error":"#N/A"},{"$error":"#N/A"},null,270,270,270,270,270,270,270,270,270,270,270,270,null,2173,68,"2032-05-07",0,0,0,0,null,"2032-05-07",null,0,0,null,null,null,null,270,270,270,270,270,270,270,270,270,270,270,270,270,270,270,270,270,270,270,270,270,270,270,270,270,270,270,270,270,0,0,{"$f":"IF($G103>DC$33,0,$I$9)","v":0},0,0,0,0,0,0,0,0,0,0,0,0,0,0,0,0,0,0,0,0,0,0,0,0,0,0,0,0,0,0,0,0,0,0,0,0,0,0,0,0,0,0,0,0,0,0]
["2006-11-15","quarta-feira","Proclamação da República",null,null,2204,69,"2032-06-07",0,0,0,0,"2032-03-07",null,null,null,null,null,69,270,74.885316985128043,74.885316985128043,76.082486548099524,78.312571696456644,81.193621444981176,84.182158821988253,{"$error":"#N/A"},{"$error":"#N/A"},{"$error":"#N/A"},{"$error":"#N/A"},{"$error":"#N/A"},{"$error":"#N/A"},null,2.2413175373648824,2.2413175373648824,2.2771488223846186,2.3438952708749476,2.4301250898482865,2.5195720135421085,{"$error":"#N/A"},{"$error":"#N/A"},{"$error":"#N/A"},{"$error":"#N/A"},{"$error":"#N/A"},{"$error":"#N/A"},null,270,270,270,270,270,270,270,270,270,270,270,270,null,2204,69,"2032-06-07",0,0,0,0,null,"2032-06-07",null,0,0,null,null,null,null,270,270,270,270,270,270,270,270,270,270,270,270,270,270,270,270,270,270,270,270,270,270,270,270,270,270,270,270,0,0,0,0,0,0,0,0,0,0,0,0,0,0,0,0,0,0,0,0,0,0,0,0,0,0,0,0,0,0,0,0,0,0,0,0,0,0,0,0,0,0,0,0,0,0,0,0,0,0]
["2006-12-25","segunda-feira","Natal",null,null,2234,70,"2032-07-07",0,0,0,0,"2032-04-07",null,null,null,null,null,70,270,73.589431979629069,73.589431979629069,74.782027096884477,77.004269163371262,79.876458641974963,82.857271057774511,{"$error":"#N/A"},{"$error":"#N/A"},{"$error":"#N/A"},{"$error":"#N/A"},{"$error":"#N/A"},{"$error":"#N/A"},null,2.2025316991502981,2.2025316991502981,2.2382260710097523,2.3047377760597016,2.3907024071543108,2.4799181227591909,{"$error":"#N/A"},{"$error":"#N/A"},{"$error":"#N/A"},{"$error":"#N/A"},{"$error":"#N/A"},{"$error":"#N/A"},null,270,270,270,270,270,270,270,270,270,270,270,270,null,2234,70,"2032-07-07",0,0,0,0,null,"2032-07-07",null,0,0,null,null,null,null,270,270,270,270,270,270,270,270,270,270,270,270,270,270,270,270,270,270,270,270,270,270,270,270,270,270,270,0,0,0,0,0,0,0,0,0,0,0,0,0,0,0,0,0,0,0,0,0,0,0,0,0,0,0,0,0,0,0,0,0,0,0,0,0,0,0,0,0,0,0,0,0,0,0,0,0,0,0]
["2007-01-01","segunda-feira","Confraternização Universal",null,null,2265,71,"2032-08-07",0,0,0,0,"2032-05-07",null,null,null,null,null,71,270,72.273905173124476,72.273905173124476,73.461566752140996,75.675313959086296,78.537834265896606,81.510122223153658,{"$error":"#N/A"},{"$error":"#N/A"},{"$error":"#N/A"},{"$error":"#N/A"},{"$error":"#N/A"},{"$error":"#N/A"},null,2.1631579818316156,2.1631579818316156,2.1987046928915799,2.2649621467954528,2.3506373795782856,2.4395979581389891,{"$error":"#N/A"},{"$error":"#N/A"},{"$error":"#N/A"},{"$error":"#N/A"},{"$error":"#N/A"},{"$error":"#N/A"},null,270,270,270,270,270,270,270,270,270,270,270,270,null,2265,71,"2032-08-07",0,0,0,0,null,"2032-08-07",null,0,0,null,null,null,null,270,270,270,270,270,270,270,270,270,270,270,270,270,270,270,270,270,270,270,270,270,270,270,270,270,270,0,0,0,0,0,0,0,0,0,0,0,0,0,0,0,0,0,0,0,0,0,0,0,0,0,0,0,0,0,0,0,0,0,0,0,0,0,0,0,0,0,0,0,0,0,0,0,0,0,0,0,0]
["2007-02-19","segunda-feira","Carnaval",null,null,2296,72,"2032-09-07",0,0,0,0,"2032-06-07",null,null,null,null,null,72,270,70.981895476781972,70.981895476781972,72.164422377687799,74.369294131686104,77.221643473513538,80.184876233744234,{"$error":"#N/A"},{"$error":"#N/A"},{"$error":"#N/A"},{"$error":"#N/A"},{"$error":"#N/A"},{"$error":"#N/A"},null,2.1244881316200845,2.1244881316200845,2.1598811617641962,2.2258729733613651,2.3112437891622601,2.3999333456759651,{"$error":"#N/A"},{"$error":"#N/A"},{"$error":"#N/A"},{"$error":"#N/A"},{"$error":"#N/A"},{"$error":"#N/A"},null,270,270,270,270,270,270,270,270,270,270,270,270,null,2296,72,"2032-09-07",0,0,0,0,null,"2032-09-07",null,0,0,null,null,null,null,270,270,270,270,270,270,270,270,270,270,270,270,270,270,270,270,270,270,270,270,270,270,270,270,270,0,0,0,0,0,0,0,0,0,0,0,0,0,0,0,0,0,0,0,0,0,0,0,0,0,0,0,0,0,0,0,0,0,0,0,0,0,0,0,0,0,0,0,0,0,0,0,0,0,0,0,0,0]
["2007-02-20","terça-feira","Carnaval",null,null,2326,73,"2032-10-07",0,0,0,0,"2032-07-07",null,null,null,null,null,73,270,69.75355889875128,69.75355889875128,70.93093344507767,73.126868633601504,75.968916047883894,78.922899077495231,{"$error":"#N/A"},{"$error":"#N/A"},{"$error":"#N/A"},{"$error":"#N/A"},{"$error":"#N/A"},{"$error":"#N/A"},null,2.0877240178396259,2.0877240178396259,2.1229628380111749,2.188687178203693,2.2737496573131653,2.362162369389432,{"$error":"#N/A"},{"$error":"#N/A"},{"$error":"#N/A"},{"$error":"#N/A"},{"$error":"#N/A"},{"$error":"#N/A"},null,270,270,270,270,270,270,270,270,270,270,270,270,null,2326,73,"2032-10-07",0,0,0,0,null,"2032-10-07",null,0,0,null,null,null,null,270,270,270,270,270,270,270,270,270,270,270,270,270,270,270,270,270,270,270,270,270,270,270,270,0,0,0,0,0,0,0,0,0,0,0,0,0,0,0,0,0,0,0,0,0,0,0,0,0,0,0,{"$f":"IF($G108>DW$33,0,$I$9)","v":0},0,0,0,0,0,0,0,0,0,0,0,0,0,0,0,0,0,0,0,0,0,0,0,0,0,0]
["2007-04-06","sexta-feira","Paixão de Cristo",null,null,2357,74,"2032-11-07",0,0,0,0,"2032-08-07",null,null,null,null,null,74,270,68.506604354981917,68.506604354981917,69.67847361661488,71.864830389494443,74.695776945638954,77.639717889413205,{"$error":"#N/A"},{"$error":"#N/A"},{"$error":"#N/A"},{"$error":"#N/A"},{"$error":"#N/A"},{"$error":"#N/A"},null,2.050402668344609,2.050402668344609,2.0854767153452833,2.1509143735575686,2.235644603982974,2.3237567564301371,{"$error":"#N/A"},{"$error":"#N/A"},{"$error":"#N/A"},{"$error":"#N/A"},{"$error":"#N/A"},{"$error":"#N/A"},null,270,270,270,270,270,270,270,270,270,270,270,270,null,2357,74,"2032-11-07",0,0,0,0,null,"2032-11-07",null,0,0,null,null,null,null,270,270,270,270,270,270,270,270,270,270,270,270,270,270,270,270,270,270,270,270,270,270,270,0,0,0,0,0,0,0,0,{"$f":"IF($G109>DC$33,0,$I$9)","v":0},0,0,0,0,0,0,0,0,0,0,0,0,0,0,0,0,0,0,0,0,0,0,0,0,0,0,0,0,0,0,0,0,0,0,0,0,0,0,0,0,0,0,0,0,0,0]
["2007-04-21","sábado","Tiradentes",null,null,2387,75,"2032-12-07",0,0,0,0,"2032-09-07",null,null,null,null,null,75,270,67.321102511157136,67.321102511157136,68.487476401984154,70.664244869167575,73.484025367331611,76.417797310419715,{"$error":"#N/A"},{"$error":"#N/A"},{"$error":"#N/A"},{"$error":"#N/A"},{"$error":"#N/A"},{"$error":"#N/A"},null,2.0149205981589331,2.0149205981589331,2.0498301687113858,2.1149808489341857,2.1993768792442352,2.2871846735008621,{"$error":"#N/A"},{"$error":"#N/A"},{"$error":"#N/A"},{"$error":"#N/A"},{"$error":"#N/A"},{"$error":"#N/A"},null,270,270,270,270,270,270,270,270,270,270,270,270,null,2387,75,"2032-12-07",0,0,0,0,null,"2032-12-07",null,0,0,null,null,null,null,270,270,270,270,270,270,270,270,270,270,270,270,270,270,270,270,270,270,270,270,270,270,0,0,0,0,0,0,0,0,0,0,0,0,0,0,0,0,0,0,0,0,0,0,0,0,0,0,0,0,0,0,0,0,0,0,0,0,0,0,0,0,0,0,0,0,0,0,0,0,0,0,0,0,0,0,0,0]
["2007-05-01","terça-feira","Dia do Trabalho",null,null,2418,76,"2033-01-07",0,0,0,0,"2032-10-07",null,null,null,null,null,76,270,66.117631950039254,66.117631950039254,67.278161808476113,69.444707082548121,72.252529764228115,75.175345739461704,{"$error":"#N/A"},{"$error":"#N/A"},{"$error":"#N/A"},{"$error":"#N/A"},{"$error":"#N/A"},{"$error":"#N/A"},null,1.978900724264675,1.978900724264675,2.0136353829276903,2.0784800829806653,2.1625182158433476,2.2499980979820888,{"$error":"#N/A"},{"$error":"#N/A"},{"$error":"#N/A"},{"$error":"#N/A"},{"$error":"#N/A"},{"$error":"#N/A"},null,270,270,270,270,270,270,270,270,270,270,270,270,null,2418,76,"2033-01-07",0,0,0,0,null,"2033-01-07",null,0,0,null,null,null,null,270,270,270,270,270,270,270,270,270,270,270,270,270,270,270,270,270,270,270,270,270,0,0,0,0,0,0,0,0,0,0,0,0,0,0,0,0,0,0,0,0,0,0,0,0,0,0,0,0,0,0,0,0,0,0,0,0,0,0,0,0,0,0,0,0,0,0,0,0,0,0,0,0,0,0,0,0,0]
["2007-06-07","quinta-feira","Corpus Christi",null,null,2449,77,"2033-02-07",0,0,0,0,"2032-11-07",null,null,null,null,null,77,270,64.935675317503211,64.935675317503211,66.090200634058704,68.246216324956507,71.041672407503754,73.953094775698716,{"$error":"#N/A"},{"$error":"#N/A"},{"$error":"#N/A"},{"$error":"#N/A"},{"$error":"#N/A"},{"$error":"#N/A"},null,1.9435247622528711,1.9435247622528711,1.9780797049773771,2.0426092546059484,2.1262772551565874,2.2134161266366625,{"$error":"#N/A"},{"$error":"#N/A"},{"$error":"#N/A"},{"$error":"#N/A"},{"$error":"#N/A"},{"$error":"#N/A"},null,270,270,270,270,270,270,270,270,270,270,270,270,null,2449,77,"2033-02-07",0,0,0,0,null,"2033-02-07",null,0,0,null,null,null,null,270,270,270,270,270,270,270,270,270,270,270,270,270,270,270,270,270,270,270,270,0,0,0,0,0,0,0,0,0,0,0,0,0,0,0,0,0,0,0,0,0,0,0,0,0,0,0,0,0,0,0,0,0,0,0,0,0,0,0,0,0,0,0,0,0,0,0,0,0,0,0,0,0,0,0,0,0,0]
["2007-09-07","sexta-feira","Independência do Brasil",null,null,2477,78,"2033-03-07",0,0,0,0,"2032-12-07",null,null,null,null,null,78,270,63.886273222150152,63.886273222150152,65.035243403184353,67.181496651637516,69.965445998153228,72.866215717720252,{"$error":"#N/A"},{"$error":"#N/A"},{"$error":"#N/A"},{"$error":"#N/A"},{"$error":"#N/A"},{"$error":"#N/A"},null,1.9121161575389543,1.9121161575389543,1.9465048350573078,2.0107421947835111,2.0940657987247264,2.1808858364313668,{"$error":"#N/A"},{"$error":"#N/A"},{"$error":"#N/A"},{"$error":"#N/A"},{"$error":"#N/A"},{"$error":"#N/A"},null,270,270,270,270,270,270,270,270,270,270,270,270,null,2477,78,"2033-03-07",0,0,0,0,null,"2033-03-07",null,0,0,null,null,null,null,270,270,270,270,270,270,270,270,270,270,270,270,270,270,270,270,270,270,270,0,0,0,0,0,0,0,0,0,0,0,0,0,0,0,0,0,0,0,0,0,0,0,0,0,0,0,0,0,0,0,0,0,0,0,0,0,0,0,0,0,0,0,0,0,0,0,0,0,0,0,0,0,0,0,0,0,0,0]
["2007-10-12","sexta-feira","Nossa Sr.a Aparecida - Padroeira do Brasil",null,null,2508,79,"2033-04-07",0,0,0,0,"2033-01-07",null,null,null,null,null,79,270,62.744205635398295,62.744205635398295,63.886886461570697,66.022064836014039,68.792917156882012,71.681508131600111,{"$error":"#N/A"},{"$error":"#N/A"},{"$error":"#N/A"},{"$error":"#N/A"},{"$error":"#N/A"},{"$error":"#N/A"},null,1.8779340746674709,1.8779340746674709,1.912134511794811,1.9760404005419001,2.0589720105054785,2.1454275383787915,{"$error":"#N/A"},{"$error":"#N/A"},{"$error":"#N/A"},{"$error":"#N/A"},{"$error":"#N/A"},{"$error":"#N/A"},null,270,270,270,270,270,270,270,270,270,270,270,270,null,2508,79,"2033-04-07",0,0,0,0,null,"2033-04-07",null,0,0,null,null,null,null,270,270,270,270,270,270,270,270,270,270,270,270,270,270,270,270,270,270,0,0,0,0,0,0,0,0,0,0,0,0,0,0,0,0,0,0,0,0,0,0,0,0,0,0,0,0,0,0,0,0,0,0,0,0,0,0,0,0,0,0,0,0,0,0,0,{"$f":"IF($G114>EK$33,0,$I$9)","v":0},0,0,0,0,0,0,0,0,0,0,0,0]
["2007-11-02","sexta-feira","Finados",null,null,2538,80,"2033-05-07",0,0,0,0,"2033-02-07",null,null,null,null,null,80,270,61.658421685508536,61.658421685508536,62.794883438573734,64.919089505318937,67.676924669088734,70.553359906692194,{"$error":"#N/A"},{"$error":"#N/A"},{"$error":"#N/A"},{"$error":"#N/A"},{"$error":"#N/A"},{"$error":"#N/A"},null,1.8454365610472703,1.8454365610472703,1.879450861316512,1.9430283488941957,2.0255703553458257,2.1116620620072974,{"$error":"#N/A"},{"$error":"#N/A"},{"$error":"#N/A"},{"$error":"#N/A"},{"$error":"#N/A"},{"$error":"#N/A"},null,270,270,270,270,270,270,270,270,270,270,270,270,null,2538,80,"2033-05-07",0,0,0,0,null,"2033-05-07",null,0,0,null,null,null,null,270,270,270,270,270,270,270,270,270,270,270,270,270,270,270,270,{"$f":"IF($G115>CN$33,0,$I$9)","v":270},0,0,0,0,0,0,0,0,0,0,0,0,0,0,0,{"$f":"IF($G115>DD$33,0,$I$9)","v":0},0,0,0,0,0,0,0,0,0,0,0,0,0,0,0,0,0,0,0,0,0,0,0,0,0,0,0,0,0,0,0,0,0,0,0,0,0,0,0,0,0,0,0,0,0]
["2007-11-15","quinta-feira","Proclamação da República",null,null,2569,81,"2033-06-07",0,0,0,0,"2033-03-07",null,null,null,null,null,81,270,{"$f":"$T116/((U$29)^($H116-$H$35))","v":60.556180447982705},60.556180447982705,61.686085554210393,63.798702768416121,66.542748434935362,69.406256274584734,{"$error":"#N/A"},{"$error":"#N/A"},{"$error":"#N/A"},{"$error":"#N/A"},{"$error":"#N/A"},{"$error":"#N/A"},null,1.8124464808081224,1.8124464808081224,1.8462645406375171,1.9094951738586945,1.9916244606576152,2.0773292502983209,{"$error":"#N/A"},{"$error":"#N/A"},{"$error":"#N/A"},{"$error":"#N/A"},{"$error":"#N/A"},{"$error":"#N/A"},null,{"$f":"$T116","v":270},270,270,270,270,270,270,270,270,270,270,270,null,2569,81,"2033-06-07",0,0,0,0,null,"2033-06-07",null,0,0,null,null,null,null,{"$f":"IF($G116>BX$33,0,$I$9)","v":270},270,270,270,270,270,270,270,270,270,270,270,270,270,270,270,0,0,0,0,0,0,0,0,0,0,0,0,0,0,0,0,0,0,0,0,0,0,0,0,0,0,0,0,0,0,0,0,0,0,0,0,0,0,0,0,0,0,0,0,0,0,0,0,0,0,0,0,0,0,0,0,0,0,0,0,0,0]
["2007-12-25","terça-feira","Natal",null,null,2599,82,"2033-07-07",0,0,0,0,"2033-04-07",null,null,null,null,null,82,270,59.508260116038109,59.508260116038109,60.631700286232608,62.732871285279465,65.463259289255504,68.313916745819199,{"$error":"#N/A"},{"$error":"#N/A"},{"$error":"#N/A"},{"$error":"#N/A"},{"$f":"IF($I117<>0,$J117,$T117/((AE$29)^($H117-$H$35)))","v":{"$error":"#N/A"}},{"$error":"#N/A"},null,1.7810822252730207,1.7810822252730207,1.814706789566942,1.8775948375684146,1.9593153505274172,2.0446355282023689,{"$error":"#N/A"},{"$error":"#N/A"},{"$error":"#N/A"},{"$error":"#N/A"},{"$error":"#N/A"},{"$error":"#N/A"},null,270,270,270,270,270,270,270,270,270,270,270,270,null,2599,82,"2033-07-07",0,0,0,0,null,"2033-07-07",null,0,0,null,null,null,null,270,270,270,270,270,270,270,270,270,270,270,270,270,270,270,0,0,0,0,0,0,0,0,0,0,0,0,0,0,0,0,0,0,0,0,0,0,0,0,0,0,0,0,0,0,0,0,0,0,0,0,0,0,0,0,0,0,0,0,0,0,0,0,0,0,0,0,0,0,0,0,0,0,0,0,0,0,0]
["2008-01-01","terça-feira","Confraternização Universal",null,null,2630,83,"2033-08-07",0,0,0,0,"2033-05-07",null,null,null,null,null,83,270,58.444456397417653,58.444456397417653,59.561098712961289,61.650214743244952,64.366181174977569,67.20322347584235,{"$error":"#N/A"},{"$error":"#N/A"},{"$error":"#N/A"},{"$error":"#N/A"},{"$error":"#N/A"},{"$error":"#N/A"},null,1.7492425799747104,1.7492425799747104,1.7826636844789314,1.8451909272653215,1.9264798025670786,2.0113924786319615,{"$error":"#N/A"},{"$error":"#N/A"},{"$error":"#N/A"},{"$error":"#N/A"},{"$error":"#N/A"},{"$error":"#N/A"},null,270,270,270,270,270,270,270,270,270,270,270,270,null,2630,83,"2033-08-07",0,0,0,0,null,"2033-08-07",null,0,0,null,null,null,null,270,270,270,270,270,270,270,270,270,270,270,270,270,270,0,0,0,0,0,0,0,0,0,0,0,0,0,0,0,0,0,0,0,0,0,0,0,0,0,0,0,0,0,0,0,0,0,0,0,0,0,0,0,0,0,0,0,0,0,0,0,0,0,0,0,0,0,0,0,0,0,0,0,0,0,0,0,0]
["2008-02-04","segunda-feira","Carnaval",null,null,2661,84,"2033-09-07",0,0,0,0,"2033-06-07",null,null,null,null,null,84,270,57.399669842961366,57.399669842961366,58.509401239744555,60.586242906118649,63.287488646780986,66.110588598631395,{"$error":"#N/A"},{"$error":"#N/A"},{"$error":"#N/A"},{"$error":"#N/A"},{"$error":"#N/A"},{"$error":"#N/A"},null,1.7179721183998338,1.7179721183998338,1.7511863791055546,1.8133462501801312,1.8941945351981548,1.9786899167570375,{"$error":"#N/A"},{"$error":"#N/A"},{"$error":"#N/A"},{"$error":"#N/A"},{"$error":"#N/A"},{"$error":"#N/A"},null,270,270,270,270,270,270,270,270,270,270,270,270,null,2661,84,"2033-09-07",0,0,0,0,null,"2033-09-07",null,0,0,null,null,null,null,270,270,270,270,270,270,270,270,270,270,270,270,270,0,0,0,0,0,0,0,0,0,0,0,0,0,0,0,0,0,0,0,0,0,0,0,0,0,0,0,0,0,0,0,0,0,0,0,0,0,0,0,0,0,0,0,0,0,0,0,0,0,0,0,0,0,0,0,0,0,0,0,0,0,0,0,0,0]
["2008-02-05","terça-feira","Carnaval",null,null,2691,85,"2033-10-07",0,0,0,0,"2033-07-07",null,null,null,null,null,85,270,56.406372699212106,56.406372699212106,57.509314264681578,59.57407929883172,62.260807924112349,65.070117421068602,{"$error":"#N/A"},{"$error":"#N/A"},{"$error":"#N/A"},{"$error":"#N/A"},{"$error":"#N/A"},{"$error":"#N/A"},null,1.6882427348874183,1.6882427348874183,1.7212537759419198,1.7830521934140333,1.8634659811686827,1.9475486144125833,{"$error":"#N/A"},{"$error":"#N/A"},{"$error":"#N/A"},{"$error":"#N/A"},{"$error":"#N/A"},{"$error":"#N/A"},null,270,270,270,270,270,270,270,270,270,270,270,270,null,2691,85,"2033-10-07",0,0,0,0,null,"2033-10-07",null,0,0,null,null,null,null,270,270,270,270,270,270,270,270,270,270,270,270,0,0,0,0,0,0,0,0,0,0,0,0,0,0,0,0,0,0,0,0,0,0,0,0,0,0,0,0,0,0,0,0,0,0,0,0,0,0,0,0,0,0,0,0,0,{"$f":"IF($G120>EC$33,0,$I$9)","v":0},0,0,0,0,0,0,0,0,0,0,0,0,0,0,0,0,0,0,0,0]
["2008-03-21","sexta-feira","Paixão de Cristo",null,null,2722,86,"2033-11-07",0,0,0,0,"2033-08-07",null,null,null,null,null,86,270,55.398020095484384,55.398020095484384,56.493846084853814,58.545937825834969,61.21739868215888,64.012164006318642,{"$error":"#N/A"},{"$error":"#N/A"},{"$error":"#N/A"},{"$error":"#N/A"},{"$error":"#N/A"},{"$error":"#N/A"},null,1.6580627414578475,1.6580627414578475,1.6908608133196747,1.7522799191272407,1.8322367425570154,1.915884068709117,{"$error":"#N/A"},{"$error":"#N/A"},{"$error":"#N/A"},{"$error":"#N/A"},{"$error":"#N/A"},{"$error":"#N/A"},null,270,270,270,270,270,270,270,270,270,270,270,270,null,2722,86,"2033-11-07",0,0,0,0,null,"2033-11-07",null,0,0,null,null,null,null,270,270,270,270,270,270,270,270,270,270,270,0,0,0,0,0,0,0,0,0,0,0,0,0,0,0,0,0,0,0,0,0,{"$f":"IF($G121>DD$33,0,$I$9)","v":0},0,0,0,0,0,0,0,0,0,0,0,0,0,0,0,0,0,0,0,0,0,0,0,0,0,0,0,0,0,0,0,0,0,0,0,0,0,0,0,0,0,0,0,0,0]
["2008-04-21","segunda-feira","Tiradentes",null,null,2752,87,"2033-12-07",0,0,0,0,"2033-09-07",null,null,null,null,null,87,270,54.439361356143991,54.439361356143991,55.528210504185871,57.567859886365831,60.224299975561841,63.004718556598718,{"$error":"#N/A"},{"$error":"#N/A"},{"$error":"#N/A"},{"$error":"#N/A"},{"$error":"#N/A"},{"$error":"#N/A"},null,1.6293700853893895,1.6293700853893895,1.661959340390283,1.7230060463989294,1.8025132982685659,1.8857312263989998,{"$error":"#N/A"},{"$error":"#N/A"},{"$error":"#N/A"},{"$error":"#N/A"},{"$error":"#N/A"},{"$error":"#N/A"},null,270,270,270,270,270,270,270,270,270,270,270,270,null,2752,87,"2033-12-07",0,0,0,0,null,"2033-12-07",null,0,0,null,null,null,null,270,270,270,270,270,270,270,270,270,270,0,0,0,0,0,0,0,0,0,0,0,0,0,0,0,0,0,0,0,0,0,0,0,0,0,0,0,0,0,0,0,0,0,0,0,0,0,0,0,0,0,0,0,0,0,0,0,0,0,0,0,0,0,0,0,0,0,0,0,0,0,0,0,0,0,0,0,0]
["2008-05-01","quinta-feira","Dia do Trabalho",null,null,2783,88,"2034-01-07",0,0,0,0,"2033-10-07",null,null,null,null,null,88,270,53.466172173044676,53.466172173044676,54.547723576620328,56.574342152521488,59.215019927971206,61.980345775603389,{"$error":"#N/A"},{"$error":"#N/A"},{"$error":"#N/A"},{"$error":"#N/A"},{"$error":"#N/A"},{"$error":"#N/A"},null,1.6002425331392272,1.6002425331392272,1.6326133666482463,1.6932700606249682,1.7723055464441781,1.8550717490638096,{"$error":"#N/A"},{"$error":"#N/A"},{"$error":"#N/A"},{"$error":"#N/A"},{"$error":"#N/A"},{"$error":"#N/A"},null,270,270,270,270,270,270,270,270,270,270,270,270,null,2783,88,"2034-01-07",0,0,0,0,null,"2034-01-07",null,0,0,null,null,null,null,270,270,270,270,270,270,270,270,270,0,0,0,0,0,0,0,0,0,0,0,0,0,0,0,0,0,0,0,0,0,0,0,0,0,0,0,0,0,0,0,0,0,0,0,0,0,0,0,0,0,0,0,0,0,0,0,0,0,0,0,0,0,0,0,0,0,0,0,0,0,0,0,0,0,0,0,0,0]
["2008-05-22","quinta-feira","Corpus Christi",null,null,2814,89,"2034-02-07",0,0,0,0,"2033-11-07",null,null,null,null,null,89,270,52.510380276807453,52.510380276807453,53.584549553727868,55.597970748059737,58.22265408635517,60.972627931229987,{"$error":"#N/A"},{"$error":"#N/A"},{"$error":"#N/A"},{"$error":"#N/A"},{"$error":"#N/A"},{"$error":"#N/A"},null,1.5716356816848471,1.5716356816848471,1.603785568143075,1.664047264489428,1.7426040368046101,1.8249107539817138,{"$error":"#N/A"},{"$error":"#N/A"},{"$error":"#N/A"},{"$error":"#N/A"},{"$error":"#N/A"},{"$error":"#N/A"},null,270,270,270,270,270,270,270,270,270,270,270,270,null,2814,89,"2034-02-07",0,0,0,0,null,"2034-02-07",null,0,0,null,null,null,null,270,270,270,270,270,270,270,270,0,0,0,0,0,0,0,0,0,0,0,0,0,0,0,0,0,0,0,0,0,0,0,0,0,0,0,0,0,0,0,0,0,0,0,0,0,0,0,0,0,0,0,0,0,0,0,0,0,0,0,0,0,0,0,0,0,0,0,0,0,0,0,0,0,0,0,0,0,0]
["2008-09-07","domingo","Independência do Brasil",null,null,2842,90,"2034-03-07",0,0,0,0,"2033-12-07",null,null,null,null,null,90,270,51.661778905976476,51.661778905976476,52.729212340759602,54.730578291162089,57.340625893229557,60.076521113667262,{"$error":"#N/A"},{"$error":"#N/A"},{"$error":"#N/A"},{"$error":"#N/A"},{"$error":"#N/A"},{"$error":"#N/A"},null,1.546237042655876,1.546237042655876,1.5781853253589351,1.6380862082544811,1.7162049329843607,1.798090276932061,{"$error":"#N/A"},{"$error":"#N/A"},{"$error":"#N/A"},{"$error":"#N/A"},{"$error":"#N/A"},{"$error":"#N/A"},null,270,270,270,270,270,270,270,270,270,270,270,270,null,2842,90,"2034-03-07",0,0,0,0,null,"2034-03-07",null,0,0,null,null,null,null,270,270,270,270,270,270,270,0,0,0,0,0,0,0,0,0,0,0,0,0,0,0,0,0,0,0,0,0,0,0,0,0,0,0,0,0,0,0,0,0,0,0,0,0,0,0,0,0,0,0,0,0,0,0,0,0,0,0,0,0,0,0,0,0,0,0,0,0,0,0,0,0,0,0,0,0,0,0]
["2008-10-12","domingo","Nossa Sr.a Aparecida - Padroeira do Brasil",null,null,2873,91,"2034-04-07",0,0,0,0,"2034-01-07",null,null,null,null,null,91,270,50.73824337656324,50.73824337656324,51.798148599797813,53.786026935194378,56.379672430028158,59.099756921784575,{"$error":"#N/A"},{"$error":"#N/A"},{"$error":"#N/A"},{"$error":"#N/A"},{"$error":"#N/A"},{"$error":"#N/A"},null,1.5185956242605378,1.5185956242605378,1.5503185875919485,1.6098157861703679,1.6874435958307428,1.7688557246690124,{"$error":"#N/A"},{"$error":"#N/A"},{"$error":"#N/A"},{"$error":"#N/A"},{"$error":"#N/A"},{"$error":"#N/A"},null,270,270,270,270,270,270,270,270,270,270,270,270,null,2873,91,"2034-04-07",0,0,0,0,null,"2034-04-07",null,0,0,null,null,null,null,270,270,270,270,270,270,0,0,0,0,0,0,0,0,0,0,0,0,0,0,0,0,0,0,0,0,0,0,0,0,0,0,0,0,0,0,0,0,0,0,0,0,0,0,0,0,0,0,0,0,0,0,0,0,0,0,0,{"$f":"IF($G126>EC$33,0,$I$9)","v":0},0,0,0,0,0,0,0,0,0,0,0,0,0,0,0,0,0,0,0,0]
["2008-11-02","domingo","Finados",null,null,2903,92,"2034-05-07",0,0,0,0,"2034-02-07",null,null,null,null,null,92,270,49.860221737019351,49.860221737019351,50.912775434983281,52.887468839609618,55.465053694604116,58.169624624046151,{"$error":"#N/A"},{"$error":"#N/A"},{"$error":"#N/A"},{"$error":"#N/A"},{"$error":"#N/A"},{"$error":"#N/A"},null,1.4923164365889892,1.4923164365889892,1.5238193687690496,1.5829219423695158,1.6600690570795011,1.7410168649977011,{"$error":"#N/A"},{"$error":"#N/A"},{"$error":"#N/A"},{"$error":"#N/A"},{"$error":"#N/A"},{"$error":"#N/A"},null,270,270,270,270,270,270,270,270,270,270,270,270,null,2903,92,"2034-05-07",0,0,0,0,null,"2034-05-07",null,0,0,null,null,null,null,270,270,270,270,270,0,0,0,0,0,0,0,0,0,0,0,0,0,0,0,0,0,0,0,0,0,0,0,0,0,0,0,{"$f":"IF($G127>DD$33,0,$I$9)","v":0},0,0,0,0,0,0,0,0,0,0,0,0,0,0,0,0,0,0,0,0,0,0,0,0,0,0,0,0,0,0,0,0,0,0,0,0,0,0,0,0,0,0,0,0,0]
["2008-11-15","sábado","Proclamação da República",null,null,2934,93,"2034-06-07",0,0,0,0,"2034-03-07",null,null,null,null,null,93,270,48.968891874716988,48.968891874716988,50.013785348560127,51.974726238199544,54.535532354294254,57.223864028479653,{"$error":"#N/A"},{"$error":"#N/A"},{"$error":"#N/A"},{"$error":"#N/A"},{"$error":"#N/A"},{"$error":"#N/A"},null,1.4656389338102795,1.4656389338102795,1.4969125954824045,1.5556035563093125,1.6322484833640272,1.7127102503723961,{"$error":"#N/A"},{"$error":"#N/A"},{"$error":"#N/A"},{"$error":"#N/A"},{"$error":"#N/A"},{"$error":"#N/A"},null,270,270,270,270,270,270,270,270,270,270,270,270,null,2934,93,"2034-06-07",0,0,0,0,null,"2034-06-07",null,0,0,null,null,null,null,270,270,270,270,0,0,0,0,0,0,0,0,0,0,0,0,0,0,0,0,0,0,0,0,0,0,0,0,0,0,0,0,0,0,0,0,0,0,0,0,0,0,0,0,0,0,0,0,0,0,0,0,0,0,0,0,0,0,0,0,0,0,0,0,0,0,0,0,0,0,0,0,0,0,0,0,0,0]
["2008-12-25","quinta-feira","Natal",null,null,2964,94,"2034-07-07",0,0,0,0,"2034-04-07",null,null,null,null,null,94,270,48.121488735207691,48.121488735207691,49.158911871121184,51.106428026037349,53.650830164875465,56.323255178180617,{"$error":"#N/A"},{"$error":"#N/A"},{"$error":"#N/A"},{"$error":"#N/A"},{"$error":"#N/A"},{"$error":"#N/A"},null,1.440276157844766,1.440276157844766,1.471326232302657,1.5296153908192978,1.6057693468347227,1.6857550274829458,{"$error":"#N/A"},{"$error":"#N/A"},{"$error":"#N/A"},{"$f":"IF($I129<>0,0,AD129*$B$1*MIN($F129,365))","v":{"$error":"#N/A"}},{"$error":"#N/A"},{"$error":"#N/A"},null,270,270,270,270,270,270,270,270,270,270,270,270,null,2964,94,"2034-07-07",0,0,0,0,null,"2034-07-07",null,0,0,null,null,null,null,270,270,270,0,0,0,0,0,0,0,0,0,0,0,0,0,0,0,0,0,0,0,0,0,0,0,0,0,0,0,0,0,0,0,0,0,0,0,0,0,0,0,0,0,0,0,0,0,0,0,0,0,0,0,0,0,0,0,0,0,0,0,0,0,0,0,0,0,0,0,0,0,0,0,0,0,0,0]
["2009-01-01","quinta-feira","Confraternização Universal",null,null,2995,95,"2034-08-07",0,0,0,0,"2034-05-07",null,null,null,null,null,95,270,47.261241459245568,47.261241459245568,48.290890553212037,50.224422986115187,52.751712824465429,55.40751408984049,{"$error":"#N/A"},{"$error":"#N/A"},{"$error":"#N/A"},{"$error":"#N/A"},{"$error":"#N/A"},{"$error":"#N/A"},null,1.41452895687522,1.41452895687522,1.4453463542576361,1.5032169799744277,1.5788587648362502,1.6583468967089259,{"$error":"#N/A"},{"$error":"#N/A"},{"$error":"#N/A"},{"$error":"#N/A"},{"$error":"#N/A"},{"$error":"#N/A"},null,270,270,270,270,270,270,270,270,270,270,270,270,null,2995,95,"2034-08-07",0,0,0,0,null,"2034-08-07",null,0,0,null,null,null,null,270,270,0,0,0,0,0,0,0,0,0,0,0,0,0,0,0,0,0,0,0,0,0,0,0,0,0,0,0,0,0,{"$f":"IF($G130>DC$33,0,$I$9)","v":0},0,0,0,0,0,0,0,0,0,0,0,0,0,0,0,0,0,0,0,0,0,0,0,0,0,0,0,0,0,0,0,0,0,0,0,0,0,0,0,0,0,0,0,0,0,0]
["2009-02-23","segunda-feira","Carnaval",null,null,3026,96,"2034-09-07",0,0,0,0,"2034-06-07",null,null,null,null,null,{"$f":"S130+1","v":96},270,46.416372455968919,46.416372455968919,47.438196283434436,49.357639767018597,51.867663507967464,54.506661731532432,{"$error":"#N/A"},{"$error":"#N/A"},{"$error":"#N/A"},{"$error":"#N/A"},{"$error":"#N/A"},{"$error":"#N/A"},null,1.3892420276071498,1.3892420276071498,1.4198252147631927,1.4772741582268667,1.5523991687934662,1.6313843856247656,{"$error":"#N/A"},{"$error":"#N/A"},{"$error":"#N/A"},{"$error":"#N/A"},{"$error":"#N/A"},{"$error":"#N/A"},null,270,270,270,270,270,270,270,270,270,270,270,270,null,3026,96,"2034-09-07",0,0,0,0,null,"2034-09-07",null,0,0,null,null,null,null,270,0,0,0,0,0,0,0,0,0,0,0,0,0,0,{"$f":"IF($G131>CM$33,0,$I$9)","v":0},0,0,0,0,0,0,0,0,0,0,0,0,0,0,0,0,0,0,0,0,0,0,0,0,0,0,0,0,0,0,0,0,0,0,0,0,0,0,0,0,0,0,0,0,0,0,0,0,0,0,0,0,0,0,0,0,0,0,0,0,0,0]
["2009-02-24","terça-feira","Carnaval",null,null,{"$f":"H132-$H$35","v":3056},97,"2034-10-07",0,0,0,{"$f":"J132*0.0082%*MIN(F132,365)","v":0},"2034-07-07",null,null,null,null,null,{"$f":"S131+1","v":97},270,45.613140480770227,45.613140480770227,46.627346723905603,48.533063026203592,51.02624079722127,53.648817145377883,{"$error":"#N/A"},{"$error":"#N/A"},{"$error":"#N/A"},{"$error":"#N/A"},{"$error":"#N/A"},{"$error":"#N/A"},null,{"$f":"IF($I132<>0,0,U132*$B$1*MIN($F132,365))","v":1.3652012945894529},{"$f":"IF($I132<>0,0,V132*$B$1*MIN($F132,365))","v":1.3652012945894529},{"$f":"IF($I132<>0,0,W132*$B$1*MIN($F132,365))","v":1.3955564874464947},{"$f":"IF($I132<>0,0,X132*$B$1*MIN($F132,365))","v":1.4525945763742736},{"$f":"IF($I132<>0,0,Y132*$B$1*MIN($F132,365))","v":1.5272153870608325},{"$f":"IF($I132<>0,0,Z132*$B$1*MIN($F132,365))","v":1.6057090971611601},{"$f":"IF($I132<>0,0,AA132*$B$1*MIN($F132,365))","v":{"$error":"#N/A"}},{"$f":"IF($I132<>0,0,AB132*$B$1*MIN($F132,365))","v":{"$error":"#N/A"}},{"$f":"IF($I132<>0,0,AC132*$B$1*MIN($F132,365))","v":{"$error":"#N/A"}},{"$f":"IF($I132<>0,0,AD132*$B$1*MIN($F132,365))","v":{"$error":"#N/A"}},{"$f":"IF($I132<>0,0,AE132*$B$1*MIN($F132,365))","v":{"$error":"#N/A"}},{"$f":"IF($I132<>0,0,AF132*$B$1*MIN($F132,365))","v":{"$error":"#N/A"}},null,270,270,270,270,270,270,270,270,270,270,270,270,null,{"$f":"BJ132-$H$35","v":3056},97,"2034-10-07",{"$f":"I131","v":0},{"$f":"BK131","v":0},{"$f":"I133","v":0},{"$f":"BM133","v":0},null,{"$f":"BJ132","v":"2034-10-07"},null,{"$f":"IF(I132=0,0,PMT($BR$31,$I$10,$BR$35))","v":0},{"$f":"MIN(BR132,$I$9)","v":0},null,null,null,null,{"$f":"IF($G132>BX$33,0,$I$9)","v":0},0,0,0,0,0,0,0,0,0,0,0,0,0,0,0,0,0,0,0,0,0,0,0,0,0,0,0,0,0,0,0,0,0,0,0,0,0,0,0,0,0,0,0,0,0,0,0,0,0,0,0,0,0,0,0,0,0,0,0,0,0,0,0,0,0,0,0,0,0,0,0,0,0,0,0,0,0]
["2009-04-10","sexta-feira","Paixão de Cristo",null,null,3087,98,"2034-11-07",0,0,0,0,"2034-08-07",null,null,null,null,null,98,270,{"$f":"$T133/((U$29)^($H133-$H$35))","v":44.79773387390955},44.79773387390955,45.804026405913191,47.695469638339276,50.171108122186624,52.776558856231631,{"$error":"#N/A"},{"$error":"#N/A"},{"$error":"#N/A"},{"$error":"#N/A"},{"$f":"IF($I133<>0,$J133,$T133/((AE$29)^($H133-$H$35)))","v":{"$error":"#N/A"}},{"$error":"#N/A"},null,1.3407961748461128,1.3407961748461128,1.3709145103289819,1.4275254062754945,1.5016212660970458,1.5796024065670129,{"$error":"#N/A"},{"$error":"#N/A"},{"$error":"#N/A"},{"$error":"#N/A"},{"$error":"#N/A"},{"$error":"#N/A"},null,{"$f":"$T133","v":270},270,270,270,270,270,270,270,270,270,270,270,null,3087,98,"2034-11-07",0,0,0,0,null,"2034-11-07",null,0,0,null,null,null,null,0,0,0,0,0,0,0,0,0,0,0,0,0,0,0,0,0,0,0,0,0,0,0,0,0,0,0,0,0,0,0,0,0,0,0,0,0,0,0,0,0,0,0,0,0,0,0,0,0,0,0,0,0,0,0,0,0,0,0,0,0,0,0,0,0,0,0,0,0,0,0,0,0,0,0,0,0,0]
["2009-04-21","terça-feira","Tiradentes",null,null,3117,99,"2034-12-07",0,0,0,0,"2034-09-07",null,null,null,null,null,99,270,44.02251232254639,44.02251232254639,45.021109314926498,46.898661381468308,49.357207766123224,51.945943224078668,{"$error":"#N/A"},{"$error":"#N/A"},{"$error":"#N/A"},{"$error":"#N/A"},{"$error":"#N/A"},{"$error":"#N/A"},null,1.3175937938138134,1.3175937938138134,1.3474818017957499,1.4036769351473464,1.4772612284400679,1.5547420806966745,{"$error":"#N/A"},{"$error":"#N/A"},{"$error":"#N/A"},{"$error":"#N/A"},{"$error":"#N/A"},{"$error":"#N/A"},null,270,270,270,270,270,270,270,270,270,270,270,270,null,3117,99,"2034-12-07",0,0,0,0,null,"2034-12-07",null,0,0,null,null,null,null,0,0,0,0,0,0,0,0,0,0,0,0,0,0,0,0,0,0,0,0,0,0,0,0,0,0,0,0,0,0,0,0,0,0,0,0,0,0,0,0,0,0,0,0,0,0,0,0,0,0,0,0,0,0,0,0,0,0,0,0,0,0,0,0,0,0,0,0,0,0,0,0,0,0,0,0,0,0]
["2009-05-01","sexta-feira","Dia do Trabalho",null,null,3148,100,"2035-01-07",0,0,0,0,"2034-10-07",null,null,null,null,null,100,270,43.23554069507113,43.23554069507113,44.226151063130189,46.089274826747953,48.530045889217256,51.101371396111965,{"$error":"#N/A"},{"$error":"#N/A"},{"$error":"#N/A"},{"$error":"#N/A"},{"$error":"#N/A"},{"$error":"#N/A"},null,1.294039733003479,1.294039733003479,1.3236887013194865,1.3794519955645661,1.4525042734642724,1.529464045885631,{"$error":"#N/A"},{"$error":"#N/A"},{"$error":"#N/A"},{"$error":"#N/A"},{"$error":"#N/A"},{"$error":"#N/A"},null,270,270,270,270,270,270,270,270,270,270,270,270,null,3148,100,"2035-01-07",0,0,0,0,null,"2035-01-07",null,0,0,null,null,null,null,0,0,0,0,0,0,0,0,0,0,0,0,0,0,0,0,0,0,0,0,0,0,0,0,0,0,0,0,0,0,0,0,0,0,0,0,0,0,0,0,0,0,0,0,0,0,0,0,0,0,0,{"$f":"IF($G135>DW$33,0,$I$9)","v":0},0,0,0,0,0,0,0,0,0,0,0,0,0,0,0,{"$f":"IF($G135>EM$33,0,$I$9)","v":0},0,0,0,0,0,0,0,0,0,0]
["2009-06-11","quinta-feira","Corpus Christi",null,null,3179,101,"2035-02-07",0,0,0,0,"2034-11-07",null,null,null,null,null,101,270,42.462637422848132,42.462637422848132,43.445229751598482,45.293856828392848,47.716746157306375,50.270531180824172,{"$error":"#N/A"},{"$error":"#N/A"},{"$error":"#N/A"},{"$error":"#N/A"},{"$error":"#N/A"},{"$error":"#N/A"},null,1.2709067380658448,1.2709067380658448,1.3003157264653424,1.3556451348737979,1.4281622124881796,1.5045969982420675,{"$error":"#N/A"},{"$error":"#N/A"},{"$error":"#N/A"},{"$error":"#N/A"},{"$error":"#N/A"},{"$error":"#N/A"},null,270,270,270,270,270,270,270,270,270,270,270,270,null,3179,101,"2035-02-07",0,0,0,0,null,"2035-02-07",null,0,0,null,null,null,null,0,0,0,0,0,0,0,0,0,0,0,0,0,0,0,0,0,0,0,0,0,0,0,0,0,0,0,0,0,0,0,{"$f":"IF($G136>DC$33,0,$I$9)","v":0},0,0,0,0,0,0,0,0,0,0,0,0,0,0,0,{"$f":"IF($G136>DS$33,0,$I$9)","v":0},0,0,0,0,0,0,0,0,0,0,0,0,0,0,0,0,0,0,0,0,0,0,0,0,0,0,0,0,0,0]
["2009-09-07","segunda-feira","Independência do Brasil",null,null,3207,102,"2035-03-07",0,0,0,0,"2034-12-07",null,null,null,null,null,102,270,41.776414010711797,41.776414010711797,42.751740265506228,44.587220430910278,46.993874346403715,49.531711693423297,{"$error":"#N/A"},{"$error":"#N/A"},{"$error":"#N/A"},{"$error":"#N/A"},{"$error":"#N/A"},{"$error":"#N/A"},null,1.250368071340604,1.250368071340604,1.2795595861466016,1.3344955074971445,1.4065266591878631,1.4824841309841594,{"$error":"#N/A"},{"$error":"#N/A"},{"$error":"#N/A"},{"$error":"#N/A"},{"$error":"#N/A"},{"$error":"#N/A"},null,270,270,270,270,270,270,270,270,270,270,270,270,null,3207,102,"2035-03-07",0,0,0,0,null,"2035-03-07",null,0,0,null,null,null,null,0,0,0,0,0,0,0,0,0,0,0,0,0,0,0,0,0,0,0,0,0,0,0,0,0,0,0,0,0,0,0,0,0,0,0,0,0,0,0,0,0,0,0,0,0,0,0,0,0,0,0,0,0,0,0,0,0,0,0,0,0,0,0,0,0,0,0,0,0,0,0,0,0,0,0,0,0,0]
["2009-10-12","segunda-feira","Nossa Sr.a Aparecida - Padroeira do Brasil",null,null,3238,103,"2035-04-07",0,0,0,0,"2035-01-07",null,null,null,null,null,103,270,41.029594922259811,41.029594922259811,41.996853297595642,43.817725190191283,46.206318828845959,48.726392053605032,{"$error":"#N/A"},{"$error":"#N/A"},{"$error":"#N/A"},{"$error":"#N/A"},{"$error":"#N/A"},{"$error":"#N/A"},null,1.2280157760232362,1.2280157760232362,1.2569658191970376,1.3114645149424251,1.3829551225473595,1.4583809141643986,{"$error":"#N/A"},{"$error":"#N/A"},{"$error":"#N/A"},{"$error":"#N/A"},{"$error":"#N/A"},{"$error":"#N/A"},null,270,270,270,270,270,270,270,270,270,270,270,270,null,3238,103,"2035-04-07",0,0,0,0,null,"2035-04-07",null,0,0,null,null,null,null,0,0,0,0,0,0,0,0,0,0,0,0,0,0,0,0,0,0,0,0,0,0,0,0,0,0,0,0,0,0,0,0,0,0,0,0,0,0,0,0,0,0,0,0,0,0,0,0,0,0,0,0,0,0,0,0,0,0,0,0,0,0,0,0,0,0,0,0,0,0,0,0,0,0,0,0,0,0]
["2009-11-02","segunda-feira","Finados",null,null,3268,104,"2035-05-07",0,0,0,0,"2035-02-07",null,null,null,null,null,104,270,40.31958074348546,40.31958074348546,41.279011291240849,43.085699161438612,45.456737231892049,47.959519339368576,{"$error":"#N/A"},{"$error":"#N/A"},{"$error":"#N/A"},{"$error":"#N/A"},{"$error":"#N/A"},{"$error":"#N/A"},null,1.2067650516525199,1.2067650516525199,1.2354808079468387,1.2895549759018576,1.3605201453505291,1.4354284138273017,{"$error":"#N/A"},{"$error":"#N/A"},{"$error":"#N/A"},{"$error":"#N/A"},{"$error":"#N/A"},{"$error":"#N/A"},null,270,270,270,270,270,270,270,270,270,270,270,270,null,3268,104,"2035-05-07",0,0,0,0,null,"2035-05-07",null,0,0,null,null,null,null,0,0,0,0,0,0,0,0,0,0,0,0,0,0,0,0,0,0,0,0,0,0,0,0,0,0,0,0,0,0,0,0,0,0,0,0,0,0,0,0,0,0,0,0,0,0,0,0,0,0,0,0,0,0,0,0,0,0,0,0,0,0,0,0,0,0,0,0,0,0,0,0,0,0,0,0,0,0]
["2009-11-15","domingo","Proclamação da República",null,null,3299,105,"2035-06-07",0,0,0,0,"2035-03-07",null,null,null,null,null,105,270,39.59880484036713,39.59880484036713,40.550128970229601,42.34211747755338,44.694942110398955,47.17976145255674,{"$error":"#N/A"},{"$error":"#N/A"},{"$error":"#N/A"},{"$error":"#N/A"},{"$error":"#N/A"},{"$error":"#N/A"},null,1.1851922288721883,1.1851922288721883,1.213665360078972,1.2672995761031727,1.3377196173642407,1.4120902602750232,{"$error":"#N/A"},{"$error":"#N/A"},{"$error":"#N/A"},{"$error":"#N/A"},{"$error":"#N/A"},{"$error":"#N/A"},null,270,270,270,270,270,270,270,270,270,270,270,270,null,3299,105,"2035-06-07",0,0,0,0,null,"2035-06-07",null,0,0,null,null,null,null,0,0,0,0,0,0,0,0,0,0,0,0,0,0,0,0,0,0,0,0,0,0,0,0,0,0,0,0,0,0,0,0,0,0,0,0,0,0,0,0,0,0,0,0,0,0,0,0,0,0,0,0,0,0,0,0,0,0,0,0,0,0,0,0,0,0,0,0,0,0,0,0,0,0,0,0,0,0]
["2009-12-25","sexta-feira","Natal",null,null,3329,106,"2035-07-07",0,0,0,0,"2035-04-07",null,null,null,null,null,106,270,38.913550380691106,38.913550380691106,39.857015471185569,41.634743190742832,43.969878808841166,46.437230142576993,{"$error":"#N/A"},{"$error":"#N/A"},{"$error":"#N/A"},{"$error":"#N/A"},{"$error":"#N/A"},{"$error":"#N/A"},null,1.1646825628940847,1.1646825628940847,1.1929204730525842,1.246127863698933,1.3160184727486162,1.3898662981673293,{"$error":"#N/A"},{"$error":"#N/A"},{"$error":"#N/A"},{"$error":"#N/A"},{"$error":"#N/A"},{"$error":"#N/A"},null,270,270,270,270,270,270,270,270,270,270,270,270,null,3329,106,"2035-07-07",0,0,0,0,null,"2035-07-07",null,0,0,null,null,null,null,0,0,0,0,0,0,0,0,0,0,0,0,0,0,0,0,0,0,0,0,0,0,0,0,0,0,0,0,0,0,0,0,0,0,0,0,0,0,0,0,0,0,0,0,0,0,0,0,0,0,0,0,0,0,0,0,0,0,0,0,0,0,0,0,0,0,0,0,0,0,0,0,0,0,0,0,0,0]
["2010-01-01","sexta-feira","Confraternização Universal",null,null,3360,107,"2035-08-07",0,0,0,0,"2035-05-07",null,null,null,null,null,107,270,38.217909481108713,38.217909481108713,39.153241978641098,40.916202397569187,43.233001478681246,45.68222264992167,{"$error":"#N/A"},{"$error":"#N/A"},{"$error":"#N/A"},{"$error":"#N/A"},{"$error":"#N/A"},{"$error":"#N/A"},null,1.1438620307695837,1.1438620307695837,1.1718565324207282,1.2246219377592458,1.2939637342569297,1.3672689239121556,{"$error":"#N/A"},{"$error":"#N/A"},{"$error":"#N/A"},{"$error":"#N/A"},{"$error":"#N/A"},{"$error":"#N/A"},null,270,270,270,270,270,270,270,270,270,270,270,270,null,3360,107,"2035-08-07",0,0,0,0,null,"2035-08-07",null,0,0,null,null,null,null,0,0,0,0,0,0,0,0,0,0,0,0,0,0,0,0,0,0,0,0,0,0,0,0,0,0,0,0,0,0,0,0,0,0,0,0,0,0,0,0,0,0,0,0,0,0,0,0,0,0,0,0,0,0,0,0,0,0,0,0,0,0,0,0,0,0,0,0,0,0,0,0,0,0,0,0,0,0]
["2010-02-15","segunda-feira","Carnaval",null,null,3391,108,"2035-09-07",0,0,0,0,"2035-06-07",null,null,null,null,null,108,270,37.53470425641175,37.53470425641175,38.461895335497005,40.210062326289993,42.508473243274686,44.939490573181885,{"$error":"#N/A"},{"$error":"#N/A"},{"$error":"#N/A"},{"$error":"#N/A"},{"$error":"#N/A"},{"$error":"#N/A"},null,1.1234136983944036,1.1234136983944036,1.1511645273914253,1.2034871654258594,1.2722786041712113,1.3450389528553337,{"$error":"#N/A"},{"$error":"#N/A"},{"$error":"#N/A"},{"$error":"#N/A"},{"$error":"#N/A"},{"$error":"#N/A"},null,270,270,270,270,270,270,270,270,270,270,270,270,null,3391,108,"2035-09-07",0,0,0,0,null,"2035-09-07",null,0,0,null,null,null,null,0,0,0,0,0,0,0,0,0,0,0,0,0,0,0,0,0,0,0,0,0,0,0,0,0,0,0,0,0,0,0,0,0,0,0,0,0,0,0,0,0,0,0,0,0,0,0,0,0,0,0,0,0,0,0,0,0,0,0,0,0,0,0,0,0,0,0,0,0,0,0,0,0,0,0,0,0,0]
["2010-02-16","terça-feira","Carnaval"]
["2010-04-02","sexta-feira","Paixão de Cristo"]
["2010-04-21","quarta-feira","Tiradentes"]
["2010-05-01","sábado","Dia do Trabalho"]
["2010-06-03","quinta-feira","Corpus Christi"]
["2010-09-07","terça-feira","Independência do Brasil"]
["2010-10-12","terça-feira","Nossa Sr.a Aparecida - Padroeira do Brasil"]
["2010-11-02","terça-feira","Finados"]
["2010-11-15","segunda-feira","Proclamação da República"]
["2010-12-25","sábado","Natal"]
["2011-01-01","sábado","Confraternização Universal"]
["2011-03-07","segunda-feira","Carnaval"]
["2011-03-08","terça-feira","Carnaval"]
["2011-04-21","quinta-feira","Tiradentes"]
["2011-04-22","sexta-feira","Paixão de Cristo"]
["2011-05-01","domingo","Dia do Trabalho"]
["2011-06-23","quinta-feira","Corpus Christi"]
["2011-09-07","quarta-feira","Independência do Brasil"]
["2011-10-12","quarta-feira","Nossa Sr.a Aparecida - Padroeira do Brasil"]
["2011-11-02","quarta-feira","Finados"]
["2011-11-15","terça-feira","Proclamação da República"]
["2011-12-25","domingo","Natal"]
["2012-01-01","domingo","Confraternização Universal"]
["2012-02-20","segunda-feira","Carnaval"]
["2012-02-21","terça-feira","Carnaval"]
["2012-04-06","sexta-feira","Paixão de Cristo"]
["2012-04-21","sábado","Tiradentes"]
["2012-05-01","terça-feira","Dia do Trabalho"]
["2012-06-07","quinta-feira","Corpus Christi"]
["2012-09-07","sexta-feira","Independência do Brasil"]
["2012-10-12","sexta-feira","Nossa Sr.a Aparecida - Padroeira do Brasil"]
["2012-11-02","sexta-feira","Finados"]
["2012-11-15","quinta-feira","Proclamação da República"]
["2012-12-25","terça-feira","Natal"]
["2013-01-01","terça-feira","Confraternização Universal"]
["2013-02-11","segunda-feira","Carnaval"]
["2013-02-12","terça-feira","Carnaval"]
["2013-03-29","sexta-feira","Paixão de Cristo"]
["2013-04-21","domingo","Tiradentes"]
["2013-05-01","quarta-feira","Dia do Trabalho"]
["2013-05-30","quinta-feira","Corpus Christi"]
["2013-09-07","sábado","Independência do Brasil"]
["2013-10-12","sábado","Nossa Sr.a Aparecida - Padroeira do Brasil"]
["2013-11-02","sábado","Finados"]
["2013-11-15","sexta-feira","Proclamação da República"]
["2013-12-25","quarta-feira","Natal"]
["2014-01-01","quarta-feira","Confraternização Universal"]
["2014-03-03","segunda-feira","Carnaval"]
["2014-03-04","terça-feira","Carnaval"]
["2014-04-18","sexta-feira","Paixão de Cristo"]
["2014-04-21","segunda-feira","Tiradentes"]
["2014-05-01","quinta-feira","Dia do Trabalho"]
["2014-06-19","quinta-feira","Corpus Christi"]
["2014-09-07","domingo","Independência do Brasil"]
["2014-10-12","domingo","Nossa Sr.a Aparecida - Padroeira do Brasil"]
["2014-11-02","domingo","Finados"]
["2014-11-15","sábado","Proclamação da República"]
["2014-12-25","quinta-feira","Natal"]
["2015-01-01","quinta-feira","Confraternização Universal"]
["2015-02-16","segunda-feira","Carnaval"]
["2015-02-17","terça-feira","Carnaval"]
["2015-04-03","sexta-feira","Paixão de Cristo"]
["2015-04-21","terça-feira","Tiradentes"]
["2015-05-01","sexta-feira","Dia do Trabalho"]
["2015-06-04","quinta-feira","Corpus Christi"]
["2015-09-07","segunda-feira","Independência do Brasil"]
["2015-10-12","segunda-feira","Nossa Sr.a Aparecida - Padroeira do Brasil"]
["2015-11-02","segunda-feira","Finados"]
["2015-11-15","domingo","Proclamação da República"]
["2015-12-25","sexta-feira","Natal"]
["2016-01-01","sexta-feira","Confraternização Universal"]
["2016-02-08","segunda-feira","Carnaval"]
["2016-02-09","terça-feira","Carnaval"]
["2016-03-25","sexta-feira","Paixão de Cristo"]
["2016-04-21","quinta-feira","Tiradentes"]
["2016-05-01","domingo","Dia do Trabalho"]
["2016-05-26","quinta-feira","Corpus Christi"]
["2016-09-07","quarta-feira","Independência do Brasil"]
["2016-10-12","quarta-feira","Nossa Sr.a Aparecida - Padroeira do Brasil"]
["2016-11-02","quarta-feira","Finados"]
["2016-11-15","terça-feira","Proclamação da República"]
["2016-12-25","domingo","Natal"]
["2017-01-01","domingo","Confraternização Universal"]
["2017-02-27","segunda-feira","Carnaval"]
["2017-02-28","terça-feira","Carnaval"]
["2017-04-14","sexta-feira","Paixão de Cristo"]
["2017-04-21","sexta-feira","Tiradentes"]
["2017-05-01","segunda-feira","Dia do Trabalho"]
["2017-06-15","quinta-feira","Corpus Christi"]
["2017-09-07","quinta-feira","Independência do Brasil"]
["2017-10-12","quinta-feira","Nossa Sr.a Aparecida - Padroeira do Brasil"]
["2017-11-02","quinta-feira","Finados"]
["2017-11-15","quarta-feira","Proclamação da República"]
["2017-12-25","segunda-feira","Natal"]
["2018-01-01","segunda-feira","Confraternização Universal"]
["2018-02-12","segunda-feira","Carnaval"]
["2018-02-13","terça-feira","Carnaval"]
["2018-03-30","sexta-feira","Paixão de Cristo"]
["2018-04-21","sábado","Tiradentes"]
["2018-05-01","terça-feira","Dia do Trabalho"]
["2018-05-31","quinta-feira","Corpus Christi"]
["2018-09-07","sexta-feira","Independência do Brasil"]
["2018-10-12","sexta-feira","Nossa Sr.a Aparecida - Padroeira do Brasil"]
["2018-11-02","sexta-feira","Finados"]
["2018-11-15","quinta-feira","Proclamação da República"]
["2018-12-25","terça-feira","Natal"]
["2019-01-01","terça-feira","Confraternização Universal"]
["2019-03-04","segunda-feira","Carnaval"]
["2019-03-05","terça-feira","Carnaval"]
["2019-04-19","sexta-feira","Paixão de Cristo"]
["2019-04-21","domingo","Tiradentes"]
["2019-05-01","quarta-feira","Dia do Trabalho"]
["2019-06-20","quinta-feira","Corpus Christi"]
["2019-09-07","sábado","Independência do Brasil"]
["2019-10-12","sábado","Nossa Sr.a Aparecida - Padroeira do Brasil"]
["2019-11-02","sábado","Finados"]
["2019-11-15","sexta-feira","Proclamação da República"]
["2019-12-25","quarta-feira","Natal"]
["2020-01-01","quarta-feira","Confraternização Universal"]
["2020-02-24","segunda-feira","Carnaval"]
["2020-02-25","terça-feira","Carnaval"]
["2020-04-10","sexta-feira","Paixão de Cristo"]
["2020-04-21","terça-feira","Tiradentes"]
["2020-05-01","sexta-feira","Dia do Trabalho"]
["2020-06-11","quinta-feira","Corpus Christi"]
["2020-09-07","segunda-feira","Independência do Brasil"]
["2020-10-12","segunda-feira","Nossa Sr.a Aparecida - Padroeira do Brasil"]
["2020-11-02","segunda-feira","Finados"]
["2020-11-15","domingo","Proclamação da República"]
["2020-12-25","sexta-feira","Natal"]
["2021-01-01","sexta-feira","Confraternização Universal"]
["2021-02-15","segunda-feira","Carnaval"]
["2021-02-16","terça-feira","Carnaval"]
["2021-04-02","sexta-feira","Paixão de Cristo"]
["2021-04-21","quarta-feira","Tiradentes"]
["2021-05-01","sábado","Dia do Trabalho"]
["2021-06-03","quinta-feira","Corpus Christi"]
["2021-09-07","terça-feira","Independência do Brasil"]
["2021-10-12","terça-feira","Nossa Sr.a Aparecida - Padroeira do Brasil"]
["2021-11-02","terça-feira","Finados"]
["2021-11-15","segunda-feira","Proclamação da República"]
["2021-12-25","sábado","Natal"]
["2022-01-01","sábado","Confraternização Universal"]
["2022-02-28","segunda-feira","Carnaval"]
["2022-03-01","terça-feira","Carnaval"]
["2022-04-15","sexta-feira","Paixão de Cristo"]
["2022-04-21","quinta-feira","Tiradentes"]
["2022-05-01","domingo","Dia do Trabalho"]
["2022-06-16","quinta-feira","Corpus Christi"]
["2022-09-07","quarta-feira","Independência do Brasil"]
["2022-10-12","quarta-feira","Nossa Sr.a Aparecida - Padroeira do Brasil"]
["2022-11-02","quarta-feira","Finados"]
["2022-11-15","terça-feira","Proclamação da República"]
["2022-12-25","domingo","Natal"]
["2023-01-01","domingo","Confraternização Universal"]
["2023-02-20","segunda-feira","Carnaval"]
["2023-02-21","terça-feira","Carnaval"]
["2023-04-07","sexta-feira","Paixão de Cristo"]
["2023-04-21","sexta-feira","Tiradentes"]
["2023-05-01","segunda-feira","Dia do Trabalho"]
["2023-06-08","quinta-feira","Corpus Christi"]
["2023-09-07","quinta-feira","Independência do Brasil"]
["2023-10-12","quinta-feira","Nossa Sr.a Aparecida - Padroeira do Brasil"]
["2023-11-02","quinta-feira","Finados"]
["2023-11-15","quarta-feira","Proclamação da República"]
["2023-12-25","segunda-feira","Natal"]
["2024-01-01","segunda-feira","Confraternização Universal"]
["2024-02-12","segunda-feira","Carnaval"]
["2024-02-13","terça-feira","Carnaval"]
["2024-03-29","sexta-feira","Paixão de Cristo"]
["2024-04-21","domingo","Tiradentes"]
["2024-05-01","quarta-feira","Dia do Trabalho"]
["2024-05-30","quinta-feira","Corpus Christi"]
["2024-09-07","sábado","Independência do Brasil"]
["2024-10-12","sábado","Nossa Sr.a Aparecida - Padroeira do Brasil"]
["2024-11-02","sábado","Finados"]
["2024-11-15","sexta-feira","Proclamação da República"]
["2024-11-20","quarta-feira","Dia Nacional de Zumbi e da Consciência Negra"]
["2024-12-25","quarta-feira","Natal"]
["2025-01-01","quarta-feira","Confraternização Universal"]
["2025-03-03","segunda-feira","Carnaval"]
["2025-03-04","terça-feira","Carnaval"]
["2025-04-18","sexta-feira","Paixão de Cristo"]
["2025-04-21","segunda-feira","Tiradentes"]
["2025-05-01","quinta-feira","Dia do Trabalho"]
["2025-06-19","quinta-feira","Corpus Christi"]
["2025-09-07","domingo","Independência do Brasil"]
["2025-10-12","domingo","Nossa Sr.a Aparecida - Padroeira do Brasil"]
["2025-11-02","domingo","Finados"]
["2025-11-15","sábado","Proclamação da República"]
["2025-11-20","quinta-feira","Dia Nacional de Zumbi e da Consciência Negra"]
["2025-12-25","quinta-feira","Natal"]
["2026-01-01","quinta-feira","Confraternização Universal"]
["2026-02-16","segunda-feira","Carnaval"]
["2026-02-17","terça-feira","Carnaval"]
["2026-04-03","sexta-feira","Paixão de Cristo"]
["2026-04-21","terça-feira","Tiradentes"]
["2026-05-01","sexta-feira","Dia do Trabalho"]
["2026-06-04","quinta-feira","Corpus Christi"]
["2026-09-07","segunda-feira","Independência do Brasil"]
["2026-10-12","segunda-feira","Nossa Sr.a Aparecida - Padroeira do Brasil"]
["2026-11-02","segunda-feira","Finados"]
["2026-11-15","domingo","Proclamação da República"]
["2026-11-20","sexta-feira","Dia Nacional de Zumbi e da Consciência Negra"]
["2026-12-25","sexta-feira","Natal"]
["2027-01-01","sexta-feira","Confraternização Universal"]
["2027-02-08","segunda-feira","Carnaval"]
["2027-02-09","terça-feira","Carnaval"]
["2027-03-26","sexta-feira","Paixão de Cristo"]
["2027-04-21","quarta-feira","Tiradentes"]
["2027-05-01","sábado","Dia do Trabalho"]
["2027-05-27","quinta-feira","Corpus Christi"]
["2027-09-07","terça-feira","Independência do Brasil"]
["2027-10-12","terça-feira","Nossa Sr.a Aparecida - Padroeira do Brasil"]
["2027-11-02","terça-feira","Finados"]
["2027-11-15","segunda-feira","Proclamação da República"]
["2027-11-20","sábado","Dia Nacional de Zumbi e da Consciência Negra"]
["2027-12-25","sábado","Natal"]
["2028-01-01","sábado","Confraternização Universal"]
["2028-02-28","segunda-feira","Carnaval"]
["2028-02-29","terça-feira","Carnaval"]
["2028-04-14","sexta-feira","Paixão de Cristo"]
["2028-04-21","sexta-feira","Tiradentes"]
["2028-05-01","segunda-feira","Dia do Trabalho"]
["2028-06-15","quinta-feira","Corpus Christi"]
["2028-09-07","quinta-feira","Independência do Brasil"]
["2028-10-12","quinta-feira","Nossa Sr.a Aparecida - Padroeira do Brasil"]
["2028-11-02","quinta-feira","Finados"]
["2028-11-15","quarta-feira","Proclamação da República"]
["2028-11-20","segunda-feira","Dia Nacional de Zumbi e da Consciência Negra"]
["2028-12-25","segunda-feira","Natal"]
["2029-01-01","segunda-feira","Confraternização Universal"]
["2029-02-12","segunda-feira","Carnaval"]
["2029-02-13","terça-feira","Carnaval"]
["2029-03-30","sexta-feira","Paixão de Cristo"]
["2029-04-21","sábado","Tiradentes"]
["2029-05-01","terça-feira","Dia do Trabalho"]
["2029-05-31","quinta-feira","Corpus Christi"]
["2029-09-07","sexta-feira","Independência do Brasil"]
["2029-10-12","sexta-feira","Nossa Sr.a Aparecida - Padroeira do Brasil"]
["2029-11-02","sexta-feira","Finados"]
["2029-11-15","quinta-feira","Proclamação da República"]
["2029-11-20","terça-feira","Dia Nacional de Zumbi e da Consciência Negra"]
["2029-12-25","terça-feira","Natal"]
["2030-01-01","terça-feira","Confraternização Universal"]
["2030-03-04","segunda-feira","Carnaval"]
["2030-03-05","terça-feira","Carnaval"]
["2030-04-19","sexta-feira","Paixão de Cristo"]
["2030-04-21","domingo","Tiradentes"]
["2030-05-01","quarta-feira","Dia do Trabalho"]
["2030-06-20","quinta-feira","Corpus Christi"]
["2030-09-07","sábado","Independência do Brasil"]
["2030-10-12","sábado","Nossa Sr.a Aparecida - Padroeira do Brasil"]
["2030-11-02","sábado","Finados"]
["2030-11-15","sexta-feira","Proclamação da República"]
["2030-11-20","quarta-feira","Dia Nacional de Zumbi e da Consciência Negra"]
["2030-12-25","quarta-feira","Natal"]
["2031-01-01","quarta-feira","Confraternização Universal"]
["2031-02-24","segunda-feira","Carnaval"]
["2031-02-25","terça-feira","Carnaval"]
["2031-04-11","sexta-feira","Paixão de Cristo"]
["2031-04-21","segunda-feira","Tiradentes"]
["2031-05-01","quinta-feira","Dia do Trabalho"]
["2031-06-12","quinta-feira","Corpus Christi"]
["2031-09-07","domingo","Independência do Brasil"]
["2031-10-12","domingo","Nossa Sr.a Aparecida - Padroeira do Brasil"]
["2031-11-02","domingo","Finados"]
["2031-11-15","sábado","Proclamação da República"]
["2031-11-20","quinta-feira","Dia Nacional de Zumbi e da Consciência Negra"]
["2031-12-25","quinta-feira","Natal"]
["2032-01-01","quinta-feira","Confraternização Universal"]
["2032-02-09","segunda-feira","Carnaval"]
["2032-02-10","terça-feira","Carnaval"]
["2032-03-26","sexta-feira","Paixão de Cristo"]
["2032-04-21","quarta-feira","Tiradentes"]
["2032-05-01","sábado","Dia do Trabalho"]
["2032-05-27","quinta-feira","Corpus Christi"]
["2032-09-07","terça-feira","Independência do Brasil"]
["2032-10-12","terça-feira","Nossa Sr.a Aparecida - Padroeira do Brasil"]
["2032-11-02","terça-feira","Finados"]
["2032-11-15","segunda-feira","Proclamação da República"]
["2032-11-20","sábado","Dia Nacional de Zumbi e da Consciência Negra"]
["2032-12-25","sábado","Natal"]
["2033-01-01","sábado","Confraternização Universal"]
["2033-02-28","segunda-feira","Carnaval"]
["2033-03-01","terça-feira","Carnaval"]
["2033-04-15","sexta-feira","Paixão de Cristo"]
["2033-04-21","quinta-feira","Tiradentes"]
["2033-05-01","domingo","Dia do Trabalho"]
["2033-06-16","quinta-feira","Corpus Christi"]
["2033-09-07","quarta-feira","Independência do Brasil"]
["2033-10-12","quarta-feira","Nossa Sr.a Aparecida - Padroeira do Brasil"]
["2033-11-02","quarta-feira","Finados"]
["2033-11-15","terça-feira","Proclamação da República"]
["2033-11-20","domingo","Dia Nacional de Zumbi e da Consciência Negra"]
["2033-12-25","domingo","Natal"]
["2034-01-01","domingo","Confraternização Universal"]
["2034-02-20","segunda-feira","Carnaval"]
["2034-02-21","terça-feira","Carnaval"]
["2034-04-07","sexta-feira","Paixão de Cristo"]
["2034-04-21","sexta-feira","Tiradentes"]
["2034-05-01","segunda-feira","Dia do Trabalho"]
["2034-06-08","quinta-feira","Corpus Christi"]
["2034-09-07","quinta-feira","Independência do Brasil"]
["2034-10-12","quinta-feira","Nossa Sr.a Aparecida - Padroeira do Brasil"]
["2034-11-02","quinta-feira","Finados"]
["2034-11-15","quarta-feira","Proclamação da República"]
["2034-11-20","segunda-feira","Dia Nacional de Zumbi e da Consciência Negra"]
["2034-12-25","segunda-feira","Natal"]
["2035-01-01","segunda-feira","Confraternização Universal"]
["2035-02-05","segunda-feira","Carnaval"]
["2035-02-06","terça-feira","Carnaval"]
["2035-03-23","sexta-feira","Paixão de Cristo"]
["2035-04-21","sábado","Tiradentes"]
["2035-05-01","terça-feira","Dia do Trabalho"]
["2035-05-24","quinta-feira","Corpus Christi"]
["2035-09-07","sexta-feira","Independência do Brasil"]
["2035-10-12","sexta-feira","Nossa Sr.a Aparecida - Padroeira do Brasil"]
["2035-11-02","sexta-feira","Finados"]
["2035-11-15","quinta-feira","Proclamação da República"]
["2035-11-20","terça-feira","Dia Nacional de Zumbi e da Consciência Negra"]
["2035-12-25","terça-feira","Natal"]
["2036-01-01","terça-feira","Confraternização Universal"]
["2036-02-25","segunda-feira","Carnaval"]
["2036-02-26","terça-feira","Carnaval"]
["2036-04-11","sexta-feira","Paixão de Cristo"]
["2036-04-21","segunda-feira","Tiradentes"]
["2036-05-01","quinta-feira","Dia do Trabalho"]
["2036-06-12","quinta-feira","Corpus Christi"]
["2036-09-07","domingo","Independência do Brasil"]
["2036-10-12","domingo","Nossa Sr.a Aparecida - Padroeira do Brasil"]
["2036-11-02","domingo","Finados"]
["2036-11-15","sábado","Proclamação da República"]
["2036-11-20","quinta-feira","Dia Nacional de Zumbi e da Consciência Negra"]
["2036-12-25","quinta-feira","Natal"]
["2037-01-01","quinta-feira","Confraternização Universal"]
["2037-02-16","segunda-feira","Carnaval"]
["2037-02-17","terça-feira","Carnaval"]
["2037-04-03","sexta-feira","Paixão de Cristo"]
["2037-04-21","terça-feira","Tiradentes"]
["2037-05-01","sexta-feira","Dia do Trabalho"]
["2037-06-04","quinta-feira","Corpus Christi"]
["2037-09-07","segunda-feira","Independência do Brasil"]
["2037-10-12","segunda-feira","Nossa Sr.a Aparecida - Padroeira do Brasil"]
["2037-11-02","segunda-feira","Finados"]
["2037-11-15","domingo","Proclamação da República"]
["2037-11-20","sexta-feira","Dia Nacional de Zumbi e da Consciência Negra"]
["2037-12-25","sexta-feira","Natal"]
["2038-01-01","sexta-feira","Confraternização Universal"]
["2038-03-08","segunda-feira","Carnaval"]
["2038-03-09","terça-feira","Carnaval"]
["2038-04-21","quarta-feira","Tiradentes"]
["2038-04-23","sexta-feira","Paixão de Cristo"]
["2038-05-01","sábado","Dia do Trabalho"]
["2038-06-24","quinta-feira","Corpus Christi"]
["2038-09-07","terça-feira","Independência do Brasil"]
["2038-10-12","terça-feira","Nossa Sr.a Aparecida - Padroeira do Brasil"]
["2038-11-02","terça-feira","Finados"]
["2038-11-15","segunda-feira","Proclamação da República"]
["2038-11-20","sábado","Dia Nacional de Zumbi e da Consciência Negra"]
["2038-12-25","sábado","Natal"]
["2039-01-01","sábado","Confraternização Universal"]
["2039-02-21","segunda-feira","Carnaval"]
["2039-02-22","terça-feira","Carnaval"]
["2039-04-08","sexta-feira","Paixão de Cristo"]
["2039-04-21","quinta-feira","Tiradentes"]
["2039-05-01","domingo","Dia do Trabalho"]
["2039-06-09","quinta-feira","Corpus Christi"]
["2039-09-07","quarta-feira","Independência do Brasil"]
["2039-10-12","quarta-feira","Nossa Sr.a Aparecida - Padroeira do Brasil"]
["2039-11-02","quarta-feira","Finados"]
["2039-11-15","terça-feira","Proclamação da República"]
["2039-11-20","domingo","Dia Nacional de Zumbi e da Consciência Negra"]
["2039-12-25","domingo","Natal"]
["2040-01-01","domingo","Confraternização Universal"]
["2040-02-13","segunda-feira","Carnaval"]
["2040-02-14","terça-feira","Carnaval"]
["2040-03-30","sexta-feira","Paixão de Cristo"]
["2040-04-21","sábado","Tiradentes"]
["2040-05-01","terça-feira","Dia do Trabalho"]
["2040-05-31","quinta-feira","Corpus Christi"]
["2040-09-07","sexta-feira","Independência do Brasil"]
["2040-10-12","sexta-feira","Nossa Sr.a Aparecida - Padroeira do Brasil"]
["2040-11-02","sexta-feira","Finados"]
["2040-11-15","quinta-feira","Proclamação da República"]
["2040-11-20","terça-feira","Dia Nacional de Zumbi e da Consciência Negra"]
["2040-12-25","terça-feira","Natal"]
["2041-01-01","terça-feira","Confraternização Universal"]
["2041-03-04","segunda-feira","Carnaval"]
["2041-03-05","terça-feira","Carnaval"]
["2041-04-19","sexta-feira","Paixão de Cristo"]
["2041-04-21","domingo","Tiradentes"]
["2041-05-01","quarta-feira","Dia do Trabalho"]
["2041-06-20","quinta-feira","Corpus Christi"]
["2041-09-07","sábado","Independência do Brasil"]
["2041-10-12","sábado","Nossa Sr.a Aparecida - Padroeira do Brasil"]
["2041-11-02","sábado","Finados"]
["2041-11-15","sexta-feira","Proclamação da República"]
["2041-11-20","quarta-feira","Dia Nacional de Zumbi e da Consciência Negra"]
["2041-12-25","quarta-feira","Natal"]
["2042-01-01","quarta-feira","Confraternização Universal"]
["2042-02-17","segunda-feira","Carnaval"]
["2042-02-18","terça-feira","Carnaval"]
["2042-04-04","sexta-feira","Paixão de Cristo"]
["2042-04-21","segunda-feira","Tiradentes"]
["2042-05-01","quinta-feira","Dia do Trabalho"]
["2042-06-05","quinta-feira","Corpus Christi"]
["2042-09-07","domingo","Independência do Brasil"]
["2042-10-12","domingo","Nossa Sr.a Aparecida - Padroeira do Brasil"]
["2042-11-02","domingo","Finados"]
["2042-11-15","sábado","Proclamação da República"]
["2042-11-20","quinta-feira","Dia Nacional de Zumbi e da Consciência Negra"]
["2042-12-25","quinta-feira","Natal"]
["2043-01-01","quinta-feira","Confraternização Universal"]
["2043-02-09","segunda-feira","Carnaval"]
["2043-02-10","terça-feira","Carnaval"]
["2043-03-27","sexta-feira","Paixão de Cristo"]
["2043-04-21","terça-feira","Tiradentes"]
["2043-05-01","sexta-feira","Dia do Trabalho"]
["2043-05-28","quinta-feira","Corpus Christi"]
["2043-09-07","segunda-feira","Independência do Brasil"]
["2043-10-12","segunda-feira","Nossa Sr.a Aparecida - Padroeira do Brasil"]
["2043-11-02","segunda-feira","Finados"]
["2043-11-15","domingo","Proclamação da República"]
["2043-11-20","sexta-feira","Dia Nacional de Zumbi e da Consciência Negra"]
["2043-12-25","sexta-feira","Natal"]
["2044-01-01","sexta-feira","Confraternização Universal"]
["2044-02-29","segunda-feira","Carnaval"]
["2044-03-01","terça-feira","Carnaval"]
["2044-04-15","sexta-feira","Paixão de Cristo"]
["2044-04-21","quinta-feira","Tiradentes"]
["2044-05-01","domingo","Dia do Trabalho"]
["2044-06-16","quinta-feira","Corpus Christi"]
["2044-09-07","quarta-feira","Independência do Brasil"]
["2044-10-12","quarta-feira","Nossa Sr.a Aparecida - Padroeira do Brasil"]
["2044-11-02","quarta-feira","Finados"]
["2044-11-15","terça-feira","Proclamação da República"]
["2044-11-20","domingo","Dia Nacional de Zumbi e da Consciência Negra"]
["2044-12-25","domingo","Natal"]
["2045-01-01","domingo","Confraternização Universal"]
["2045-02-20","segunda-feira","Carnaval"]
["2045-02-21","terça-feira","Carnaval"]
["2045-04-07","sexta-feira","Paixão de Cristo"]
["2045-04-21","sexta-feira","Tiradentes"]
["2045-05-01","segunda-feira","Dia do Trabalho"]
["2045-06-08","quinta-feira","Corpus Christi"]
["2045-09-07","quinta-feira","Independência do Brasil"]
["2045-10-12","quinta-feira","Nossa Sr.a Aparecida - Padroeira do Brasil"]
["2045-11-02","quinta-feira","Finados"]
["2045-11-15","quarta-feira","Proclamação da República"]
["2045-11-20","segunda-feira","Dia Nacional de Zumbi e da Consciência Negra"]
["2045-12-25","segunda-feira","Natal"]
["2046-01-01","segunda-feira","Confraternização Universal"]
["2046-02-05","segunda-feira","Carnaval"]
["2046-02-06","terça-feira","Carnaval"]
["2046-03-23","sexta-feira","Paixão de Cristo"]
["2046-04-21","sábado","Tiradentes"]
["2046-05-01","terça-feira","Dia do Trabalho"]
["2046-05-24","quinta-feira","Corpus Christi"]
["2046-09-07","sexta-feira","Independência do Brasil"]
["2046-10-12","sexta-feira","Nossa Sr.a Aparecida - Padroeira do Brasil"]
["2046-11-02","sexta-feira","Finados"]
["2046-11-15","quinta-feira","Proclamação da República"]
["2046-11-20","terça-feira","Dia Nacional de Zumbi e da Consciência Negra"]
["2046-12-25","terça-feira","Natal"]
["2047-01-01","terça-feira","Confraternização Universal"]
["2047-02-25","segunda-feira","Carnaval"]
["2047-02-26","terça-feira","Carnaval"]
["2047-04-12","sexta-feira","Paixão de Cristo"]
["2047-04-21","domingo","Tiradentes"]
["2047-05-01","quarta-feira","Dia do Trabalho"]
["2047-06-13","quinta-feira","Corpus Christi"]
["2047-09-07","sábado","Independência do Brasil"]
["2047-10-12","sábado","Nossa Sr.a Aparecida - Padroeira do Brasil"]
["2047-11-02","sábado","Finados"]
["2047-11-15","sexta-feira","Proclamação da República"]
["2047-11-20","quarta-feira","Dia Nacional de Zumbi e da Consciência Negra"]
["2047-12-25","quarta-feira","Natal"]
["2048-01-01","quarta-feira","Confraternização Universal"]
["2048-02-17","segunda-feira","Carnaval"]
["2048-02-18","terça-feira","Carnaval"]
["2048-04-03","sexta-feira","Paixão de Cristo"]
["2048-04-21","terça-feira","Tiradentes"]
["2048-05-01","sexta-feira","Dia do Trabalho"]
["2048-06-04","quinta-feira","Corpus Christi"]
["2048-09-07","segunda-feira","Independência do Brasil"]
["2048-10-12","segunda-feira","Nossa Sr.a Aparecida - Padroeira do Brasil"]
["2048-11-02","segunda-feira","Finados"]
["2048-11-15","domingo","Proclamação da República"]
["2048-11-20","sexta-feira","Dia Nacional de Zumbi e da Consciência Negra"]
["2048-12-25","sexta-feira","Natal"]
["2049-01-01","sexta-feira","Confraternização Universal"]
["2049-03-01","segunda-feira","Carnaval"]
["2049-03-02","terça-feira","Carnaval"]
["2049-04-16","sexta-feira","Paixão de Cristo"]
["2049-04-21","quarta-feira","Tiradentes"]
["2049-05-01","sábado","Dia do Trabalho"]
["2049-06-17","quinta-feira","Corpus Christi"]
["2049-09-07","terça-feira","Independência do Brasil"]
["2049-10-12","terça-feira","Nossa Sr.a Aparecida - Padroeira do Brasil"]
["2049-11-02","terça-feira","Finados"]
["2049-11-15","segunda-feira","Proclamação da República"]
["2049-11-20","sábado","Dia Nacional de Zumbi e da Consciência Negra"]
["2049-12-25","sábado","Natal"]
["2050-01-01","sábado","Confraternização Universal"]
["2050-02-21","segunda-feira","Carnaval"]
["2050-02-22","terça-feira","Carnaval"]
["2050-04-08","sexta-feira","Paixão de Cristo"]
["2050-04-21","quinta-feira","Tiradentes"]
["2050-05-01","domingo","Dia do Trabalho"]
["2050-06-09","quinta-feira","Corpus Christi"]
["2050-09-07","quarta-feira","Independência do Brasil"]
["2050-10-12","quarta-feira","Nossa Sr.a Aparecida - Padroeira do Brasil"]
["2050-11-02","quarta-feira","Finados"]
["2050-11-15","terça-feira","Proclamação da República"]
["2050-11-20","domingo","Dia Nacional de Zumbi e da Consciência Negra"]
["2050-12-25","domingo","Natal"]
["2051-01-01","domingo","Confraternização Universal"]
["2051-02-13","segunda-feira","Carnaval"]
["2051-02-14","terça-feira","Carnaval"]
["2051-03-31","sexta-feira","Paixão de Cristo"]
["2051-04-21","sexta-feira","Tiradentes"]
["2051-05-01","segunda-feira","Dia do Trabalho"]
["2051-06-01","quinta-feira","Corpus Christi"]
["2051-09-07","quinta-feira","Independência do Brasil"]
["2051-10-12","quinta-feira","Nossa Sr.a Aparecida - Padroeira do Brasil"]
["2051-11-02","quinta-feira","Finados"]
["2051-11-15","quarta-feira","Proclamação da República"]
["2051-11-20","segunda-feira","Dia Nacional de Zumbi e da Consciência Negra"]
["2051-12-25","segunda-feira","Natal"]
["2052-01-01","segunda-feira","Confraternização Universal"]
["2052-03-04","segunda-feira","Carnaval"]
["2052-03-05","terça-feira","Carnaval"]
["2052-04-19","sexta-feira","Paixão de Cristo"]
["2052-04-21","domingo","Tiradentes"]
["2052-05-01","quarta-feira","Dia do Trabalho"]
["2052-06-20","quinta-feira","Corpus Christi"]
["2052-09-07","sábado","Independência do Brasil"]
["2052-10-12","sábado","Nossa Sr.a Aparecida - Padroeira do Brasil"]
["2052-11-02","sábado","Finados"]
["2052-11-15","sexta-feira","Proclamação da República"]
["2052-11-20","quarta-feira","Dia Nacional de Zumbi e da Consciência Negra"]
["2052-12-25","quarta-feira","Natal"]
["2053-01-01","quarta-feira","Confraternização Universal"]
["2053-02-17","segunda-feira","Carnaval"]
["2053-02-18","terça-feira","Carnaval"]
["2053-04-04","sexta-feira","Paixão de Cristo"]
["2053-04-21","segunda-feira","Tiradentes"]
["2053-05-01","quinta-feira","Dia do Trabalho"]
["2053-06-05","quinta-feira","Corpus Christi"]
["2053-09-07","domingo","Independência do Brasil"]
["2053-10-12","domingo","Nossa Sr.a Aparecida - Padroeira do Brasil"]
["2053-11-02","domingo","Finados"]
["2053-11-15","sábado","Proclamação da República"]
["2053-11-20","quinta-feira","Dia Nacional de Zumbi e da Consciência Negra"]
["2053-12-25","quinta-feira","Natal"]
["2054-01-01","quinta-feira","Confraternização Universal"]
["2054-02-09","segunda-feira","Carnaval"]
["2054-02-10","terça-feira","Carnaval"]
["2054-03-27","sexta-feira","Paixão de Cristo"]
["2054-04-21","terça-feira","Tiradentes"]
["2054-05-01","sexta-feira","Dia do Trabalho"]
["2054-05-28","quinta-feira","Corpus Christi"]
["2054-09-07","segunda-feira","Independência do Brasil"]
["2054-10-12","segunda-feira","Nossa Sr.a Aparecida - Padroeira do Brasil"]
["2054-11-02","segunda-feira","Finados"]
["2054-11-15","domingo","Proclamação da República"]
["2054-11-20","sexta-feira","Dia Nacional de Zumbi e da Consciência Negra"]
["2054-12-25","sexta-feira","Natal"]
["2055-01-01","sexta-feira","Confraternização Universal"]
["2055-03-01","segunda-feira","Carnaval"]
["2055-03-02","terça-feira","Carnaval"]
["2055-04-16","sexta-feira","Paixão de Cristo"]
["2055-04-21","quarta-feira","Tiradentes"]
["2055-05-01","sábado","Dia do Trabalho"]
["2055-06-17","quinta-feira","Corpus Christi"]
["2055-09-07","terça-feira","Independência do Brasil"]
["2055-10-12","terça-feira","Nossa Sr.a Aparecida - Padroeira do Brasil"]
["2055-11-02","terça-feira","Finados"]
["2055-11-15","segunda-feira","Proclamação da República"]
["2055-11-20","sábado","Dia Nacional de Zumbi e da Consciência Negra"]
["2055-12-25","sábado","Natal"]
["2056-01-01","sábado","Confraternização Universal"]
["2056-02-14","segunda-feira","Carnaval"]
["2056-02-15","terça-feira","Carnaval"]
["2056-03-31","sexta-feira","Paixão de Cristo"]
["2056-04-21","sexta-feira","Tiradentes"]
["2056-05-01","segunda-feira","Dia do Trabalho"]
["2056-06-01","quinta-feira","Corpus Christi"]
["2056-09-07","quinta-feira","Independência do Brasil"]
["2056-10-12","quinta-feira","Nossa Sr.a Aparecida - Padroeira do Brasil"]
["2056-11-02","quinta-feira","Finados"]
["2056-11-15","quarta-feira","Proclamação da República"]
["2056-11-20","segunda-feira","Dia Nacional de Zumbi e da Consciência Negra"]
["2056-12-25","segunda-feira","Natal"]
["2057-01-01","segunda-feira","Confraternização Universal"]
["2057-03-05","segunda-feira","Carnaval"]
["2057-03-06","terça-feira","Carnaval"]
["2057-04-20","sexta-feira","Paixão de Cristo"]
["2057-04-21","sábado","Tiradentes"]
["2057-05-01","terça-feira","Dia do Trabalho"]
["2057-06-21","quinta-feira","Corpus Christi"]
["2057-09-07","sexta-feira","Independência do Brasil"]
["2057-10-12","sexta-feira","Nossa Sr.a Aparecida - Padroeira do Brasil"]
["2057-11-02","sexta-feira","Finados"]
["2057-11-15","quinta-feira","Proclamação da República"]
["2057-11-20","terça-feira","Dia Nacional de Zumbi e da Consciência Negra"]
["2057-12-25","terça-feira","Natal"]
["2058-01-01","terça-feira","Confraternização Universal"]
["2058-02-25","segunda-feira","Carnaval"]
["2058-02-26","terça-feira","Carnaval"]
["2058-04-12","sexta-feira","Paixão de Cristo"]
["2058-04-21","domingo","Tiradentes"]
["2058-05-01","quarta-feira","Dia do Trabalho"]
["2058-06-13","quinta-feira","Corpus Christi"]
["2058-09-07","sábado","Independência do Brasil"]
["2058-10-12","sábado","Nossa Sr.a Aparecida - Padroeira do Brasil"]
["2058-11-02","sábado","Finados"]
["2058-11-15","sexta-feira","Proclamação da República"]
["2058-11-20","quarta-feira","Dia Nacional de Zumbi e da Consciência Negra"]
["2058-12-25","quarta-feira","Natal"]
["2059-01-01","quarta-feira","Confraternização Universal"]
["2059-02-10","segunda-feira","Carnaval"]
["2059-02-11","terça-feira","Carnaval"]
["2059-03-28","sexta-feira","Paixão de Cristo"]
["2059-04-21","segunda-feira","Tiradentes"]
["2059-05-01","quinta-feira","Dia do Trabalho"]
["2059-05-29","quinta-feira","Corpus Christi"]
["2059-09-07","domingo","Independência do Brasil"]
["2059-10-12","domingo","Nossa Sr.a Aparecida - Padroeira do Brasil"]
["2059-11-02","domingo","Finados"]
["2059-11-15","sábado","Proclamação da República"]
["2059-11-20","quinta-feira","Dia Nacional de Zumbi e da Consciência Negra"]
["2059-12-25","quinta-feira","Natal"]
["2060-01-01","quinta-feira","Confraternização Universal"]
["2060-03-01","segunda-feira","Carnaval"]
["2060-03-02","terça-feira","Carnaval"]
["2060-04-16","sexta-feira","Paixão de Cristo"]
["2060-04-21","quarta-feira","Tiradentes"]
["2060-05-01","sábado","Dia do Trabalho"]
["2060-06-17","quinta-feira","Corpus Christi"]
["2060-09-07","terça-feira","Independência do Brasil"]
["2060-10-12","terça-feira","Nossa Sr.a Aparecida - Padroeira do Brasil"]
["2060-11-02","terça-feira","Finados"]
["2060-11-15","segunda-feira","Proclamação da República"]
["2060-11-20","sábado","Dia Nacional de Zumbi e da Consciência Negra"]
["2060-12-25","sábado","Natal"]
["2061-01-01","sábado","Confraternização Universal"]
["2061-02-21","segunda-feira","Carnaval"]
["2061-02-22","terça-feira","Carnaval"]
["2061-04-08","sexta-feira","Paixão de Cristo"]
["2061-04-21","quinta-feira","Tiradentes"]
["2061-05-01","domingo","Dia do Trabalho"]
["2061-06-09","quinta-feira","Corpus Christi"]
["2061-09-07","quarta-feira","Independência do Brasil"]
["2061-10-12","quarta-feira","Nossa Sr.a Aparecida - Padroeira do Brasil"]
["2061-11-02","quarta-feira","Finados"]
["2061-11-15","terça-feira","Proclamação da República"]
["2061-11-20","domingo","Dia Nacional de Zumbi e da Consciência Negra"]
["2061-12-25","domingo","Natal"]
["2062-01-01","domingo","Confraternização Universal"]
["2062-02-06","segunda-feira","Carnaval"]
["2062-02-07","terça-feira","Carnaval"]
["2062-03-24","sexta-feira","Paixão de Cristo"]
["2062-04-21","sexta-feira","Tiradentes"]
["2062-05-01","segunda-feira","Dia do Trabalho"]
["2062-05-25","quinta-feira","Corpus Christi"]
["2062-09-07","quinta-feira","Independência do Brasil"]
["2062-10-12","quinta-feira","Nossa Sr.a Aparecida - Padroeira do Brasil"]
["2062-11-02","quinta-feira","Finados"]
["2062-11-15","quarta-feira","Proclamação da República"]
["2062-11-20","segunda-feira","Dia Nacional de Zumbi e da Consciência Negra"]
["2062-12-25","segunda-feira","Natal"]
["2063-01-01","segunda-feira","Confraternização Universal"]
["2063-02-26","segunda-feira","Carnaval"]
["2063-02-27","terça-feira","Carnaval"]
["2063-04-13","sexta-feira","Paixão de Cristo"]
["2063-04-21","sábado","Tiradentes"]
["2063-05-01","terça-feira","Dia do Trabalho"]
["2063-06-14","quinta-feira","Corpus Christi"]
["2063-09-07","sexta-feira","Independência do Brasil"]
["2063-10-12","sexta-feira","Nossa Sr.a Aparecida - Padroeira do Brasil"]
["2063-11-02","sexta-feira","Finados"]
["2063-11-15","quinta-feira","Proclamação da República"]
["2063-11-20","terça-feira","Dia Nacional de Zumbi e da Consciência Negra"]
["2063-12-25","terça-feira","Natal"]
["2064-01-01","terça-feira","Confraternização Universal"]
["2064-02-18","segunda-feira","Carnaval"]
["2064-02-19","terça-feira","Carnaval"]
["2064-04-04","sexta-feira","Paixão de Cristo"]
["2064-04-21","segunda-feira","Tiradentes"]
["2064-05-01","quinta-feira","Dia do Trabalho"]
["2064-06-05","quinta-feira","Corpus Christi"]
["2064-09-07","domingo","Independência do Brasil"]
["2064-10-12","domingo","Nossa Sr.a Aparecida - Padroeira do Brasil"]
["2064-11-02","domingo","Finados"]
["2064-11-15","sábado","Proclamação da República"]
["2064-11-20","quinta-feira","Dia Nacional de Zumbi e da Consciência Negra"]
["2064-12-25","quinta-feira","Natal"]
["2065-01-01","quinta-feira","Confraternização Universal"]
["2065-02-09","segunda-feira","Carnaval"]
["2065-02-10","terça-feira","Carnaval"]
["2065-03-27","sexta-feira","Paixão de Cristo"]
["2065-04-21","terça-feira","Tiradentes"]
["2065-05-01","sexta-feira","Dia do Trabalho"]
["2065-05-28","quinta-feira","Corpus Christi"]
["2065-09-07","segunda-feira","Independência do Brasil"]
["2065-10-12","segunda-feira","Nossa Sr.a Aparecida - Padroeira do Brasil"]
["2065-11-02","segunda-feira","Finados"]
["2065-11-15","domingo","Proclamação da República"]
["2065-11-20","sexta-feira","Dia Nacional de Zumbi e da Consciência Negra"]
["2065-12-25","sexta-feira","Natal"]
["2066-01-01","sexta-feira","Confraternização Universal"]
["2066-02-22","segunda-feira","Carnaval"]
["2066-02-23","terça-feira","Carnaval"]
["2066-04-09","sexta-feira","Paixão de Cristo"]
["2066-04-21","quarta-feira","Tiradentes"]
["2066-05-01","sábado","Dia do Trabalho"]
["2066-06-10","quinta-feira","Corpus Christi"]
["2066-09-07","terça-feira","Independência do Brasil"]
["2066-10-12","terça-feira","Nossa Sr.a Aparecida - Padroeira do Brasil"]
["2066-11-02","terça-feira","Finados"]
["2066-11-15","segunda-feira","Proclamação da República"]
["2066-11-20","sábado","Dia Nacional de Zumbi e da Consciência Negra"]
["2066-12-25","sábado","Natal"]
["2067-01-01","sábado","Confraternização Universal"]
["2067-02-14","segunda-feira","Carnaval"]
["2067-02-15","terça-feira","Carnaval"]
["2067-04-01","sexta-feira","Paixão de Cristo"]
["2067-04-21","quinta-feira","Tiradentes"]
["2067-05-01","domingo","Dia do Trabalho"]
["2067-06-02","quinta-feira","Corpus Christi"]
["2067-09-07","quarta-feira","Independência do Brasil"]
["2067-10-12","quarta-feira","Nossa Sr.a Aparecida - Padroeira do Brasil"]
["2067-11-02","quarta-feira","Finados"]
["2067-11-15","terça-feira","Proclamação da República"]
["2067-11-20","domingo","Dia Nacional de Zumbi e da Consciência Negra"]
["2067-12-25","domingo","Natal"]
["2068-01-01","domingo","Confraternização Universal"]
["2068-03-05","segunda-feira","Carnaval"]
["2068-03-06","terça-feira","Carnaval"]
["2068-04-20","sexta-feira","Paixão de Cristo"]
["2068-04-21","sábado","Tiradentes"]
["2068-05-01","terça-feira","Dia do Trabalho"]
["2068-06-21","quinta-feira","Corpus Christi"]
["2068-09-07","sexta-feira","Independência do Brasil"]
["2068-10-12","sexta-feira","Nossa Sr.a Aparecida - Padroeira do Brasil"]
["2068-11-02","sexta-feira","Finados"]
["2068-11-15","quinta-feira","Proclamação da República"]
["2068-11-20","terça-feira","Dia Nacional de Zumbi e da Consciência Negra"]
["2068-12-25","terça-feira","Natal"]
["2069-01-01","terça-feira","Confraternização Universal"]
["2069-02-25","segunda-feira","Carnaval"]
["2069-02-26","terça-feira","Carnaval"]
["2069-04-12","sexta-feira","Paixão de Cristo"]
["2069-04-21","domingo","Tiradentes"]
["2069-05-01","quarta-feira","Dia do Trabalho"]
["2069-06-13","quinta-feira","Corpus Christi"]
["2069-09-07","sábado","Independência do Brasil"]
["2069-10-12","sábado","Nossa Sr.a Aparecida - Padroeira do Brasil"]
["2069-11-02","sábado","Finados"]
["2069-11-15","sexta-feira","Proclamação da República"]
["2069-11-20","quarta-feira","Dia Nacional de Zumbi e da Consciência Negra"]
["2069-12-25","quarta-feira","Natal"]
["2070-01-01","quarta-feira","Confraternização Universal"]
["2070-02-10","segunda-feira","Carnaval"]
["2070-02-11","terça-feira","Carnaval"]
["2070-03-28","sexta-feira","Paixão de Cristo"]
["2070-04-21","segunda-feira","Tiradentes"]
["2070-05-01","quinta-feira","Dia do Trabalho"]
["2070-05-29","quinta-feira","Corpus Christi"]
["2070-09-07","domingo","Independência do Brasil"]
["2070-10-12","domingo","Nossa Sr.a Aparecida - Padroeira do Brasil"]
["2070-11-02","domingo","Finados"]
["2070-11-15","sábado","Proclamação da República"]
["2070-11-20","quinta-feira","Dia Nacional de Zumbi e da Consciência Negra"]
["2070-12-25","quinta-feira","Natal"]
["2071-01-01","quinta-feira","Confraternização Universal"]
["2071-03-02","segunda-feira","Carnaval"]
["2071-03-03","terça-feira","Carnaval"]
["2071-04-17","sexta-feira","Paixão de Cristo"]
["2071-04-21","terça-feira","Tiradentes"]
["2071-05-01","sexta-feira","Dia do Trabalho"]
["2071-06-18","quinta-feira","Corpus Christi"]
["2071-09-07","segunda-feira","Independência do Brasil"]
["2071-10-12","segunda-feira","Nossa Sr.a Aparecida - Padroeira do Brasil"]
["2071-11-02","segunda-feira","Finados"]
["2071-11-15","domingo","Proclamação da República"]
["2071-11-20","sexta-feira","Dia Nacional de Zumbi e da Consciência Negra"]
["2071-12-25","sexta-feira","Natal"]
["2072-01-01","sexta-feira","Confraternização Universal"]
["2072-02-22","segunda-feira","Carnaval"]
["2072-02-23","terça-feira","Carnaval"]
["2072-04-08","sexta-feira","Paixão de Cristo"]
["2072-04-21","quinta-feira","Tiradentes"]
["2072-05-01","domingo","Dia do Trabalho"]
["2072-06-09","quinta-feira","Corpus Christi"]
["2072-09-07","quarta-feira","Independência do Brasil"]
["2072-10-12","quarta-feira","Nossa Sr.a Aparecida - Padroeira do Brasil"]
["2072-11-02","quarta-feira","Finados"]
["2072-11-15","terça-feira","Proclamação da República"]
["2072-11-20","domingo","Dia Nacional de Zumbi e da Consciência Negra"]
["2072-12-25","domingo","Natal"]
["2073-01-01","domingo","Confraternização Universal"]
["2073-02-06","segunda-feira","Carnaval"]
["2073-02-07","terça-feira","Carnaval"]
["2073-03-24","sexta-feira","Paixão de Cristo"]
["2073-04-21","sexta-feira","Tiradentes"]
["2073-05-01","segunda-feira","Dia do Trabalho"]
["2073-05-25","quinta-feira","Corpus Christi"]
["2073-09-07","quinta-feira","Independência do Brasil"]
["2073-10-12","quinta-feira","Nossa Sr.a Aparecida - Padroeira do Brasil"]
["2073-11-02","quinta-feira","Finados"]
["2073-11-15","quarta-feira","Proclamação da República"]
["2073-11-20","segunda-feira","Dia Nacional de Zumbi e da Consciência Negra"]
["2073-12-25","segunda-feira","Natal"]
["2074-01-01","segunda-feira","Confraternização Universal"]
["2074-02-26","segunda-feira","Carnaval"]
["2074-02-27","terça-feira","Carnaval"]
["2074-04-13","sexta-feira","Paixão de Cristo"]
["2074-04-21","sábado","Tiradentes"]
["2074-05-01","terça-feira","Dia do Trabalho"]
["2074-06-14","quinta-feira","Corpus Christi"]
["2074-09-07","sexta-feira","Independência do Brasil"]
["2074-10-12","sexta-feira","Nossa Sr.a Aparecida - Padroeira do Brasil"]
["2074-11-02","sexta-feira","Finados"]
["2074-11-15","quinta-feira","Proclamação da República"]
["2074-11-20","terça-feira","Dia Nacional de Zumbi e da Consciência Negra"]
["2074-12-25","terça-feira","Natal"]
["2075-01-01","terça-feira","Confraternização Universal"]
["2075-02-18","segunda-feira","Carnaval"]
["2075-02-19","terça-feira","Carnaval"]
["2075-04-05","sexta-feira","Paixão de Cristo"]
["2075-04-21","domingo","Tiradentes"]
["2075-05-01","quarta-feira","Dia do Trabalho"]
["2075-06-06","quinta-feira","Corpus Christi"]
["2075-09-07","sábado","Independência do Brasil"]
["2075-10-12","sábado","Nossa Sr.a Aparecida - Padroeira do Brasil"]
["2075-11-02","sábado","Finados"]
["2075-11-15","sexta-feira","Proclamação da República"]
["2075-11-20","quarta-feira","Dia Nacional de Zumbi e da Consciência Negra"]
["2075-12-25","quarta-feira","Natal"]
["2076-01-01","quarta-feira","Confraternização Universal"]
["2076-03-02","segunda-feira","Carnaval"]
["2076-03-03","terça-feira","Carnaval"]
["2076-04-17","sexta-feira","Paixão de Cristo"]
["2076-04-21","terça-feira","Tiradentes"]
["2076-05-01","sexta-feira","Dia do Trabalho"]
["2076-06-18","quinta-feira","Corpus Christi"]
["2076-09-07","segunda-feira","Independência do Brasil"]
["2076-10-12","segunda-feira","Nossa Sr.a Aparecida - Padroeira do Brasil"]
["2076-11-02","segunda-feira","Finados"]
["2076-11-15","domingo","Proclamação da República"]
["2076-11-20","sexta-feira","Dia Nacional de Zumbi e da Consciência Negra"]
["2076-12-25","sexta-feira","Natal"]
["2077-01-01","sexta-feira","Confraternização Universal"]
["2077-02-22","segunda-feira","Carnaval"]
["2077-02-23","terça-feira","Carnaval"]
["2077-04-09","sexta-feira","Paixão de Cristo"]
["2077-04-21","quarta-feira","Tiradentes"]
["2077-05-01","sábado","Dia do Trabalho"]
["2077-06-10","quinta-feira","Corpus Christi"]
["2077-09-07","terça-feira","Independência do Brasil"]
["2077-10-12","terça-feira","Nossa Sr.a Aparecida - Padroeira do Brasil"]
["2077-11-02","terça-feira","Finados"]
["2077-11-15","segunda-feira","Proclamação da República"]
["2077-11-20","sábado","Dia Nacional de Zumbi e da Consciência Negra"]
["2077-12-25","sábado","Natal"]
["2078-01-01","sábado","Confraternização Universal"]
["2078-02-14","segunda-feira","Carnaval"]
["2078-02-15","terça-feira","Carnaval"]
["2078-04-01","sexta-feira","Paixão de Cristo"]
["2078-04-21","quinta-feira","Tiradentes"]
["2078-05-01","domingo","Dia do Trabalho"]
["2078-06-02","quinta-feira","Corpus Christi"]
["2078-09-07","quarta-feira","Independência do Brasil"]
["2078-10-12","quarta-feira","Nossa Sr.a Aparecida - Padroeira do Brasil"]
["2078-11-02","quarta-feira","Finados"]
["2078-11-15","terça-feira","Proclamação da República"]
["2078-11-20","domingo","Dia Nacional de Zumbi e da Consciência Negra"]
["2078-12-25","domingo","Natal"]
["2079-01-01","domingo","Confraternização Universal"]
["2079-03-06","segunda-feira","Carnaval"]
["2079-03-07","terça-feira","Carnaval"]
["2079-04-21","sexta-feira","Paixão de Cristo"]
["2079-04-21","sexta-feira","Tiradentes"]
["2079-05-01","segunda-feira","Dia do Trabalho"]
["2079-06-22","quinta-feira","Corpus Christi"]
["2079-09-07","quinta-feira","Independência do Brasil"]
["2079-10-12","quinta-feira","Nossa Sr.a Aparecida - Padroeira do Brasil"]
["2079-11-02","quinta-feira","Finados"]
["2079-11-15","quarta-feira","Proclamação da República"]
["2079-11-20","segunda-feira","Dia Nacional de Zumbi e da Consciência Negra"]
["2079-12-25","segunda-feira","Natal"]
["2080-01-01","segunda-feira","Confraternização Universal"]
["2080-02-19","segunda-feira","Carnaval"]
["2080-02-20","terça-feira","Carnaval"]
["2080-04-05","sexta-feira","Paixão de Cristo"]
["2080-04-21","domingo","Tiradentes"]
["2080-05-01","quarta-feira","Dia do Trabalho"]
["2080-06-06","quinta-feira","Corpus Christi"]
["2080-09-07","sábado","Independência do Brasil"]
["2080-10-12","sábado","Nossa Sr.a Aparecida - Padroeira do Brasil"]
["2080-11-02","sábado","Finados"]
["2080-11-15","sexta-feira","Proclamação da República"]
["2080-11-20","quarta-feira","Dia Nacional de Zumbi e da Consciência Negra"]
["2080-12-25","quarta-feira","Natal"]
["2081-01-01","quarta-feira","Confraternização Universal"]
["2081-02-10","segunda-feira","Carnaval"]
["2081-02-11","terça-feira","Carnaval"]
["2081-03-28","sexta-feira","Paixão de Cristo"]
["2081-04-21","segunda-feira","Tiradentes"]
["2081-05-01","quinta-feira","Dia do Trabalho"]
["2081-05-29","quinta-feira","Corpus Christi"]
["2081-09-07","domingo","Independência do Brasil"]
["2081-10-12","domingo","Nossa Sr.a Aparecida - Padroeira do Brasil"]
["2081-11-02","domingo","Finados"]
["2081-11-15","sábado","Proclamação da República"]
["2081-11-20","quinta-feira","Dia Nacional de Zumbi e da Consciência Negra"]
["2081-12-25","quinta-feira","Natal"]
["2082-01-01","quinta-feira","Confraternização Universal"]
["2082-03-02","segunda-feira","Carnaval"]
["2082-03-03","terça-feira","Carnaval"]
["2082-04-17","sexta-feira","Paixão de Cristo"]
["2082-04-21","terça-feira","Tiradentes"]
["2082-05-01","sexta-feira","Dia do Trabalho"]
["2082-06-18","quinta-feira","Corpus Christi"]
["2082-09-07","segunda-feira","Independência do Brasil"]
["2082-10-12","segunda-feira","Nossa Sr.a Aparecida - Padroeira do Brasil"]
["2082-11-02","segunda-feira","Finados"]
["2082-11-15","domingo","Proclamação da República"]
["2082-11-20","sexta-feira","Dia Nacional de Zumbi e da Consciência Negra"]
["2082-12-25","sexta-feira","Natal"]
["2083-01-01","sexta-feira","Confraternização Universal"]
["2083-02-15","segunda-feira","Carnaval"]
["2083-02-16","terça-feira","Carnaval"]
["2083-04-02","sexta-feira","Paixão de Cristo"]
["2083-04-21","quarta-feira","Tiradentes"]
["2083-05-01","sábado","Dia do Trabalho"]
["2083-06-03","quinta-feira","Corpus Christi"]
["2083-09-07","terça-feira","Independência do Brasil"]
["2083-10-12","terça-feira","Nossa Sr.a Aparecida - Padroeira do Brasil"]
["2083-11-02","terça-feira","Finados"]
["2083-11-15","segunda-feira","Proclamação da República"]
["2083-11-20","sábado","Dia Nacional de Zumbi e da Consciência Negra"]
["2083-12-25","sábado","Natal"]
["2084-01-01","sábado","Confraternização Universal"]
["2084-02-07","segunda-feira","Carnaval"]
["2084-02-08","terça-feira","Carnaval"]
["2084-03-24","sexta-feira","Paixão de Cristo"]
["2084-04-21","sexta-feira","Tiradentes"]
["2084-05-01","segunda-feira","Dia do Trabalho"]
["2084-05-25","quinta-feira","Corpus Christi"]
["2084-09-07","quinta-feira","Independência do Brasil"]
["2084-10-12","quinta-feira","Nossa Sr.a Aparecida - Padroeira do Brasil"]
["2084-11-02","quinta-feira","Finados"]
["2084-11-15","quarta-feira","Proclamação da República"]
["2084-11-20","segunda-feira","Dia Nacional de Zumbi e da Consciência Negra"]
["2084-12-25","segunda-feira","Natal"]
["2085-01-01","segunda-feira","Confraternização Universal"]
["2085-02-26","segunda-feira","Carnaval"]
["2085-02-27","terça-feira","Carnaval"]
["2085-04-13","sexta-feira","Paixão de Cristo"]
["2085-04-21","sábado","Tiradentes"]
["2085-05-01","terça-feira","Dia do Trabalho"]
["2085-06-14","quinta-feira","Corpus Christi"]
["2085-09-07","sexta-feira","Independência do Brasil"]
["2085-10-12","sexta-feira","Nossa Sr.a Aparecida - Padroeira do Brasil"]
["2085-11-02","sexta-feira","Finados"]
["2085-11-15","quinta-feira","Proclamação da República"]
["2085-11-20","terça-feira","Dia Nacional de Zumbi e da Consciência Negra"]
["2085-12-25","terça-feira","Natal"]
["2086-01-01","terça-feira","Confraternização Universal"]
["2086-02-11","segunda-feira","Carnaval"]
["2086-02-12","terça-feira","Carnaval"]
["2086-03-29","sexta-feira","Paixão de Cristo"]
["2086-04-21","domingo","Tiradentes"]
["2086-05-01","quarta-feira","Dia do Trabalho"]
["2086-05-30","quinta-feira","Corpus Christi"]
["2086-09-07","sábado","Independência do Brasil"]
["2086-10-12","sábado","Nossa Sr.a Aparecida - Padroeira do Brasil"]
["2086-11-02","sábado","Finados"]
["2086-11-15","sexta-feira","Proclamação da República"]
["2086-11-20","quarta-feira","Dia Nacional de Zumbi e da Consciência Negra"]
["2086-12-25","quarta-feira","Natal"]
["2087-01-01","quarta-feira","Confraternização Universal"]
["2087-03-03","segunda-feira","Carnaval"]
["2087-03-04","terça-feira","Carnaval"]
["2087-04-18","sexta-feira","Paixão de Cristo"]
["2087-04-21","segunda-feira","Tiradentes"]
["2087-05-01","quinta-feira","Dia do Trabalho"]
["2087-06-19","quinta-feira","Corpus Christi"]
["2087-09-07","domingo","Independência do Brasil"]
["2087-10-12","domingo","Nossa Sr.a Aparecida - Padroeira do Brasil"]
["2087-11-02","domingo","Finados"]
["2087-11-15","sábado","Proclamação da República"]
["2087-11-20","quinta-feira","Dia Nacional de Zumbi e da Consciência Negra"]
["2087-12-25","quinta-feira","Natal"]
["2088-01-01","quinta-feira","Confraternização Universal"]
["2088-02-23","segunda-feira","Carnaval"]
["2088-02-24","terça-feira","Carnaval"]
["2088-04-09","sexta-feira","Paixão de Cristo"]
["2088-04-21","quarta-feira","Tiradentes"]
["2088-05-01","sábado","Dia do Trabalho"]
["2088-06-10","quinta-feira","Corpus Christi"]
["2088-09-07","terça-feira","Independência do Brasil"]
["2088-10-12","terça-feira","Nossa Sr.a Aparecida - Padroeira do Brasil"]
["2088-11-02","terça-feira","Finados"]
["2088-11-15","segunda-feira","Proclamação da República"]
["2088-11-20","sábado","Dia Nacional de Zumbi e da Consciência Negra"]
["2088-12-25","sábado","Natal"]
["2089-01-01","sábado","Confraternização Universal"]
["2089-02-14","segunda-feira","Carnaval"]
["2089-02-15","terça-feira","Carnaval"]
["2089-04-01","sexta-feira","Paixão de Cristo"]
["2089-04-21","quinta-feira","Tiradentes"]
["2089-05-01","domingo","Dia do Trabalho"]
["2089-06-02","quinta-feira","Corpus Christi"]
["2089-09-07","quarta-feira","Independência do Brasil"]
["2089-10-12","quarta-feira","Nossa Sr.a Aparecida - Padroeira do Brasil"]
["2089-11-02","quarta-feira","Finados"]
["2089-11-15","terça-feira","Proclamação da República"]
["2089-11-20","domingo","Dia Nacional de Zumbi e da Consciência Negra"]
["2089-12-25","domingo","Natal"]
["2090-01-01","domingo","Confraternização Universal"]
["2090-02-27","segunda-feira","Carnaval"]
["2090-02-28","terça-feira","Carnaval"]
["2090-04-14","sexta-feira","Paixão de Cristo"]
["2090-04-21","sexta-feira","Tiradentes"]
["2090-05-01","segunda-feira","Dia do Trabalho"]
["2090-06-15","quinta-feira","Corpus Christi"]
["2090-09-07","quinta-feira","Independência do Brasil"]
["2090-10-12","quinta-feira","Nossa Sr.a Aparecida - Padroeira do Brasil"]
["2090-11-02","quinta-feira","Finados"]
["2090-11-15","quarta-feira","Proclamação da República"]
["2090-11-20","segunda-feira","Dia Nacional de Zumbi e da Consciência Negra"]
["2090-12-25","segunda-feira","Natal"]
["2091-01-01","segunda-feira","Confraternização Universal"]
["2091-02-19","segunda-feira","Carnaval"]
["2091-02-20","terça-feira","Carnaval"]
["2091-04-06","sexta-feira","Paixão de Cristo"]
["2091-04-21","sábado","Tiradentes"]
["2091-05-01","terça-feira","Dia do Trabalho"]
["2091-06-07","quinta-feira","Corpus Christi"]
["2091-09-07","sexta-feira","Independência do Brasil"]
["2091-10-12","sexta-feira","Nossa Sr.a Aparecida - Padroeira do Brasil"]
["2091-11-02","sexta-feira","Finados"]
["2091-11-15","quinta-feira","Proclamação da República"]
["2091-11-20","terça-feira","Dia Nacional de Zumbi e da Consciência Negra"]
["2091-12-25","terça-feira","Natal"]
["2092-01-01","terça-feira","Confraternização Universal"]
["2092-02-11","segunda-feira","Carnaval"]
["2092-02-12","terça-feira","Carnaval"]
["2092-03-28","sexta-feira","Paixão de Cristo"]
["2092-04-21","segunda-feira","Tiradentes"]
["2092-05-01","quinta-feira","Dia do Trabalho"]
["2092-05-29","quinta-feira","Corpus Christi"]
["2092-09-07","domingo","Independência do Brasil"]
["2092-10-12","domingo","Nossa Sr.a Aparecida - Padroeira do Brasil"]
["2092-11-02","domingo","Finados"]
["2092-11-15","sábado","Proclamação da República"]
["2092-11-20","quinta-feira","Dia Nacional de Zumbi e da Consciência Negra"]
["2092-12-25","quinta-feira","Natal"]
["2093-01-01","quinta-feira","Confraternização Universal"]
["2093-02-23","segunda-feira","Carnaval"]
["2093-02-24","terça-feira","Carnaval"]
["2093-04-10","sexta-feira","Paixão de Cristo"]
["2093-04-21","terça-feira","Tiradentes"]
["2093-05-01","sexta-feira","Dia do Trabalho"]
["2093-06-11","quinta-feira","Corpus Christi"]
["2093-09-07","segunda-feira","Independência do Brasil"]
["2093-10-12","segunda-feira","Nossa Sr.a Aparecida - Padroeira do Brasil"]
["2093-11-02","segunda-feira","Finados"]
["2093-11-15","domingo","Proclamação da República"]
["2093-11-20","sexta-feira","Dia Nacional de Zumbi e da Consciência Negra"]
["2093-12-25","sexta-feira","Natal"]
["2094-01-01","sexta-feira","Confraternização Universal"]
["2094-02-15","segunda-feira","Carnaval"]
["2094-02-16","terça-feira","Carnaval"]
["2094-04-02","sexta-feira","Paixão de Cristo"]
["2094-04-21","quarta-feira","Tiradentes"]
["2094-05-01","sábado","Dia do Trabalho"]
["2094-06-03","quinta-feira","Corpus Christi"]
["2094-09-07","terça-feira","Independência do Brasil"]
["2094-10-12","terça-feira","Nossa Sr.a Aparecida - Padroeira do Brasil"]
["2094-11-02","terça-feira","Finados"]
["2094-11-15","segunda-feira","Proclamação da República"]
["2094-11-20","sábado","Dia Nacional de Zumbi e da Consciência Negra"]
["2094-12-25","sábado","Natal"]
["2095-01-01","sábado","Confraternização Universal"]
["2095-03-07","segunda-feira","Carnaval"]
["2095-03-08","terça-feira","Carnaval"]
["2095-04-21","quinta-feira","Tiradentes"]
["2095-04-22","sexta-feira","Paixão de Cristo"]
["2095-05-01","domingo","Dia do Trabalho"]
["2095-06-23","quinta-feira","Corpus Christi"]
["2095-09-07","quarta-feira","Independência do Brasil"]
["2095-10-12","quarta-feira","Nossa Sr.a Aparecida - Padroeira do Brasil"]
["2095-11-02","quarta-feira","Finados"]
["2095-11-15","terça-feira","Proclamação da República"]
["2095-11-20","domingo","Dia Nacional de Zumbi e da Consciência Negra"]
["2095-12-25","domingo","Natal"]
["2096-01-01","domingo","Confraternização Universal"]
["2096-02-27","segunda-feira","Carnaval"]
["2096-02-28","terça-feira","Carnaval"]
["2096-04-13","sexta-feira","Paixão de Cristo"]
["2096-04-21","sábado","Tiradentes"]
["2096-05-01","terça-feira","Dia do Trabalho"]
["2096-06-14","quinta-feira","Corpus Christi"]
["2096-09-07","sexta-feira","Independência do Brasil"]
["2096-10-12","sexta-feira","Nossa Sr.a Aparecida - Padroeira do Brasil"]
["2096-11-02","sexta-feira","Finados"]
["2096-11-15","quinta-feira","Proclamação da República"]
["2096-11-20","terça-feira","Dia Nacional de Zumbi e da Consciência Negra"]
["2096-12-25","terça-feira","Natal"]
["2097-01-01","terça-feira","Confraternização Universal"]
["2097-02-11","segunda-feira","Carnaval"]
["2097-02-12","terça-feira","Carnaval"]
["2097-03-29","sexta-feira","Paixão de Cristo"]
["2097-04-21","domingo","Tiradentes"]
["2097-05-01","quarta-feira","Dia do Trabalho"]
["2097-05-30","quinta-feira","Corpus Christi"]
["2097-09-07","sábado","Independência do Brasil"]
["2097-10-12","sábado","Nossa Sr.a Aparecida - Padroeira do Brasil"]
["2097-11-02","sábado","Finados"]
["2097-11-15","sexta-feira","Proclamação da República"]
["2097-11-20","quarta-feira","Dia Nacional de Zumbi e da Consciência Negra"]
["2097-12-25","quarta-feira","Natal"]
["2098-01-01","quarta-feira","Confraternização Universal"]
["2098-03-03","segunda-feira","Carnaval"]
["2098-03-04","terça-feira","Carnaval"]
["2098-04-18","sexta-feira","Paixão de Cristo"]
["2098-04-21","segunda-feira","Tiradentes"]
["2098-05-01","quinta-feira","Dia do Trabalho"]
["2098-06-19","quinta-feira","Corpus Christi"]
["2098-09-07","domingo","Independência do Brasil"]
["2098-10-12","domingo","Nossa Sr.a Aparecida - Padroeira do Brasil"]
["2098-11-02","domingo","Finados"]
["2098-11-15","sábado","Proclamação da República"]
["2098-11-20","quinta-feira","Dia Nacional de Zumbi e da Consciência Negra"]
["2098-12-25","quinta-feira","Natal"]
["2099-01-01","quinta-feira","Confraternização Universal "]
["2099-02-23","segunda-feira","Carnaval"]
["2099-02-24","terça-feira","Carnaval"]
["2099-04-10","sexta-feira","Paixão de Cristo"]
["2099-04-21","terça-feira","Tiradentes"]
["2099-05-01","sexta-feira","Dia do Trabalho"]
["2099-06-11","quinta-feira","Corpus Christi"]
["2099-09-07","segunda-feira","Independência do Brasil"]
["2099-10-12","segunda-feira","Nossa Sr.a Aparecida - Padroeira do Brasil"]
["2099-11-02","segunda-feira","Finados"]
["2099-11-15","domingo","Proclamação da República"]
["2099-11-20","sexta-feira","Dia Nacional de Zumbi e da Consciência Negra"]
["2099-12-25","sexta-feira","Natal"]