{"text_format":"1","workbook":"xlsx","n_sheets":4,"sheets":["Simulador Port","Planilha 1","PZO","VL_PARC"],"not_rendered":{"charts":0,"images":0,"macros":0,"external_links":0,"defined_names":0,"comments":0,"pivot_tables":0},"unopened":[],"bounds":{"document_bytes":16777216,"sheet_cells":100000,"rows_first":2000,"rows_last":500,"rows_between":2000,"halvings":0,"cell_chars":16384,"cell_head_chars":4096},"cells_cut":0,"cells_raw":0,"read":"whole","date_system":"1900"}

{"sheet":"Simulador Port","index":0,"n_rows":26,"n_cols":17,"rows_kept":26,"cut":false,"hidden":false,"merged":[]}
[null,null,null,null,null,null,null,null,null,null,null,null,null,null,"V.20250011"]
[null,"CONVÊNIO","INSS"]
[null,"Prazo simulado (meses)",96]
[]
[]
[null,null,null,null,"Observação",null,null,"TABELA PORT",null,{"$f":"C18","v":"FLEX 1"},null,null,{"$f":"E18","v":"FLEX 1"}]
[null,"Data Saldo*",{"$f":"TODAY()","v":"2025-09-30"}]
[null,"Saldo Portado**",10000,{"$f":"IF('Planilha 1'!K8=\"\",\"\",'Planilha 1'!K8)","v":""},null,null,null,null,null,{"$f":"C20","v":"1. Otimiza Pzo *"},null,null,{"$f":"E20","v":"2.Redução Vlr Parcela**"}]
[null,"Valor Parcela",250,null,null,null,null,"Tabela",null,"Val Fin Novo","Troco",null,"Val Fin Novo","Troco"]
[null,"Nº de Parcelas Restantes",60,{"$f":"IF('Planilha 1'!K10=\"\",\"\",'Planilha 1'!K10)","v":""},null,null,1,{"$f":"IF('Planilha 1'!M8=\"\",\"\",'Planilha 1'!M8)","v":"INSS RfnPort Tx1,599%~1,550% Flex5"},null,{"$f":"IF('Planilha 1'!O8=\"\",\"\",'Planilha 1'!O8)","v":12195.164292716507},{"$f":"IF('Planilha 1'!P8=\"\",\"\",'Planilha 1'!P8)","v":2108.3234634141481},null,{"$f":"IF('Planilha 1'!Q8=\"\",\"\",'Planilha 1'!Q8)","v":12195.164292716507},{"$f":"IF('Planilha 1'!R8=\"\",\"\",'Planilha 1'!R8)","v":2108.3234634141481}]
[null,"Taxa de Juros",{"$f":"IFERROR('Planilha 1'!J17,\"\")","v":1.4065127144978096E-2},{"$f":"IF('Planilha 1'!K17=\"\",\"\",'Planilha 1'!K17)","v":""},null,null,{"$f":"G10+1","v":2},{"$f":"IF('Planilha 1'!M9=\"\",\"\",'Planilha 1'!M9)","v":""},null,{"$f":"IF('Planilha 1'!O9=\"\",\"\",'Planilha 1'!O9)","v":""},{"$f":"IF('Planilha 1'!P9=\"\",\"\",'Planilha 1'!P9)","v":""},null,{"$f":"IF('Planilha 1'!Q9=\"\",\"\",'Planilha 1'!Q9)","v":""},{"$f":"IF('Planilha 1'!R9=\"\",\"\",'Planilha 1'!R9)","v":""}]
[null,null,null,{"$f":"'Planilha 1'!T18","v":""},null,null,{"$f":"G11+1","v":3},{"$f":"IF('Planilha 1'!M10=\"\",\"\",'Planilha 1'!M10)","v":""},null,{"$f":"IF('Planilha 1'!O10=\"\",\"\",'Planilha 1'!O10)","v":""},{"$f":"IF('Planilha 1'!P10=\"\",\"\",'Planilha 1'!P10)","v":""},null,{"$f":"IF('Planilha 1'!Q10=\"\",\"\",'Planilha 1'!Q10)","v":""},{"$f":"IF('Planilha 1'!R10=\"\",\"\",'Planilha 1'!R10)","v":""}]
[null,"*Data Saldo = data de consulta do valor",null,null,null,null,4,{"$f":"IF('Planilha 1'!M11=\"\",\"\",'Planilha 1'!M11)","v":""},null,{"$f":"IF('Planilha 1'!O11=\"\",\"\",'Planilha 1'!O11)","v":""},{"$f":"IF('Planilha 1'!P11=\"\",\"\",'Planilha 1'!P11)","v":""},null,{"$f":"IF('Planilha 1'!Q11=\"\",\"\",'Planilha 1'!Q11)","v":""},{"$f":"IF('Planilha 1'!R11=\"\",\"\",'Planilha 1'!R11)","v":""}]
[null,"**Saldo Portado = valor informado do banco origem",null,null,null,null,5,{"$f":"IF('Planilha 1'!M12=\"\",\"\",'Planilha 1'!M12)","v":""},null,{"$f":"IF('Planilha 1'!O12=\"\",\"\",'Planilha 1'!O12)","v":""},{"$f":"IF('Planilha 1'!P12=\"\",\"\",'Planilha 1'!P12)","v":""},null,{"$f":"IF('Planilha 1'!Q12=\"\",\"\",'Planilha 1'!Q12)","v":""},{"$f":"IF('Planilha 1'!R12=\"\",\"\",'Planilha 1'!R12)","v":""}]
[null,null,null,null,null,null,6,{"$f":"IF('Planilha 1'!M13=\"\",\"\",'Planilha 1'!M13)","v":""},null,{"$f":"IF('Planilha 1'!O13=\"\",\"\",'Planilha 1'!O13)","v":""},{"$f":"IF('Planilha 1'!P13=\"\",\"\",'Planilha 1'!P13)","v":""},null,{"$f":"IF('Planilha 1'!Q13=\"\",\"\",'Planilha 1'!Q13)","v":""},{"$f":"IF('Planilha 1'!R13=\"\",\"\",'Planilha 1'!R13)","v":""}]
[null,null,null,null,null,null,7,{"$f":"IF('Planilha 1'!M14=\"\",\"\",'Planilha 1'!M14)","v":""},null,{"$f":"IF('Planilha 1'!O14=\"\",\"\",'Planilha 1'!O14)","v":""},{"$f":"IF('Planilha 1'!P14=\"\",\"\",'Planilha 1'!P14)","v":""},null,{"$f":"IF('Planilha 1'!Q14=\"\",\"\",'Planilha 1'!Q14)","v":""},{"$f":"IF('Planilha 1'!R14=\"\",\"\",'Planilha 1'!R14)","v":""}]
[null,null,null,null,null,null,8,{"$f":"IF('Planilha 1'!M15=\"\",\"\",'Planilha 1'!M15)","v":""},null,{"$f":"IF('Planilha 1'!O15=\"\",\"\",'Planilha 1'!O15)","v":""},{"$f":"IF('Planilha 1'!P15=\"\",\"\",'Planilha 1'!P15)","v":""},null,{"$f":"IF('Planilha 1'!Q15=\"\",\"\",'Planilha 1'!Q15)","v":""},{"$f":"IF('Planilha 1'!R15=\"\",\"\",'Planilha 1'!R15)","v":""}]
[null,"TABELA PORT",{"$f":"UPPER(IFERROR('Planilha 1'!I26,\"\"))","v":"FLEX 1"},null,{"$f":"UPPER(IFERROR('Planilha 1'!I27,\"\"))","v":"FLEX 1"},null,9,{"$f":"IF('Planilha 1'!M16=\"\",\"\",'Planilha 1'!M16)","v":""},null,{"$f":"IF('Planilha 1'!O16=\"\",\"\",'Planilha 1'!O16)","v":""},{"$f":"IF('Planilha 1'!P16=\"\",\"\",'Planilha 1'!P16)","v":""},null,{"$f":"IF('Planilha 1'!Q16=\"\",\"\",'Planilha 1'!Q16)","v":""},{"$f":"IF('Planilha 1'!R16=\"\",\"\",'Planilha 1'!R16)","v":""}]
[null,null,null,null,null,null,10,{"$f":"IF('Planilha 1'!M17=\"\",\"\",'Planilha 1'!M17)","v":""},null,{"$f":"IF('Planilha 1'!O17=\"\",\"\",'Planilha 1'!O17)","v":""},{"$f":"IF('Planilha 1'!P17=\"\",\"\",'Planilha 1'!P17)","v":""},null,{"$f":"IF('Planilha 1'!Q17=\"\",\"\",'Planilha 1'!Q17)","v":""},{"$f":"IF('Planilha 1'!R17=\"\",\"\",'Planilha 1'!R17)","v":""}]
[null,null,"1. Otimiza Pzo *",null,"2.Redução Vlr Parcela**",null,11,{"$f":"IF('Planilha 1'!M18=\"\",\"\",'Planilha 1'!M18)","v":""},null,{"$f":"IF('Planilha 1'!O18=\"\",\"\",'Planilha 1'!O18)","v":""},{"$f":"IF('Planilha 1'!P18=\"\",\"\",'Planilha 1'!P18)","v":""},null,{"$f":"IF('Planilha 1'!Q18=\"\",\"\",'Planilha 1'!Q18)","v":""},{"$f":"IF('Planilha 1'!R18=\"\",\"\",'Planilha 1'!R18)","v":""}]
[null,"Prazo",{"$f":"IFERROR('Planilha 1'!BU31,\"\")","v":60},{"$f":"IF(C21<>C10,1,0)","v":0},{"$f":"IF(E23=\"\",\"\",'Planilha 1'!BZ16)","v":60},{"$f":"IF(E21<>C10,1,0)","v":0},12]
[null,"Valor Parcela",{"$f":"IFERROR('Planilha 1'!BU32,\"\")","v":250},{"$f":"IF(C22<>C9,1,0)","v":0},{"$f":"IF(E23=\"\",\"\",'Planilha 1'!BZ17)","v":250},{"$f":"IF(E22<>C9,1,0)","v":0}]
[null,"Taxa de Juros",{"$f":"IFERROR('Planilha 1'!BU33,\"\")","v":1.4065127144978096E-2},null,{"$f":"IFERROR('Planilha 1'!BS32,\"\")","v":1.4065127144978096E-2}]
[]
[null,null,null,null,null,null,null,null,null,null,null,null,null,null,null,null,"INSS"]
[null,null,null,null,null,null,null,null,null,null,null,null,null,null,null,null,"SIAPE"]

{"sheet":"Planilha 1","index":1,"n_rows":1297,"n_cols":154,"rows_kept":1297,"cut":false,"hidden":true,"merged":[]}
["IOF ad",{"$f":"ROUND(3%/365,6)","v":8.2000000000000001E-5},null,null,null,null,null,null,null,null,null,null,null,null,null,null,null,null,null,null,"TETO",null,{"$f":"J16","v":1.4065127144978096E-2},{"$f":"IF($P$2=$AH$4,AH1,AP1)","v":"INSS"},{"$f":"IF($P$2=$AH$4,AI1,AQ1)","v":1.35E-2},{"$f":"IF($P$2=$AH$4,AJ1,AR1)","v":1.8499999999999999E-2},{"$f":"IF($P$2=$AH$4,AK1,AS1)","v":"Port"},null,null,null,null,null,null,"INSS",1.35E-2,{"$f":"MAX(AI4:AJ15)","v":1.8499999999999999E-2},"Port",null,null,null,null,"SIAPE",1.6E-2,1.7999999999999999E-2,"Port"]
["IOF adic.",3.8E-3,null,null,null,null,null,"CONVÊNIO",null,null,null,null,null,null,null,{"$f":"'Simulador Port'!C2","v":"INSS"},null,null,null,null,"TAXA TETO PONDERADO",{"$f":"((W1*W2)+(Z1*(Z2-W2)))/P3","v":1.5728204465611309E-2},{"$f":"J10","v":60},null,null,{"$f":"P3","v":96},null,null,null,null,null,null,null,null,null,null,null,null,null,null,null,null,96,null,null,null,null,null,null,null,null,null,null,null,null,{"$f":"'Simulador Port'!C20","v":"1. Otimiza Pzo *"},null,{"$f":"'Simulador Port'!E20","v":"2.Redução Vlr Parcela**"}]
[null,null,null,null,null,null,null,null,null,null,null,null,null,null,"Prazo simulado (meses)",{"$f":"'Simulador Port'!C3","v":96},null,null,null,null,null,null,null,"Convenio","TxMax","TxMin","Nome",null,"Fator um jr","Novo Saldo","IOF","TROCO","VLR FIN","Convenio","TxMax","TxMin","Nome","Nome",null,null,null,"Convenio","TxMax","TxMin","Nome","Nome",null,null,null,null,"Convenio","TxMax","TxMin","Nome",null,"Val Fin Novo","Troco","Val Fin Novo","Troco"]
[null,null,null,null,null,null,null,null,null,null,null,null,null,null,null,null,null,null,null,null,"Torco min %",0,{"$f":"IF(PZO!W4+VL_PARC!W4>0,'Planilha 1'!W3+1,0)","v":0},{"$f":"IF($P$2=$AH$4,AH4,AP4)","v":"INSS"},{"$f":"IF($P$2=$AH$4,AI4,AQ4)","v":1.8499999999999999E-2},{"$f":"IF($P$2=$AH$4,AJ4,AR4)","v":1.78E-2},{"$f":"IF($P$2=$AH$4,AK4,AS4)","v":"Normal"},{"$f":"IF($P$2=$AH$4,AL4,AT4)","v":"INSS RfnPort Tx1,850%~1,780% Normal"},{"$f":"(1+MIN(Y4,$V$2))^(1/30)","v":1.0005203285932471},{"$f":"OFFSET($U$32,,ROW()-ROW($AD$4))","v":12195.164292716507},{"$f":"OFFSET($AH$29,,ROW()-ROW($AE$4))","v":86.840907176081586},{"$f":"AD4-AE4-$J$8","v":2108.3234634141481},{"$f":"SUM(AD4,AF4)","v":14303.487756130655},"INSS",1.8499999999999999E-2,1.78E-2,"Normal","INSS RfnPort Tx1,850%~1,780% Normal",null,null,null,"SIAPE",1.7989999999999999E-2,1.7989999999999999E-2,"Normal","SIAPE RfnPort Tx1.799 Normal Web",null,null,null,{"$f":"W4","v":0},{"$f":"X4","v":"INSS"},{"$f":"Y4","v":1.8499999999999999E-2},{"$f":"Z4","v":1.78E-2},{"$f":"AA4","v":"Normal"},{"$f":"AB4","v":"INSS RfnPort Tx1,850%~1,780% Normal"},{"$f":"IF(PZO!$W4=0,\"\",PZO!AD4)","v":""},{"$f":"IF(PZO!$W4=0,\"\",PZO!AF4)","v":""},{"$f":"IF(VL_PARC!$W4=0,\"\",VL_PARC!AD4)","v":""},{"$f":"IF(VL_PARC!$W4=0,\"\",VL_PARC!AF4)","v":""}]
[96,null,null,null,null,null,null,null,null,null,null,null,null,null,null,null,null,null,null,null,"Torco min R$",50,{"$f":"IF(PZO!W5+VL_PARC!W5>0,'Planilha 1'!W4+1,0)","v":0},{"$f":"IF($P$2=$AH$4,AH5,AP5)","v":"INSS"},{"$f":"IF($P$2=$AH$4,AI5,AQ5)","v":1.779E-2},{"$f":"IF($P$2=$AH$4,AJ5,AR5)","v":1.7399999999999999E-2},{"$f":"IF($P$2=$AH$4,AK5,AS5)","v":"Flex 1"},{"$f":"IF($P$2=$AH$4,AL5,AT5)","v":"INSS RfnPort Tx1,779%~1,740% Flex1"},{"$f":"(1+MIN(Y5,$V$2))^(1/30)","v":1.0005203285932471},{"$f":"OFFSET($U$32,,ROW()-ROW($AD$4))","v":12195.164292716507},{"$f":"OFFSET($AH$29,,ROW()-ROW($AE$4))","v":86.840907176081586},{"$f":"AD5-AE5-$J$8","v":2108.3234634141481},{"$f":"SUM(AD5,AF5)","v":14303.487756130655},"INSS",1.779E-2,1.7399999999999999E-2,"Flex 1","INSS RfnPort Tx1,779%~1,740% Flex1",null,null,null,"SIAPE",1.7979999999999999E-2,1.7499999999999998E-2,"Flex 1","SIAPE RfnPort Tx1.798 ~ 1.75 Flex 1 Web",null,null,null,{"$f":"W5","v":0},{"$f":"X5","v":"INSS"},1.779E-2,1.7399999999999999E-2,"Flex 1","INSS RfnPort Tx1,779%~1,740% Flex1",{"$f":"IF(PZO!$W5=0,\"\",PZO!AD5)","v":""},{"$f":"IF(PZO!$W5=0,\"\",PZO!AF5)","v":""},{"$f":"IF(VL_PARC!$W5=0,\"\",VL_PARC!AD5)","v":""},{"$f":"IF(VL_PARC!$W5=0,\"\",VL_PARC!AF5)","v":""}]
["INSS","INSS",96,null,null,null,null,null,null,null,"Observação",null,"Tabela",null,"Val Fin Novo","Troco",null,null,null,null,"Ticket Min",2000,{"$f":"IF(PZO!W6+VL_PARC!W6>0,'Planilha 1'!W5+1,0)","v":0},"INSS",1.7389999999999999E-2,1.7000000000000001E-2,{"$f":"IF($P$2=$AH$4,AK6,AS6)","v":"Flex 2"},"INSS RfnPort Tx1,739%~1,700% Flex2",1.0005203285932471,12195.164292716507,86.840907176081586,2108.3234634141481,14303.487756130655,"INSS",1.7389999999999999E-2,1.7000000000000001E-2,"Flex 2","INSS RfnPort Tx1,739%~1,700% Flex2",null,null,null,"SIAPE",1.7489999999999999E-2,1.6999999999999998E-2,"Flex 2","SIAPE RfnPort Tx1.749 ~ 1.70 Flex 2 Web",null,null,null,0,"INSS",1.7389999999999999E-2,1.7000000000000001E-2,"Flex 2","INSS RfnPort Tx1,739%~1,700% Flex2",{"$f":"IF(PZO!$W6=0,\"\",PZO!AD6)","v":""},{"$f":"IF(PZO!$W6=0,\"\",PZO!AF6)","v":""},{"$f":"IF(VL_PARC!$W6=0,\"\",VL_PARC!AD6)","v":""},{"$f":"IF(VL_PARC!$W6=0,\"\",VL_PARC!AF6)","v":""}]
["SIAPE","SIAPE",96,null,null,null,null,"Data Saldo",{"$f":"'Simulador Port'!C7","v":"2025-09-30"},{"$f":"TODAY()","v":"2025-09-30"},{"$f":"'Simulador Port'!D7","v":0},null,null,null,null,null,null,null,null,null,null,null,{"$f":"IF(PZO!W7+VL_PARC!W7>0,'Planilha 1'!W6+1,0)","v":0},"INSS",1.6990000000000002E-2,1.6500000000000001E-2,"Flex 3","INSS RfnPort Tx1,699%~1,650% Flex3",1.0005203285932471,12195.164292716507,86.840907176081586,2108.3234634141481,14303.487756130655,"INSS",1.6990000000000002E-2,1.6500000000000001E-2,"Flex 3","INSS RfnPort Tx1,699%~1,650% Flex3",null,null,null,"SIAPE",1.6990000000000002E-2,1.6500000000000001E-2,"Flex 3","SIAPE RfnPort Tx1.699 ~ 1.65 Flex 3 Web",null,null,null,0,"INSS",1.6990000000000002E-2,1.6500000000000001E-2,"Flex 3","INSS RfnPort Tx1,699%~1,650% Flex3",{"$f":"IF(PZO!$W7=0,\"\",PZO!AD7)","v":""},{"$f":"IF(PZO!$W7=0,\"\",PZO!AF7)","v":""},{"$f":"IF(VL_PARC!$W7=0,\"\",VL_PARC!AD7)","v":""},{"$f":"IF(VL_PARC!$W7=0,\"\",VL_PARC!AF7)","v":""}]
[null,null,null,null,null,null,null,"Saldo Portado",{"$f":"'Simulador Port'!C8","v":10000},{"$f":"SUM('Planilha 1'!J35:J131)","v":9999.9999221262769},{"$f":"T8","v":""},1,{"$f":"IFERROR(VLOOKUP(L8,$W$4:$AF$15,6,0),\"\")","v":"INSS RfnPort Tx1,599%~1,550% Flex5"},null,{"$f":"IFERROR(VLOOKUP(L8,$AX$4:$BG$15,7,0),\"\")","v":12195.164292716507},{"$f":"IFERROR(VLOOKUP(L8,$AX$4:$BG$15,8,0),\"\")","v":2108.3234634141481},{"$f":"IFERROR(VLOOKUP(L8,$AX$4:$BG$15,9,0),\"\")","v":12195.164292716507},{"$f":"IFERROR(VLOOKUP(L8,$AX$4:$BG$15,10,0),\"\")","v":2108.3234634141481},null,{"$f":"IFERROR(IF(OR((J17-I17)/I17>2%,(J17-I17)/I17<-2%),\"Saldo e Parcela não correspondem à taxa informada\",\"\"),\"\")","v":""},"TAXA TROCO",null,{"$f":"IF(PZO!W8+VL_PARC!W8>0,'Planilha 1'!W7+1,0)","v":0},"INSS",1.6490000000000001E-2,1.6E-2,"Flex 4","INSS RfnPort Tx1,649%~1,600% Flex4",1.0005203285932471,12195.164292716507,86.840907176081586,2108.3234634141481,14303.487756130655,"INSS",1.6490000000000001E-2,1.6E-2,"Flex 4","INSS RfnPort Tx1,649%~1,600% Flex4",null,null,null,null,null,null,null,null,null,null,null,0,"INSS",1.6490000000000001E-2,1.6E-2,"Flex 4","INSS RfnPort Tx1,649%~1,600% Flex4",{"$f":"IF(PZO!$W8=0,\"\",PZO!AD8)","v":""},{"$f":"IF(PZO!$W8=0,\"\",PZO!AF8)","v":""},{"$f":"IF(VL_PARC!$W8=0,\"\",VL_PARC!AD8)","v":""},{"$f":"IF(VL_PARC!$W8=0,\"\",VL_PARC!AF8)","v":""}]
[null,null,null,null,null,null,null,"Valor Parcela",{"$f":"'Simulador Port'!C9","v":250},{"$f":"I9","v":250},{"$f":"'Simulador Port'!D9","v":0},{"$f":"L8+1","v":2},{"$f":"IFERROR(VLOOKUP(L9,$W$4:$AF$15,6,0),\"\")","v":""},null,{"$f":"IFERROR(VLOOKUP(L9,$AX$4:$BG$15,7,0),\"\")","v":""},{"$f":"IFERROR(VLOOKUP(L9,$AX$4:$BG$15,8,0),\"\")","v":""},{"$f":"IFERROR(VLOOKUP(L9,$AX$4:$BG$15,9,0),\"\")","v":""},{"$f":"IFERROR(VLOOKUP(L9,$AX$4:$BG$15,10,0),\"\")","v":""},null,null,"TAXA Port MIN",{"$f":"IF(SUM(PZO!$W$4:$W$15,VL_PARC!$W$4:$W$15)=0,\"Refin Indisponivel\",\"\")","v":""},{"$f":"IF(PZO!W9+VL_PARC!W9>0,'Planilha 1'!W8+1,0)","v":1},"INSS",1.5990000000000001E-2,1.55E-2,"Flex 5","INSS RfnPort Tx1,599%~1,550% Flex5",1.0005203285932471,12195.164292716507,86.840907176081586,2108.3234634141481,14303.487756130655,"INSS",1.5990000000000001E-2,1.55E-2,"Flex 5","INSS RfnPort Tx1,599%~1,550% Flex5",null,null,null,null,null,null,null,null,null,null,null,1,"INSS",1.5990000000000001E-2,1.55E-2,"Flex 5","INSS RfnPort Tx1,599%~1,550% Flex5",{"$f":"IF(PZO!$W9=0,\"\",PZO!AD9)","v":12195.164292716507},{"$f":"IF(PZO!$W9=0,\"\",PZO!AF9)","v":2108.3234634141481},{"$f":"IF(VL_PARC!$W9=0,\"\",VL_PARC!AD9)","v":12195.164292716507},{"$f":"IF(VL_PARC!$W9=0,\"\",VL_PARC!AF9)","v":2108.3234634141481}]
[null,null,null,null,null,null,null,"Nº de Parcelas Restantes",{"$f":"'Simulador Port'!C10","v":60},{"$f":"I10","v":60},{"$f":"T10","v":""},{"$f":"L9+1","v":3},"",null,"","","","",null,{"$f":"IF(P3-J10<12,\"Contrato com menos de 12 parcelas pagas\",\"\")","v":""},null,null,{"$f":"IF(PZO!W10+VL_PARC!W10>0,'Planilha 1'!W9+1,0)","v":0},0,0,0,0,0,1,{"$error":"#N/A"},{"$error":"#N/A"},{"$error":"#N/A"},{"$error":"#N/A"},null,null,null,null,null,null,null,null,null,null,null,null,null,null,null,null,0,0,0,0,0,0,{"$f":"IF(PZO!$W10=0,\"\",PZO!AD10)","v":""},{"$f":"IF(PZO!$W10=0,\"\",PZO!AF10)","v":""},{"$f":"IF(VL_PARC!$W10=0,\"\",VL_PARC!AD10)","v":""},{"$f":"IF(VL_PARC!$W10=0,\"\",VL_PARC!AF10)","v":""}]
[null,null,null,null,null,null,null,null,null,null,null,4,"",null,"","","","",null,null,null,null,{"$f":"IF(PZO!W11+VL_PARC!W11>0,'Planilha 1'!W10+1,0)","v":0},0,0,0,0,0,1,{"$error":"#N/A"},{"$error":"#N/A"},{"$error":"#N/A"},{"$error":"#N/A"},null,null,null,null,null,null,null,null,null,null,null,null,null,null,null,null,0,0,0,0,0,0,{"$f":"IF(PZO!$W11=0,\"\",PZO!AD11)","v":""},{"$f":"IF(PZO!$W11=0,\"\",PZO!AF11)","v":""},{"$f":"IF(VL_PARC!$W11=0,\"\",VL_PARC!AD11)","v":""},{"$f":"IF(VL_PARC!$W11=0,\"\",VL_PARC!AF11)","v":""}]
[null,null,null,null,null,null,null,null,null,null,null,5,"",null,"","","","",null,null,null,null,{"$f":"IF(PZO!W12+VL_PARC!W12>0,'Planilha 1'!W11+1,0)","v":0},0,0,0,0,0,1,{"$error":"#N/A"},{"$error":"#N/A"},{"$error":"#N/A"},{"$error":"#N/A"},null,null,null,null,null,null,null,null,null,null,null,null,null,null,null,";",0,0,0,0,0,0,{"$f":"IF(PZO!$W12=0,\"\",PZO!AD12)","v":""},{"$f":"IF(PZO!$W12=0,\"\",PZO!AF12)","v":""},{"$f":"IF(VL_PARC!$W12=0,\"\",VL_PARC!AD12)","v":""},{"$f":"IF(VL_PARC!$W12=0,\"\",VL_PARC!AF12)","v":""}]
[null,null,null,null,null,null,null,null,null,null,null,6,"",null,"","","","",null,null,null,null,{"$f":"IF(PZO!W13+VL_PARC!W13>0,'Planilha 1'!W12+1,0)","v":0},0,0,0,0,0,1,{"$error":"#N/A"},{"$error":"#N/A"},{"$error":"#N/A"},{"$error":"#N/A"},null,null,null,null,null,null,null,null,null,null,null,null,null,null,null,null,0,0,0,0,0,0,{"$f":"IF(PZO!$W13=0,\"\",PZO!AD13)","v":""},{"$f":"IF(PZO!$W13=0,\"\",PZO!AF13)","v":""},{"$f":"IF(VL_PARC!$W13=0,\"\",VL_PARC!AD13)","v":""},{"$f":"IF(VL_PARC!$W13=0,\"\",VL_PARC!AF13)","v":""}]
[null,null,null,null,null,null,null,null,null,null,null,7,"",null,"","","","",null,null,null,null,{"$f":"IF(PZO!W14+VL_PARC!W14>0,'Planilha 1'!W13+1,0)","v":0},0,0,0,0,0,1,{"$error":"#N/A"},{"$error":"#N/A"},{"$error":"#N/A"},{"$error":"#N/A"},null,null,null,null,null,null,null,null,null,null,null,null,null,null,null,null,0,0,0,0,0,0,{"$f":"IF(PZO!$W14=0,\"\",PZO!AD14)","v":""},{"$f":"IF(PZO!$W14=0,\"\",PZO!AF14)","v":""},{"$f":"IF(VL_PARC!$W14=0,\"\",VL_PARC!AD14)","v":""},{"$f":"IF(VL_PARC!$W14=0,\"\",VL_PARC!AF14)","v":""},null,null,null,null,null,null,null,null,null,null,null,null,null,null,null,null,null,"Maior Parcela"]
[null,null,null,null,null,null,null,null,null,null,null,8,"",null,"","","","",null,null,null,null,{"$f":"IF(PZO!W15+VL_PARC!W15>0,'Planilha 1'!W14+1,0)","v":0},0,0,0,0,0,1,{"$error":"#N/A"},{"$error":"#N/A"},{"$error":"#N/A"},{"$error":"#N/A"},null,null,null,null,null,null,null,null,null,null,null,null,null,null,null,null,0,0,0,0,0,0,{"$f":"IF(PZO!$W15=0,\"\",PZO!AD15)","v":""},{"$f":"IF(PZO!$W15=0,\"\",PZO!AF15)","v":""},{"$f":"IF(VL_PARC!$W15=0,\"\",VL_PARC!AD15)","v":""},{"$f":"IF(VL_PARC!$W15=0,\"\",VL_PARC!AF15)","v":""},null,null,null,null,null,null,null,null,null,null,null,null,null,null,null,null,null,"Maior Parcela"]
[null,null,null,null,null,null,null,null,null,{"$f":"(1+XIRR('Planilha 1'!$I$35:$I$131,'Planilha 1'!$H$35:$H$131))^(360/365)^(30/360)-1","v":1.4065127144978096E-2},null,9,"",null,"","","","",null,null,null,null,null,null,null,null,null,null,null,null,null,null,null,null,null,null,null,null,null,null,null,null,null,null,null,null,null,null,null,null,null,null,null,null,null,null,null,null,null,null,null,null,null,null,null,null,null,null,null,null,null,null,null,null,null,null,"Pzo",{"$f":"I10","v":60}]
[null,null,null,null,null,null,null,"Taxa de Juros",{"$f":"J17","v":1.4065127144978096E-2},{"$f":"(1+XIRR('Planilha 1'!$I$35:$I$131,'Planilha 1'!$H$35:$H$131))^(360/365)^(30/360)-1","v":1.4065127144978096E-2},{"$f":"T17","v":""},10,"",null,"","","","",null,{"$f":"IFERROR(IF(J17<'Planilha 1'!Y1,\"Taxa original inferior a mínima\",IF(J17>'Planilha 1'!Z1,\"Atenção! Enquadrar valores p/ port.\",IF(SUM(PZO!$W$4:$W$15,VL_PARC!$W$4:$W$15)=0,\"Refin Indisponivel\",\"\"))),\"\")","v":""},null,null,null,null,null,null,null,null,null,null,null,null,null,null,null,null,null,null,null,null,null,null,null,null,null,null,null,null,null,null,null,null,null,null,null,null,null,null,null,null,null,null,null,null,null,null,null,null,null,null,null,null,null,null,null,null,"Parcela",{"$f":"BS36","v":250}]
[null,null,null,null,null,null,null,"Saldo Calculado pela Taxa",{"$f":"SUM('Planilha 1'!K36:K131)","v":9999.9999221262769},{"$f":"SUM(J36:J131)","v":9999.9999221262769},null,11,"",null,"","","",null,null,{"$f":"IFERROR(IF(J17<'Planilha 1'!Y1,2,IF(J17>'Planilha 1'!Z1,1,\"\")),\"\")","v":""},null,null,null,null,null,null,null,null,null,null,null,null,null,null,null,null,null,null,null,null,null,null,null,null,null,null,null,null,null,null,null,null,null,null,null,null,null,null,null,null,null,null,"saldo",14510.8716191106]
[null,null,null,null,null,null,null,null,null,null,null,12,"",null,"","","",null,null,null,null,null,null,null,null,null,null,null,null,null,null,null,null,null,null,null,null,null,null,null,null,null,null,null,null,null,null,null,null,null,null,null,null,null,null,null,null,null,null,null,null,null,null,null,null,null,null,null,null,null,null,null,null,null,null,null,"Maior Prazo",null,1,null,"Maior Prazo",{"$f":"MAX(BY29:EX29)-1","v":2}]
[null,null,null,null,null,null,null,null,null,null,null,null,null,null,null,null,null,null,null,null,null,null,null,null,null,null,null,{"$f":"IFERROR(VLOOKUP(Y20,$W$4:$AF$15,8,0),\"\")","v":12195.164292716507},null,null,null,null,null,null,null,null,null,null,null,null,null,null,null,null,null,null,null,null,null,null,null,null,null,null,null,null,null,null,null,null,null,null,null,null,null,null,null,null,null,null,null,null,null,null,null,null,"Pzo",{"$f":"MIN(HLOOKUP(CA19,$BY$29:$EX$31,3,0),'Planilha 1'!I10)","v":60},null,null,"Pzo"]
[null,null,null,null,null,null,null,null,null,null,null,null,null,null,null,null,null,null,null,null,null,null,null,null,null,null,null,null,null,null,null,null,null,null,null,null,null,null,null,null,null,null,null,null,null,null,null,null,null,null,null,null,null,null,null,null,null,null,null,null,null,null,null,{"$f":"BL32*1000","v":15.033092538494941},null,null,null,null,null,null,null,null,null,null,null,null,"Taxa",{"$f":"MIN(HLOOKUP(CA19,$BY$29:$EX$32,4,0),'Planilha 1'!I17)","v":1.4065127144978096E-2},null,null,"Taxa"]
[null,null,null,null,null,null,null,"Taxa AP considerando base 365",{"$f":"J16","v":1.4065127144978096E-2},null,null,null,null,null,null,null,null,null,null,null,null,null,null,null,null,null,null,null,null,null,null,null,null,null,null,null,null,null,null,null,null,null,null,null,null,null,null,null,null,null,null,null,null,null,null,null,null,null,null,null,null,null,null,{"$f":"1.55%*1000","v":15.5},{"$f":"BL22-BL21","v":0.46690746150505902}]
[null,null,null,null,null,null,null,"Taxa CET da PORT",{"$f":"J17","v":1.4065127144978096E-2},null,null,null,null,null,null,null,null,null,null,null,null,null,null,null,null,null,null,null,null,null,null,null,null,null,null,null,null,null,null,null,null,null,null,null,null,null,null,null,null,null,null,null,null,null,null,null,null,null,null,null,null,null,null,null,null,null,null,null,null,null,null,null,null,null,"Teto Conv",{"$f":"Z1","v":1.8499999999999999E-2}]
[null,null,null,null,null,null,null,null,null,null,null,null,null,null,null,null,null,null,null,null,null,null,null,null,null,null,null,null,null,null,null,null,null,null,null,null,null,null,null,null,null,null,null,null,null,null,null,null,null,null,null,null,null,null,null,null,null,null,null,null,null,null,null,null,null,null,null,null,null,null,null,null,null,null,"Pzo Conv",{"$f":"Z2","v":96}]
[null,null,null,null,null,null,null,"Enquadramento Port",null,null,null,null,null,"Taxa minima TAB PORT",null,null,null,null,null,null,null,null,null,null,null,null,null,null,null,null,null,null,null,null,null,null,null,null,null,null,null,null,null,null,null,null,null,null,null,null,null,null,null,null,null,null,null,null,null,null,null,null,null,null,null,null,null,null,null,null,null,null,null,null,null,null,{"$f":"IF(((BY31*BY30)+($BX$23*($BX$24-BY30)))/$BX$24<$BX$23,1,0)","v":0}]
[null,null,null,null,null,null,null,"1. Otimiza Pzo *",{"$f":"IF('Simulador Port'!$C$2=\"INSS\",'Planilha 1'!J26,\"NORMAL\")","v":"Flex 1"},{"$f":"IF('Simulador Port'!C23>=$N$26,\"Normal\",IF('Simulador Port'!C23>=$N$27,\"Flex 1\",NA()))","v":"Flex 1"},null,"Normal",null,1.6799999999999999E-2,null,null,null,null,null,null,null,null,null,null,null,null,null,null,null,null,null,null,null,null,null,null,null,null,null,null,null,null,null,null,null,null,null,null,null,null,null,null,null,null,null,null,null,null,null,null,null,"SEM MUDA PRAZO","SOMAR 1 PARCELA","SOMAR 2 PARCELAS","TIRAR 1 PARCELA","TIRAR 2 PARCELAS",null,null,null,null,null,null,null,null,"Tx Alvo","Teto Pond",{"$f":"IF(((BY32*BY31)+($BX$23*($BX$24-BY31)))/$BX$24<$BX$23,1,0)","v":0},{"$f":"IF(((BZ32*BZ31)+($BX$23*($BX$24-BZ31)))/$BX$24<$BX$23,1,0)","v":0},0,0,0,0,0,0,0,0,0,0,0,0,0,0,0,0,0,0,0,1,1,1,1,1,1,1,1,1,1,1,1,{"$f":"IF(((DF32*DF31)+($BX$23*($BX$24-DF31)))/$BX$24<$BX$23,1,0)","v":1},1,1,1,1,1,1,1,1,1,1,1,1,1,1,1,1,1,1,1,1,1,1,1,1,1,1,1,1,1,1,1,{"$f":"IF(((EL32*EL31)+($BX$23*($BX$24-EL31)))/$BX$24<$BX$23,1,0)","v":1},1,1,1,1,1,1,1,1,1,1,1,1]
[null,null,null,null,null,null,null,"2.Redução Vlr Parcela**",{"$f":"IF('Simulador Port'!$C$2=\"INSS\",'Planilha 1'!J27,\"NORMAL\")","v":"Flex 1"},{"$f":"IF('Simulador Port'!E23>=$N$26,\"Normal\",IF('Simulador Port'!E23>=$N$27,\"Flex 1\",NA()))","v":"Flex 1"},null,"Flex1",null,1.35E-2,null,null,null,null,null,null,null,null,null,null,null,null,null,null,null,null,null,null,null,null,null,null,null,null,null,null,null,null,null,null,null,{"$f":"XIRR(AU$35:AU$131,$H$35:$H$131)","v":1.9681409001350403E-2},1.9681409001350403E-2,1.9681409001350403E-2,1.9681409001350403E-2,1.9681409001350403E-2,1.9681409001350403E-2,{"$error":"#N/A"},{"$error":"#N/A"},{"$error":"#N/A"},{"$error":"#N/A"},{"$error":"#N/A"},{"$error":"#N/A"},null,null,null,null,{"$f":"IF(K17<>\"\",\"Taxa original inferior a mínima\",\"\")","v":""},{"$f":"IF(BK32<'Planilha 1'!$Y$1,\"Taxa original inferior a mínima\",\"\")","v":""},{"$f":"IF(BL32<'Planilha 1'!$Y$1,\"Taxa original inferior a mínima\",\"\")","v":""},{"$f":"IF(BM32<'Planilha 1'!$Y$1,\"Taxa original inferior a mínima\",\"\")","v":""},{"$f":"IF(BN32<'Planilha 1'!$Y$1,\"Taxa original inferior a mínima\",\"\")","v":"Taxa original inferior a mínima"},null,null,null,null,null,null,null,null,null,"VAlid1",{"$f":"IF(BY31>$P$3-12,0,IF(BY31>$I$10,0,1))","v":0},{"$f":"IF(BZ31>$P$3-12,0,IF(BZ31>$I$10,0,1))","v":0},{"$f":"IF(CA31>$P$3-12,0,IF(CA31>$I$10,0,1))","v":0},0,0,0,0,0,0,0,0,0,0,0,0,0,0,0,0,0,0,{"$f":"IF(CT31>$P$3-12,0,IF(CT31>$I$10,0,1))","v":0},0,0,0,0,0,0,0,0,0,0,0,0,0,0,1,1,1,1,1,1,1,1,1,1,1,1,1,1,1,1,1,1,1,1,1,1,1,1,1,1,1,1,1,{"$f":"IF(EL31>$P$3-12,0,IF(EL31>$I$10,0,1))","v":1},1,1,1,1,1,1,1,1,1,1,1,1]
[null,null,null,null,null,null,null,null,null,null,null,null,null,null,null,null,null,null,null,null,null,null,null,null,null,null,null,null,null,null,null,null,null,{"$f":"U32-$J$8","v":2195.1643705902297},{"$f":"V32-$J$8","v":2195.1643705902297},2195.1643705902297,2195.1643705902297,2195.1643705902297,2195.1643705902297,{"$error":"#N/A"},{"$error":"#N/A"},{"$error":"#N/A"},{"$error":"#N/A"},{"$error":"#N/A"},{"$error":"#N/A"},null,null,null,null,null,null,null,null,null,null,null,null,null,null,null,null,null,null,null,null,null,null,null,null,null,null,null,null,null,"Tx Alvo",{"$f":"Y1","v":1.35E-2},{"$f":"MAX((BY32-$BX$28)*BY27*BY26,0)","v":0},{"$f":"MAX((BZ32-$BX$28)*BZ27*BZ26,0)","v":0},0,0,0,0,0,0,0,0,0,0,0,0,0,0,0,0,0,0,0,0,0,0,0,0,0,0,0,0,0,0,0,0,0,0,5.6512714497809584E-4,1.5708695826595169E-4,0,0,0,0,0,0,0,0,0,0,0,0,0,0,0,0,0,0,0,0,0,0,0,0,0,0,0,{"$f":"MAX((EL32-$BX$28)*EL27*EL26,0)","v":0},0,{"$f":"MAX((EN32-$BX$28)*EN27*EN26,0)","v":0},0,0,0,0,0,0,0,0,0,0]
[null,null,null,null,null,null,null,null,null,null,null,null,null,null,null,null,null,null,null,"Taxa REFIN",{"$f":"VLOOKUP(U34,$AA$4:$AC$15,3,0)","v":1.0005203285932471},{"$f":"VLOOKUP(V34,$AA$4:$AC$15,3,0)","v":1.0005203285932471},{"$f":"VLOOKUP(W34,$AA$4:$AC$15,3,0)","v":1.0005203285932471},{"$f":"VLOOKUP(X34,$AA$4:$AC$15,3,0)","v":1.0005203285932471},1.0005203285932471,1.0005203285932471,{"$error":"#N/A"},{"$error":"#N/A"},{"$error":"#N/A"},{"$error":"#N/A"},{"$error":"#N/A"},{"$error":"#N/A"},null,{"$f":"SUM(AH35:AH131)","v":86.840907176081586},{"$f":"SUM(AI35:AI131)","v":86.840907176081586},86.840907176081586,86.840907176081586,86.840907176081586,86.840907176081586,{"$error":"#N/A"},{"$error":"#N/A"},{"$error":"#N/A"},{"$error":"#N/A"},{"$error":"#N/A"},{"$error":"#N/A"},null,{"$f":"(1+AT27)^(30/365)-1","v":1.6032208597900333E-3},1.6032208597900333E-3,1.6032208597900333E-3,1.6032208597900333E-3,1.6032208597900333E-3,1.6032208597900333E-3,{"$error":"#N/A"},{"$error":"#N/A"},{"$error":"#N/A"},{"$error":"#N/A"},{"$error":"#N/A"},{"$error":"#N/A"},null,null,null,null,null,null,null,null,null,null,null,null,null,null,null,null,null,null,{"$f":"RANK(BY28,$BY$28:$EX$28,0)","v":3},{"$f":"RANK(BZ28,$BY$28:$EX$28,0)","v":3},3,3,3,3,3,3,3,3,3,3,3,3,3,3,3,3,3,3,3,3,3,3,3,3,3,3,3,3,3,3,3,3,3,3,1,2,3,3,3,3,3,3,3,3,3,3,3,3,3,3,3,3,3,3,3,3,3,3,3,3,3,3,3,{"$f":"RANK(EL28,$BY$28:$EX$28,0)","v":3},3,3,3,3,3,3,3,3,3,3,3,3]
[null,null,null,null,null,null,null,"dt ini fx pmt",null,{"$f":"NETWORKDAYS(EOMONTH(I7,-1)+1,I7,$A$34:$A$1297)","v":22}]
[null,null,null,null,null,null,null,"Prox Vencimento",null,{"$f":"IF(I31=\"\",IF(P2=\"INSS\",IF(J30<3,EOMONTH(I7,0)+7,EOMONTH(I7,1)+7),IF(DAY(I7)<11,EOMONTH(I7,0)+10,EOMONTH(I7,1)+10)),I31)","v":"2025-11-07"},null,null,null,null,null,null,null,null,null,null,{"$f":"U32-$I$8","v":2195.1642927165067},{"$f":"V32-$I$8","v":2195.1642927165067},2195.1642927165067,2195.1642927165067,2195.1642927165067,2195.1642927165067,{"$error":"#N/A"},{"$error":"#N/A"},{"$error":"#N/A"},{"$error":"#N/A"},{"$f":"AE32-$I$8","v":{"$error":"#N/A"}},{"$error":"#N/A"},null,null,null,null,null,null,null,null,null,null,null,null,null,null,null,null,null,null,null,null,null,null,null,null,null,null,null,null,null,"Prox Vencimento",null,{"$f":"J31","v":"2025-11-07"},null,null,null,null,null,{"$f":"(1+BX23)^((364.6/12)/30)-1","v":1.8738590066706973E-2},null,{"$f":"MAX($I$10-3,BZ20)","v":60},{"$f":"MAX($I$10-3,BZ20)","v":60},null,null,"Pzo",{"$f":"COUNTIFS(BY36:BY131,\">\"&0)","v":96},{"$f":"COUNTIFS(BZ36:BZ131,\">\"&0)","v":95},{"$f":"COUNTIFS(CA36:CA131,\">\"&0)","v":94},93,92,91,90,89,88,87,86,85,84,83,82,81,80,79,78,77,76,75,74,73,72,{"$f":"COUNTIFS(CX36:CX131,\">\"&0)","v":71},70,69,68,67,66,65,64,63,62,61,60,59,58,57,56,55,54,53,52,51,50,49,48,47,46,45,44,43,42,41,40,39,38,37,36,35,34,33,32,31,30,29,28,27,26,25,24,23,22,21,20,19]
[null,null,null,null,null,null,null,"Fator Dia",{"$f":"(1+I17)^(1/30)","v":1.0004656794303521},{"$f":"(1+J17)^(1/30)","v":1.0004656794303521},null,null,null,null,null,null,null,null,null,"Vlr Troco",{"$f":"SUM(U36:U131)","v":12195.164292716507},{"$f":"SUM(V36:V131)","v":12195.164292716507},{"$f":"SUM(W36:W131)","v":12195.164292716507},{"$f":"SUM(X36:X131)","v":12195.164292716507},12195.164292716507,12195.164292716507,{"$error":"#N/A"},{"$error":"#N/A"},{"$error":"#N/A"},{"$error":"#N/A"},{"$error":"#N/A"},{"$error":"#N/A"},null,null,null,null,null,null,null,null,null,null,null,null,null,null,null,null,null,null,null,null,null,null,null,null,null,null,null,null,null,"XITR",{"$f":"(1+XIRR('Planilha 1'!BK$35:BK$131,'Planilha 1'!$BJ$35:$BJ$131))^(30/360)-1","v":1.4656441559752986E-2},{"$f":"(1+XIRR('Planilha 1'!BL$35:BL$131,'Planilha 1'!$BJ$35:$BJ$131))^(30/360)-1","v":1.5033092538494941E-2},{"$f":"(1+XIRR('Planilha 1'!BM$35:BM$131,'Planilha 1'!$BJ$35:$BJ$131))^(30/360)-1","v":1.3848076105671847E-2},{"$f":"(1+XIRR('Planilha 1'!BN$35:BN$131,'Planilha 1'!$BJ$35:$BJ$131))^(30/360)-1","v":1.3414094797118858E-2},null,null,null,{"$f":"BX23","v":1.8499999999999999E-2},{"$f":"(1+XIRR('Planilha 1'!BS$35:BS$131,'Planilha 1'!$BJ$35:$BJ$131))^(30/365)-1","v":1.4065127144978096E-2},{"$f":"MIN(PMT($BR$31,MAX($I$10-3,BZ20),$BR$35),I9)","v":250},{"$f":"MIN(PMT($BR$31,MAX($I$10-3,BZ20),$BR$35),I9)","v":250},null,null,"Tx",{"$f":"(1+XIRR(BY35:BY131,'Planilha 1'!$H$35:$H$131))^(30/365)-1","v":2.1400749672586317E-2},{"$f":"(1+XIRR(BZ35:BZ131,'Planilha 1'!$H$35:$H$131))^(30/365)-1","v":2.1304459794159847E-2},{"$f":"(1+XIRR(CA35:CA131,'Planilha 1'!$H$35:$H$131))^(30/365)-1","v":2.1204782687654466E-2},{"$f":"(1+XIRR(CB35:CB131,'Planilha 1'!$H$35:$H$131))^(30/365)-1","v":2.1101503276363065E-2},{"$f":"(1+XIRR(CC35:CC131,'Planilha 1'!$H$35:$H$131))^(30/365)-1","v":2.0994468831440516E-2},{"$f":"(1+XIRR(CD35:CD131,'Planilha 1'!$H$35:$H$131))^(30/365)-1","v":2.0883593935107303E-2},{"$f":"(1+XIRR(CE35:CE131,'Planilha 1'!$H$35:$H$131))^(30/365)-1","v":2.0768634979767109E-2},{"$f":"(1+XIRR(CF35:CF131,'Planilha 1'!$H$35:$H$131))^(30/365)-1","v":2.0649494809253044E-2},{"$f":"(1+XIRR(CG35:CG131,'Planilha 1'!$H$35:$H$131))^(30/365)-1","v":2.0525906553143569E-2},{"$f":"(1+XIRR(CH35:CH131,'Planilha 1'!$H$35:$H$131))^(30/365)-1","v":2.0397932882921799E-2},{"$f":"(1+XIRR(CI35:CI131,'Planilha 1'!$H$35:$H$131))^(30/365)-1","v":2.0265115437367198E-2},{"$f":"(1+XIRR(CJ35:CJ131,'Planilha 1'!$H$35:$H$131))^(30/365)-1","v":2.0127234084064805E-2},{"$f":"(1+XIRR(CK35:CK131,'Planilha 1'!$H$35:$H$131))^(30/365)-1","v":1.9984152223723628E-2},{"$f":"(1+XIRR(CL35:CL131,'Planilha 1'!$H$35:$H$131))^(30/365)-1","v":1.9835534093991303E-2},{"$f":"(1+XIRR(CM35:CM131,'Planilha 1'!$H$35:$H$131))^(30/365)-1","v":1.9681222913937368E-2},{"$f":"(1+XIRR(CN35:CN131,'Planilha 1'!$H$35:$H$131))^(30/365)-1","v":1.9520849065164159E-2},{"$f":"(1+XIRR(CO35:CO131,'Planilha 1'!$H$35:$H$131))^(30/365)-1","v":1.935412468540143E-2},{"$f":"(1+XIRR(CP35:CP131,'Planilha 1'!$H$35:$H$131))^(30/365)-1","v":1.9180856099978216E-2},{"$f":"(1+XIRR(CQ35:CQ131,'Planilha 1'!$H$35:$H$131))^(30/365)-1","v":1.9000613441091829E-2},{"$f":"(1+XIRR(CR35:CR131,'Planilha 1'!$H$35:$H$131))^(30/365)-1","v":1.8813175281195971E-2},{"$f":"(1+XIRR(CS35:CS131,'Planilha 1'!$H$35:$H$131))^(30/365)-1","v":1.861806487133344E-2},{"$f":"(1+XIRR(CT35:CT131,'Planilha 1'!$H$35:$H$131))^(30/365)-1","v":1.8415150525493029E-2},{"$f":"(1+XIRR(CU35:CU131,'Planilha 1'!$H$35:$H$131))^(30/365)-1","v":1.8203784933322975E-2},{"$f":"(1+XIRR(CV35:CV131,'Planilha 1'!$H$35:$H$131))^(30/365)-1","v":1.7983536778451326E-2},{"$f":"(1+XIRR(CW35:CW131,'Planilha 1'!$H$35:$H$131))^(30/365)-1","v":1.7754084221500266E-2},{"$f":"(1+XIRR(CX35:CX131,'Planilha 1'!$H$35:$H$131))^(30/365)-1","v":1.7514808366843715E-2},{"$f":"(1+XIRR(CY35:CY131,'Planilha 1'!$H$35:$H$131))^(30/365)-1","v":1.7265336823399924E-2},{"$f":"(1+XIRR(CZ35:CZ131,'Planilha 1'!$H$35:$H$131))^(30/365)-1","v":1.700497684704505E-2},{"$f":"(1+XIRR(DA35:DA131,'Planilha 1'!$H$35:$H$131))^(30/365)-1","v":1.6733141653928252E-2},{"$f":"(1+XIRR(DB35:DB131,'Planilha 1'!$H$35:$H$131))^(30/365)-1","v":1.6449360302431604E-2},{"$f":"(1+XIRR(DC35:DC131,'Planilha 1'!$H$35:$H$131))^(30/365)-1","v":1.6152811940893796E-2},{"$f":"(1+XIRR(DD35:DD131,'Planilha 1'!$H$35:$H$131))^(30/365)-1","v":1.5842948199800144E-2},{"$f":"(1+XIRR(DE35:DE131,'Planilha 1'!$H$35:$H$131))^(30/365)-1","v":1.5518844441868573E-2},{"$f":"(1+XIRR(DF35:DF131,'Planilha 1'!$H$35:$H$131))^(30/365)-1","v":1.518020067019954E-2},{"$f":"(1+XIRR(DG35:DG131,'Planilha 1'!$H$35:$H$131))^(30/365)-1","v":1.4825640761891634E-2},{"$f":"(1+XIRR(DH35:DH131,'Planilha 1'!$H$35:$H$131))^(30/365)-1","v":1.4454224366648782E-2},{"$f":"(1+XIRR(DI35:DI131,'Planilha 1'!$H$35:$H$131))^(30/365)-1","v":1.4065127144978096E-2},{"$f":"(1+XIRR(DJ35:DJ131,'Planilha 1'!$H$35:$H$131))^(30/365)-1","v":1.3657086958265952E-2},{"$f":"(1+XIRR(DK35:DK131,'Planilha 1'!$H$35:$H$131))^(30/365)-1","v":1.3229129977929244E-2},{"$f":"(1+XIRR(DL35:DL131,'Planilha 1'!$H$35:$H$131))^(30/365)-1","v":1.2779815438953346E-2},{"$f":"(1+XIRR(DM35:DM131,'Planilha 1'!$H$35:$H$131))^(30/365)-1","v":1.2307792674061346E-2},{"$f":"(1+XIRR(DN35:DN131,'Planilha 1'!$H$35:$H$131))^(30/365)-1","v":1.1811799851259686E-2},{"$f":"(1+XIRR(DO35:DO131,'Planilha 1'!$H$35:$H$131))^(30/365)-1","v":1.1290067352313971E-2},{"$f":"(1+XIRR(DP35:DP131,'Planilha 1'!$H$35:$H$131))^(30/365)-1","v":1.0741090171941137E-2},{"$f":"(1+XIRR(DQ35:DQ131,'Planilha 1'!$H$35:$H$131))^(30/365)-1","v":1.0162824453470165E-2},{"$f":"(1+XIRR(DR35:DR131,'Planilha 1'!$H$35:$H$131))^(30/365)-1","v":9.5538605309466451E-3},{"$f":"(1+XIRR(DS35:DS131,'Planilha 1'!$H$35:$H$131))^(30/365)-1","v":8.9114151871438896E-3},{"$f":"(1+XIRR(DT35:DT131,'Planilha 1'!$H$35:$H$131))^(30/365)-1","v":8.2331174372960447E-3},{"$f":"(1+XIRR(DU35:DU131,'Planilha 1'!$H$35:$H$131))^(30/365)-1","v":7.5165716087448597E-3},{"$f":"(1+XIRR(DV35:DV131,'Planilha 1'!$H$35:$H$131))^(30/365)-1","v":6.7587647437818976E-3},{"$f":"(1+XIRR(DW35:DW131,'Planilha 1'!$H$35:$H$131))^(30/365)-1","v":5.956783854109915E-3},{"$f":"(1+XIRR(DX35:DX131,'Planilha 1'!$H$35:$H$131))^(30/365)-1","v":5.1070743651238093E-3},{"$f":"(1+XIRR(DY35:DY131,'Planilha 1'!$H$35:$H$131))^(30/365)-1","v":4.2059447241360459E-3},{"$f":"(1+XIRR(DZ35:DZ131,'Planilha 1'!$H$35:$H$131))^(30/365)-1","v":3.2494531680764549E-3},{"$f":"(1+XIRR(EA35:EA131,'Planilha 1'!$H$35:$H$131))^(30/365)-1","v":2.2329886409426791E-3},{"$f":"(1+XIRR(EB35:EB131,'Planilha 1'!$H$35:$H$131))^(30/365)-1","v":1.1516846103796219E-3},{"$f":"(1+XIRR(EC35:EC131,'Planilha 1'!$H$35:$H$131))^(30/365)-1","v":2.4495050432449261E-10},{"$f":"(1+XIRR(ED35:ED131,'Planilha 1'!$H$35:$H$131))^(30/365)-1","v":-1.2282237684002606E-3},{"$f":"(1+XIRR(EE35:EE131,'Planilha 1'!$H$35:$H$131))^(30/365)-1","v":-2.5398509272310799E-3},{"$f":"(1+XIRR(EF35:EF131,'Planilha 1'!$H$35:$H$131))^(30/365)-1","v":-3.9423646350108532E-3},{"$f":"(1+XIRR(EG35:EG131,'Planilha 1'!$H$35:$H$131))^(30/365)-1","v":-5.444375539504942E-3},{"$f":"(1+XIRR(EH35:EH131,'Planilha 1'!$H$35:$H$131))^(30/365)-1","v":-7.0551133575628144E-3},{"$f":"(1+XIRR(EI35:EI131,'Planilha 1'!$H$35:$H$131))^(30/365)-1","v":-8.7855586285421339E-3},{"$f":"(1+XIRR(EJ35:EJ131,'Planilha 1'!$H$35:$H$131))^(30/365)-1","v":-1.0647226151824341E-2},{"$f":"(1+XIRR(EK35:EK131,'Planilha 1'!$H$35:$H$131))^(30/365)-1","v":-1.2653384901472609E-2},{"$f":"(1+XIRR(EL35:EL131,'Planilha 1'!$H$35:$H$131))^(30/365)-1","v":-1.4820115939601863E-2},{"$f":"(1+XIRR(EM35:EM131,'Planilha 1'!$H$35:$H$131))^(30/365)-1","v":-1.7163780978780463E-2},{"$f":"(1+XIRR(EN35:EN131,'Planilha 1'!$H$35:$H$131))^(30/365)-1","v":-1.970548085948387E-2},{"$f":"(1+XIRR(EO35:EO131,'Planilha 1'!$H$35:$H$131))^(30/365)-1","v":-2.2466314068474991E-2},{"$f":"(1+XIRR(EP35:EP131,'Planilha 1'!$H$35:$H$131))^(30/365)-1","v":-2.5477093028120623E-2},{"$f":"(1+XIRR(EQ35:EQ131,'Planilha 1'!$H$35:$H$131))^(30/365)-1","v":-2.8764125078544089E-2},{"$f":"(1+XIRR(ER35:ER131,'Planilha 1'!$H$35:$H$131))^(30/365)-1","v":-3.2361743743584248E-2},{"$f":"(1+XIRR(ES35:ES131,'Planilha 1'!$H$35:$H$131))^(30/365)-1","v":-3.6314839327069581E-2},{"$f":"(1+XIRR(ET35:ET131,'Planilha 1'!$H$35:$H$131))^(30/365)-1","v":-4.0666962209351731E-2},{"$f":"(1+XIRR(EU35:EU131,'Planilha 1'!$H$35:$H$131))^(30/365)-1","v":-4.5480785634891885E-2},{"$f":"(1+XIRR(EV35:EV131,'Planilha 1'!$H$35:$H$131))^(30/365)-1","v":-5.0816648283283694E-2},{"$f":"(1+XIRR(EW35:EW131,'Planilha 1'!$H$35:$H$131))^(30/365)-1","v":-5.6751542056637461E-2},{"$f":"(1+XIRR(EX35:EX131,'Planilha 1'!$H$35:$H$131))^(30/365)-1","v":-6.3392153573673893E-2}]
["Data","Dia da Semana","Feriado",null,null,null,null,"OPERAÇÃO ORIGINAL",null,null,null,null,null,null,null,null,null,null,null,"REFINANCIAMENTO",null,null,null,null,null,null,null,null,null,null,null,null,null,"IOF",null,null,null,null,null,null,null,null,null,null,null,null,"REFINANCIAMENTO",null,null,null,null,null,null,null,null,null,null,null,null,null,null,"OPERAÇÃO ORIGINAL",null,null,null,null,null,null,null,{"$f":"(1+BX23)^(1/30)","v":1.000611218607504},{"$f":"(1+XIRR('Planilha 1'!BR$35:BR$131,'Planilha 1'!$BP$35:$BP$131))^(30/365)-1","v":1.8470483308147045E-2},{"$f":"(1+XIRR('Planilha 1'!BT$35:BT$131,'Planilha 1'!$BO$35:$BO$131))^(30/365)-1","v":1.4065127144978096E-2},{"$f":"(1+XIRR('Planilha 1'!BU$35:BU$131,'Planilha 1'!$BO$35:$BO$131))^(30/365)-1","v":1.4065127144978096E-2},null,null,null,96,{"$f":"BY33-1","v":95},{"$f":"BZ33-1","v":94},93,92,91,90,89,88,87,86,85,84,83,82,81,80,79,78,77,76,75,74,73,72,{"$f":"CW33-1","v":71},70,69,68,67,66,65,64,63,62,61,60,59,58,57,56,55,54,53,52,51,50,49,48,47,46,45,44,43,42,41,40,39,38,37,36,35,34,33,32,31,30,29,28,27,26,25,24,23,22,21,20,19]
["2001-01-01","segunda-feira","Confraternização Universal",null,null,null,null,"DATA EV","FLUXO","Principal","Principal2","IOF",null,null,null,null,null,null,null,"FX Refin","Normal","Flex 1","Flex 2","Flex 3","Flex 4","Flex 5","Flex 6","Flex 7","Flex 8","Flex 9","Flex 10","Flex 11",null,"Normal","Flex 1","Flex 2","Flex 3","Flex 4","Flex 5","Flex 6","Flex 7","Flex 8","Flex 9","Flex 10","Flex 11",null,"Normal","Flex 1","Flex 2","Flex 3","Flex 4","Flex 5","Flex 6","Flex 7","Flex 8","Flex 9","Flex 10","Flex 11",null,null,null,"DATA EV","FLUXO1","FLUXO2","FLUXO3","FLUXO4",null,null,null,"FLUX06",null,null,null,null,null,null,"FLUXO","FLUXO","FLUXO","FLUXO","FLUXO","FLUXO","FLUXO","FLUXO","FLUXO","FLUXO","FLUXO","FLUXO","FLUXO","FLUXO","FLUXO","FLUXO","FLUXO","FLUXO","FLUXO","FLUXO","FLUXO","FLUXO","FLUXO","FLUXO","FLUXO","FLUXO","FLUXO","FLUXO","FLUXO","FLUXO","FLUXO","FLUXO","FLUXO","FLUXO","FLUXO","FLUXO","FLUXO","FLUXO","FLUXO","FLUXO","FLUXO","FLUXO","FLUXO","FLUXO","FLUXO","FLUXO","FLUXO","FLUXO","FLUXO","FLUXO","FLUXO","FLUXO","FLUXO","FLUXO","FLUXO","FLUXO","FLUXO","FLUXO","FLUXO","FLUXO","FLUXO","FLUXO","FLUXO","FLUXO","FLUXO","FLUXO","FLUXO","FLUXO","FLUXO","FLUXO","FLUXO","FLUXO","FLUXO","FLUXO","FLUXO","FLUXO","FLUXO","FLUXO"]
["2001-02-26","segunda-feira","Carnaval",null,null,null,0,{"$f":"I7","v":"2025-09-30"},{"$f":"-I8","v":-10000},null,null,{"$f":"I35*-0.38%","v":38},null,null,null,null,null,null,null,{"$f":"I35","v":-10000},null,null,null,null,null,null,null,null,null,null,null,null,null,{"$f":"(U31)*$B$2","v":8.3416243123227254},{"$f":"(V31)*$B$2","v":8.3416243123227254},8.3416243123227254,8.3416243123227254,8.3416243123227254,8.3416243123227254,{"$error":"#N/A"},{"$error":"#N/A"},{"$error":"#N/A"},{"$error":"#N/A"},{"$error":"#N/A"},{"$error":"#N/A"},null,{"$f":"-U32+$I$35","v":-22195.164292716508},{"$f":"-V32+$I$35","v":-22195.164292716508},-22195.164292716508,-22195.164292716508,-22195.164292716508,-22195.164292716508,{"$error":"#N/A"},{"$error":"#N/A"},{"$error":"#N/A"},{"$error":"#N/A"},{"$error":"#N/A"},{"$error":"#N/A"},null,null,0,{"$f":"H35","v":"2025-09-30"},{"$f":"I35","v":-10000},{"$f":"BK35","v":-10000},{"$f":"BL35","v":-10000},{"$f":"BM35","v":-10000},{"$f":"H35","v":"2025-09-30"},{"$f":"EDATE(BJ36,-1)","v":"2025-10-07"},{"$f":"-BJ35+BP35","v":7},{"$f":"-((-BN35)*BR33^BQ35)","v":-10042.863836013657},{"$f":"BN35","v":-10000},{"$f":"BM35","v":-10000},{"$f":"BN35","v":-10000},null,null,null,{"$f":"BN35","v":-10000},{"$f":"BY35","v":-10000},{"$f":"BZ35","v":-10000},-10000,-10000,-10000,-10000,-10000,-10000,-10000,-10000,-10000,-10000,-10000,-10000,-10000,-10000,-10000,-10000,-10000,-10000,-10000,-10000,-10000,-10000,{"$f":"CW35","v":-10000},-10000,-10000,-10000,-10000,-10000,-10000,-10000,-10000,-10000,-10000,-10000,-10000,-10000,-10000,-10000,-10000,-10000,-10000,-10000,-10000,-10000,-10000,-10000,-10000,-10000,-10000,-10000,-10000,-10000,-10000,-10000,-10000,-10000,-10000,-10000,-10000,-10000,-10000,-10000,-10000,-10000,-10000,-10000,-10000,-10000,-10000,-10000,-10000,-10000,-10000,-10000,-10000]
["2001-02-27","terça-feira","Carnaval",null,null,{"$f":"H36-$H$35","v":38},1,{"$f":"J31","v":"2025-11-07"},{"$f":"IF($G36>$I$10,0,$I$9)","v":250},{"$f":"I36/($J$32^(H36-$H$35))","v":245.61596998293012},{"$f":"I36/($I$32^(H36-$H$35))","v":245.61596998293012},{"$f":"J36*0.0082%*MIN(F36,365)","v":0.76533936246681022},null,null,null,null,null,null,1,{"$f":"IF($G36>$P$3,0,$J$9)","v":250},{"$f":"$T36/((U$29)^($H36-$H$35))","v":245.10668717808329},{"$f":"$T36/((V$29)^($H36-$H$35))","v":245.10668717808329},245.10668717808329,{"$f":"$T36/((X$29)^($H36-$H$35))","v":245.10668717808329},245.10668717808329,245.10668717808329,{"$error":"#N/A"},{"$error":"#N/A"},{"$error":"#N/A"},{"$error":"#N/A"},{"$error":"#N/A"},{"$error":"#N/A"},null,{"$f":"IF($I36<>0,0,U36*$B$1*MIN($F36,365))","v":0},{"$f":"IF($I36<>0,0,V36*$B$1*MIN($F36,365))","v":0},{"$f":"IF($I36<>0,0,W36*$B$1*MIN($F36,365))","v":0},{"$f":"IF($I36<>0,0,X36*$B$1*MIN($F36,365))","v":0},{"$f":"IF($I36<>0,0,Y36*$B$1*MIN($F36,365))","v":0},{"$f":"IF($I36<>0,0,Z36*$B$1*MIN($F36,365))","v":0},{"$f":"IF($I36<>0,0,AA36*$B$1*MIN($F36,365))","v":0},{"$f":"IF($I36<>0,0,AB36*$B$1*MIN($F36,365))","v":0},{"$f":"IF($I36<>0,0,AC36*$B$1*MIN($F36,365))","v":0},{"$f":"IF($I36<>0,0,AD36*$B$1*MIN($F36,365))","v":0},{"$f":"IF($I36<>0,0,AE36*$B$1*MIN($F36,365))","v":0},{"$f":"IF($I36<>0,0,AF36*$B$1*MIN($F36,365))","v":0},null,{"$f":"$T36","v":250},250,250,250,250,250,250,250,250,250,250,250,null,{"$f":"BJ36-$H$35","v":38},1,{"$f":"BL31","v":"2025-11-07"},{"$f":"I36","v":250},{"$f":"BK36","v":250},{"$f":"I37","v":250},{"$f":"BM37","v":250},{"$f":"H36","v":"2025-11-07"},{"$f":"BJ36","v":"2025-11-07"},null,{"$f":"IF(G36>$I$10-3,0,PMT($BR$31,$I$10,$BR$35))","v":280.15693363560268},{"$f":"MIN(BR36,$I$9)","v":250},{"$f":"IF(F36>$BU$31,0,$BU$32)","v":250},{"$f":"IF(G36>$BU$31,0,$BU$32)","v":250},null,null,null,{"$f":"IF($G36>BY$33,0,$I$9)","v":250},{"$f":"IF($G36>BZ$33,0,$I$9)","v":250},250,250,250,250,250,250,250,250,250,250,250,250,250,250,250,{"$f":"IF($G36>CP$33,0,$I$9)","v":250},250,250,250,250,250,250,250,250,250,250,250,250,250,250,250,{"$f":"IF($G36>DF$33,0,$I$9)","v":250},250,250,250,250,250,250,250,250,250,250,250,250,250,250,250,250,250,250,250,250,250,250,250,250,250,250,250,250,250,250,250,250,250,250,250,250,250,250,250,250,250,250,250,250]
["2001-04-13","sexta-feira","Paixão de Cristo",null,null,{"$f":"H37-$H$35","v":68},{"$f":"G36+1","v":2},{"$f":"EDATE(H36,1)","v":"2025-12-07"},{"$f":"IF($G37>$I$10,0,$I$9)","v":250},{"$f":"I37/($J$32^(H37-$H$35))","v":242.20926586287629},242.20926586287629,{"$f":"J37*0.0082%*MIN(F37,365)","v":1.3505588664513983},null,null,null,null,null,null,{"$f":"S36+1","v":2},250,241.31129380919162,241.31129380919162,241.31129380919162,{"$f":"$T37/((X$29)^($H37-$H$35))","v":241.31129380919162},241.31129380919162,241.31129380919162,{"$error":"#N/A"},{"$error":"#N/A"},{"$error":"#N/A"},{"$error":"#N/A"},{"$f":"$T37/((AE$29)^($H37-$H$35))","v":{"$error":"#N/A"}},{"$error":"#N/A"},null,{"$f":"IF($I37<>0,0,U37*$B$1*MIN($F37,365))","v":0},0,0,0,0,0,0,0,0,0,0,0,null,250,250,250,250,250,250,250,250,250,250,250,250,null,{"$f":"BJ37-$H$35","v":68},{"$f":"BI36+1","v":2},{"$f":"EDATE(BJ36,1)","v":"2025-12-07"},{"$f":"I36","v":250},{"$f":"BK36","v":250},{"$f":"I38","v":250},{"$f":"BM38","v":250},"2025-12-07",{"$f":"BJ37","v":"2025-12-07"},null,{"$f":"IF(I37=0,0,PMT($BR$31,$I$10,$BR$35))","v":280.15693363560268},{"$f":"MIN(BR37,$I$9)","v":250},{"$f":"IF(G37>$BT$31,0,$BT$32)","v":250},{"$f":"IF(G37>$BU$31,0,$BU$32)","v":250},null,null,null,250,250,250,250,250,250,250,250,250,250,250,250,250,250,250,250,250,250,250,250,250,250,250,250,250,250,250,250,250,250,250,250,250,250,250,250,250,250,250,250,250,250,250,250,250,250,250,250,250,250,250,250,250,250,250,250,250,250,250,250,250,250,250,250,250,250,250,250,250,250,250,250,250,250,250,250,250,250]
["2001-04-21","sábado","Tiradentes",null,null,99,{"$f":"G37+1","v":3},{"$f":"EDATE(H37,1)","v":"2026-01-07"},{"$f":"IF($G38>$I$10,0,$I$9)","v":250},238.73863720364145,238.73863720364145,1.9380802568191613,null,null,null,null,null,null,3,250,237.45111820452877,237.45111820452877,237.45111820452877,237.45111820452877,237.45111820452877,237.45111820452877,{"$error":"#N/A"},{"$error":"#N/A"},{"$error":"#N/A"},{"$error":"#N/A"},{"$error":"#N/A"},{"$error":"#N/A"},null,0,0,0,0,0,0,0,0,0,0,0,0,null,250,250,250,250,250,250,250,250,250,250,250,250,null,99,{"$f":"BI37+1","v":3},{"$f":"EDATE(BJ37,1)","v":"2026-01-07"},{"$f":"I37","v":250},{"$f":"BK37","v":250},250,250,"2026-01-07","2026-01-07",null,280.15693363560268,250,{"$f":"IF(G38>$BT$31,0,$BT$32)","v":250},250,null,null,null,250,250,250,250,250,250,250,250,250,250,250,250,250,250,250,250,250,250,250,250,250,250,250,250,250,250,250,250,250,250,250,250,250,250,250,250,250,250,250,250,250,250,250,250,250,250,250,250,250,250,250,250,250,250,250,250,250,250,250,250,250,250,250,250,250,250,250,250,250,250,250,250,250,250,250,250,250,250]
["2001-05-01","terça-feira","Dia do Trabalho",null,null,130,4,"2026-02-07",250,235.31773935568407,235.31773935568407,2.5084871015315922,null,null,null,null,null,null,4,250,233.65269253068604,233.65269253068604,233.65269253068604,233.65269253068604,233.65269253068604,233.65269253068604,{"$error":"#N/A"},{"$error":"#N/A"},{"$error":"#N/A"},{"$error":"#N/A"},{"$error":"#N/A"},{"$error":"#N/A"},null,0,0,0,0,0,0,0,0,0,0,0,0,null,250,250,250,250,250,250,250,250,250,250,250,250,null,130,4,"2026-02-07",250,250,250,250,"2026-02-07","2026-02-07",null,280.15693363560268,250,250,250,null,null,null,250,250,250,250,250,250,250,250,250,250,250,250,250,250,250,250,250,250,250,250,250,250,250,250,250,250,250,250,250,250,250,250,250,250,250,250,250,250,250,250,250,250,250,250,250,250,250,250,250,250,250,250,250,250,250,250,250,250,250,250,250,250,250,250,250,250,250,250,250,250,250,250,250,250,250,250,250,250]
["2001-06-14","quinta-feira","Corpus Christi",null,null,158,5,"2026-03-07",250,232.27004789211759,232.27004789211759,3.0092907404902758,null,null,null,null,null,null,5,250,230.27410986084527,230.27410986084527,230.27410986084527,230.27410986084527,230.27410986084527,230.27410986084527,{"$error":"#N/A"},{"$error":"#N/A"},{"$error":"#N/A"},{"$error":"#N/A"},{"$error":"#N/A"},{"$error":"#N/A"},null,0,0,0,0,0,0,0,0,0,0,0,0,null,250,250,250,250,250,250,250,250,250,250,250,250,null,158,5,"2026-03-07",250,250,250,250,"2026-03-07","2026-03-07",null,280.15693363560268,250,250,250,null,null,null,250,250,250,250,250,250,250,250,250,250,250,250,250,250,250,250,250,250,250,250,250,250,250,250,250,250,250,250,250,250,250,250,250,250,250,250,250,250,250,250,250,250,250,250,250,250,250,250,250,250,250,250,250,250,250,250,250,250,250,250,250,250,250,250,250,250,250,250,250,250,250,250,250,250,250,250,{"$f":"IF($G40>EW$33,0,$I$9)","v":250},250]
["2001-09-07","sexta-feira","Independência do Brasil",null,null,189,6,"2026-04-07",250,228.94183878325293,228.94183878325293,3.5481406174628538,null,null,null,null,null,null,6,250,226.59049237556846,226.59049237556846,226.59049237556846,226.59049237556846,226.59049237556846,226.59049237556846,{"$error":"#N/A"},{"$error":"#N/A"},{"$error":"#N/A"},{"$error":"#N/A"},{"$error":"#N/A"},{"$error":"#N/A"},null,0,0,0,0,0,0,0,0,0,0,0,0,null,250,250,250,250,250,250,250,250,250,250,250,250,null,189,6,"2026-04-07",250,250,250,250,"2026-04-07","2026-04-07",null,280.15693363560268,250,250,250,null,null,null,250,250,250,250,250,250,250,250,250,250,250,250,250,250,250,250,250,250,250,250,250,250,250,250,250,250,250,250,250,250,250,250,250,250,250,250,250,250,250,250,250,250,250,250,250,250,250,250,250,250,250,250,250,250,250,250,250,250,250,250,250,250,250,250,250,250,250,250,250,250,250,250,250,250,250,250,250,250]
["2001-10-12","sexta-feira","Nossa Sr.a Aparecida - Padroeira do Brasil",null,null,219,7,"2026-05-07",250,225.76640558365358,225.76640558365358,4.0543131114712514,null,null,null,null,null,null,7,250,223.08181596156564,223.08181596156564,223.08181596156564,223.08181596156564,223.08181596156564,223.08181596156564,{"$error":"#N/A"},{"$error":"#N/A"},{"$error":"#N/A"},{"$error":"#N/A"},{"$error":"#N/A"},{"$error":"#N/A"},null,0,0,0,0,0,0,0,0,0,0,0,0,null,250,250,250,250,250,250,250,250,250,250,250,250,null,219,7,"2026-05-07",250,250,250,250,"2026-05-07","2026-05-07",null,{"$f":"IF(I42=0,0,PMT($BR$31,$I$10,$BR$35))","v":280.15693363560268},250,250,250,null,null,null,250,250,250,250,250,250,250,250,250,250,250,250,250,250,250,250,250,250,250,250,250,250,250,250,250,250,250,250,250,250,250,250,250,250,250,250,250,250,250,250,250,250,250,250,250,250,250,250,250,250,250,250,250,250,250,250,250,250,250,250,250,250,250,250,250,250,250,250,250,250,250,250,250,250,250,250,250,250]
["2001-11-02","sexta-feira","Finados",null,null,250,8,"2026-06-07",250,222.53138749002423,222.53138749002423,4.5618934435454968,null,null,null,null,null,null,8,250,219.51325118274659,219.51325118274659,219.51325118274659,219.51325118274659,219.51325118274659,219.51325118274659,{"$error":"#N/A"},{"$error":"#N/A"},{"$error":"#N/A"},{"$error":"#N/A"},{"$error":"#N/A"},{"$error":"#N/A"},null,0,0,0,0,0,0,0,0,0,0,0,0,null,250,250,250,250,250,250,250,250,250,250,250,250,null,250,8,"2026-06-07",250,250,250,250,"2026-06-07","2026-06-07",null,280.15693363560268,250,250,250,null,null,null,250,250,250,250,250,250,250,250,250,250,250,250,250,250,250,250,250,250,250,250,250,250,250,250,250,250,250,250,250,250,250,250,250,250,250,250,250,250,250,250,250,250,250,250,250,250,250,250,250,250,250,250,250,250,250,250,250,250,250,250,250,250,250,250,250,250,250,250,250,250,250,250,250,250,250,250,250,250]
["2001-11-15","quinta-feira","Proclamação da República",null,null,280,9,"2026-07-07",250,219.44486752694431,219.44486752694431,5.0384541584186406,null,null,null,null,null,null,9,250,216.11416343236814,216.11416343236814,216.11416343236814,216.11416343236814,216.11416343236814,216.11416343236814,{"$error":"#N/A"},{"$error":"#N/A"},{"$error":"#N/A"},{"$error":"#N/A"},{"$error":"#N/A"},{"$error":"#N/A"},null,0,0,0,0,0,0,0,0,0,0,0,0,null,250,250,250,250,250,250,250,250,250,250,250,250,null,280,9,"2026-07-07",250,250,250,250,"2026-07-07","2026-07-07",null,280.15693363560268,250,250,250,null,null,null,250,250,250,250,250,250,250,250,250,250,250,250,250,250,250,250,250,250,250,250,250,250,250,250,250,250,250,250,250,250,250,250,250,250,250,250,250,250,250,250,250,250,250,250,250,250,250,250,250,250,250,250,250,250,250,250,250,250,250,250,250,250,250,250,250,250,250,250,250,250,250,250,250,250,250,250,250,250]
["2001-12-25","terça-feira","Natal",null,null,311,10,"2026-08-07",250,216.30043106763807,216.30043106763807,5.5160935930869064,null,null,null,null,null,null,10,250,212.65705784756531,212.65705784756531,212.65705784756531,212.65705784756531,212.65705784756531,212.65705784756531,{"$error":"#N/A"},{"$error":"#N/A"},{"$error":"#N/A"},{"$error":"#N/A"},{"$error":"#N/A"},{"$error":"#N/A"},null,0,0,0,0,0,0,0,0,0,0,0,0,null,250,250,250,250,250,250,250,250,250,250,250,250,null,311,10,"2026-08-07",250,250,250,250,"2026-08-07","2026-08-07",null,280.15693363560268,250,250,250,null,null,null,250,250,250,250,250,250,250,250,250,250,250,250,250,250,250,250,250,250,250,250,250,250,250,250,250,250,250,250,250,250,250,250,250,250,250,250,250,250,250,250,250,250,250,250,250,250,250,250,250,250,250,250,250,250,250,250,250,250,250,250,250,250,250,250,250,250,{"$f":"IF($G45>EM$33,0,$I$9)","v":250},250,250,250,250,250,250,250,250,250,250,250]
["2002-01-01","terça-feira","Confraternização Universal",null,null,342,11,"2026-09-07",250,213.20105139529633,213.20105139529633,5.9790102853296911,null,null,null,null,null,null,11,250,209.25525441804302,209.25525441804302,209.25525441804302,209.25525441804302,209.25525441804302,209.25525441804302,{"$error":"#N/A"},{"$error":"#N/A"},{"$error":"#N/A"},{"$error":"#N/A"},{"$error":"#N/A"},{"$error":"#N/A"},null,0,0,0,0,0,0,0,0,0,0,0,0,null,250,250,250,250,250,250,250,250,250,250,250,250,null,342,11,"2026-09-07",250,250,250,250,"2026-09-07","2026-09-07",null,280.15693363560268,250,250,250,null,null,null,250,250,250,250,250,250,250,250,250,250,250,250,250,250,250,250,250,250,250,250,250,250,250,250,250,250,250,250,250,250,250,250,250,250,250,250,250,250,250,250,250,250,250,250,250,250,250,250,250,250,250,250,250,250,250,250,250,250,250,250,250,250,250,250,250,250,250,250,250,250,250,250,250,250,250,250,250,250]
["2002-02-11","segunda-feira","Carnaval",null,null,372,12,"2026-10-07",250,210.2439435971404,210.2439435971404,6.2926012318624123,null,null,null,null,null,null,12,250,206.01500824537561,206.01500824537561,206.01500824537561,206.01500824537561,206.01500824537561,206.01500824537561,{"$error":"#N/A"},{"$error":"#N/A"},{"$error":"#N/A"},{"$error":"#N/A"},{"$error":"#N/A"},{"$error":"#N/A"},null,0,0,0,0,0,0,0,0,0,0,0,0,null,250,250,250,250,250,250,250,250,250,250,250,250,null,372,12,"2026-10-07",250,250,250,250,"2026-10-07","2026-10-07",null,280.15693363560268,250,250,250,null,null,null,250,250,250,250,250,250,250,250,250,250,250,250,250,250,250,250,250,250,250,250,250,250,250,250,250,250,250,250,250,250,250,250,250,250,250,250,250,250,250,250,250,250,250,250,250,250,250,250,250,250,250,250,250,250,250,250,250,250,250,250,250,250,250,250,250,250,250,250,250,250,250,250,250,250,250,250,250,250]
["2002-02-12","terça-feira","Carnaval",null,null,403,13,"2026-11-07",250,207.2313476360433,207.2313476360433,6.202434234746776,null,null,null,null,null,null,13,250,202.7194554493592,202.7194554493592,202.7194554493592,202.7194554493592,202.7194554493592,202.7194554493592,{"$error":"#N/A"},{"$error":"#N/A"},{"$error":"#N/A"},{"$error":"#N/A"},{"$error":"#N/A"},{"$error":"#N/A"},null,0,0,0,0,0,0,0,0,0,0,0,0,null,250,250,250,250,250,250,250,250,250,250,250,250,null,403,13,"2026-11-07",250,250,250,250,"2026-11-07","2026-11-07",null,280.15693363560268,250,250,250,null,null,null,250,250,250,250,250,250,250,250,250,250,250,250,250,250,250,250,250,250,250,250,250,250,250,250,250,250,250,250,250,250,250,250,250,250,250,250,250,250,250,250,250,250,250,250,250,250,250,250,250,250,250,250,250,250,250,250,250,250,250,250,250,250,250,250,250,250,250,250,250,250,250,250,250,250,250,250,250,250]
["2002-03-29","sexta-feira","Paixão de Cristo",null,null,433,14,"2026-12-07",250,204.35703988705987,204.35703988705987,6.1164062038197011,null,null,null,null,null,null,14,250,199.58041389232969,199.58041389232969,199.58041389232969,199.58041389232969,199.58041389232969,199.58041389232969,{"$error":"#N/A"},{"$error":"#N/A"},{"$error":"#N/A"},{"$error":"#N/A"},{"$error":"#N/A"},{"$error":"#N/A"},null,0,0,0,0,0,0,0,0,0,0,0,0,null,250,250,250,250,250,250,250,250,250,250,250,250,null,433,14,"2026-12-07",250,250,250,250,"2026-12-07","2026-12-07",null,280.15693363560268,250,250,250,null,null,null,250,250,250,250,250,250,250,250,250,250,250,250,250,250,250,250,250,250,250,250,250,250,250,250,250,250,250,250,250,250,250,250,250,250,250,250,250,250,250,250,250,250,250,250,250,250,250,250,250,250,250,250,250,250,250,250,250,250,250,250,250,250,250,250,250,250,250,250,250,250,250,250,250,250,250,250,250,250]
["2002-04-21","domingo","Tiradentes",null,null,464,15,"2027-01-07",250,201.4287976630404,201.4287976630404,6.0287639140547995,null,null,null,null,null,null,15,250,196.3877931379738,196.3877931379738,196.3877931379738,196.3877931379738,196.3877931379738,196.3877931379738,{"$error":"#N/A"},{"$error":"#N/A"},{"$error":"#N/A"},{"$error":"#N/A"},{"$error":"#N/A"},{"$error":"#N/A"},null,0,0,0,0,0,0,0,0,0,0,0,0,null,250,250,250,250,250,250,250,250,250,250,250,250,null,464,15,"2027-01-07",250,250,250,250,"2027-01-07","2027-01-07",null,280.15693363560268,250,250,250,null,null,null,250,250,250,250,250,250,250,250,250,250,250,250,250,250,250,250,250,250,250,250,250,250,250,250,250,250,250,250,250,250,250,250,250,250,250,250,250,250,250,250,250,250,250,250,250,250,250,250,250,250,250,250,250,250,250,250,{"$f":"IF($G50>EC$33,0,$I$9)","v":250},250,250,250,250,250,250,250,250,250,250,250,250,250,250,250,250,250,250,250,250,250]
["2002-05-01","quarta-feira","Dia do Trabalho",null,null,495,16,"2027-02-07",250,198.54251436799777,198.54251436799777,5.9423774550341735,null,null,null,null,null,null,16,250,193.24624366402247,193.24624366402247,193.24624366402247,193.24624366402247,193.24624366402247,193.24624366402247,{"$error":"#N/A"},{"$error":"#N/A"},{"$error":"#N/A"},{"$error":"#N/A"},{"$error":"#N/A"},{"$error":"#N/A"},null,0,0,0,0,0,0,0,0,0,0,0,0,null,250,250,250,250,250,250,250,250,250,250,250,250,null,495,16,"2027-02-07",250,250,250,250,"2027-02-07","2027-02-07",null,280.15693363560268,250,250,250,null,null,null,250,250,250,250,250,250,250,250,250,250,250,250,250,250,250,250,{"$f":"IF($G51>CO$33,0,$I$9)","v":250},250,250,250,250,250,250,250,250,250,250,250,250,250,250,250,250,250,250,250,250,250,250,250,250,250,250,250,250,250,250,250,250,250,250,250,250,250,250,250,250,250,250,250,250,250,250,250,250,250,250,250,250,250,250,250,250,250,250,250,250,250]
["2002-05-30","quinta-feira","Corpus Christi",null,null,523,17,"2027-03-07",250,195.97111313045747,195.97111313045747,5.8654154159945922,null,null,null,null,null,null,17,250,{"$f":"$T52/((U$29)^($H52-$H$35))","v":190.45193214642964},190.45193214642964,190.45193214642964,190.45193214642964,190.45193214642964,190.45193214642964,{"$error":"#N/A"},{"$error":"#N/A"},{"$error":"#N/A"},{"$error":"#N/A"},{"$f":"$T52/((AE$29)^($H52-$H$35))","v":{"$error":"#N/A"}},{"$error":"#N/A"},null,0,0,0,0,0,0,0,0,0,0,0,0,null,{"$f":"$T52","v":250},250,250,250,250,250,250,250,250,250,250,250,null,523,17,"2027-03-07",250,250,250,250,"2027-03-07","2027-03-07",null,280.15693363560268,250,250,250,null,null,null,250,{"$f":"IF($G52>BZ$33,0,$I$9)","v":250},250,250,250,250,250,250,250,250,250,250,250,250,250,250,250,250,250,250,250,250,250,250,250,250,250,250,250,250,250,250,250,250,250,250,250,250,250,250,250,250,250,250,250,250,250,250,250,250,250,250,250,250,250,250,250,250,250,250,250,250,250,250,250,250,250,250,250,250,250,250,250,250,250,250,250,250]
["2002-09-07","sábado","Independência do Brasil",null,null,554,18,"2027-04-07",250,193.16303326947568,193.16303326947568,5.7813695857554075,null,null,null,null,null,null,18,250,187.40533664429836,187.40533664429836,187.40533664429836,187.40533664429836,187.40533664429836,187.40533664429836,{"$error":"#N/A"},{"$error":"#N/A"},{"$error":"#N/A"},{"$error":"#N/A"},{"$error":"#N/A"},{"$error":"#N/A"},null,0,0,0,0,0,0,0,0,0,0,0,0,null,250,250,250,250,250,250,250,250,250,250,250,250,null,554,18,"2027-04-07",250,250,250,250,"2027-04-07","2027-04-07",null,280.15693363560268,250,250,250,null,null,null,{"$f":"IF($G53>BY$33,0,$I$9)","v":250},250,250,250,250,250,250,250,250,250,250,250,250,250,250,250,250,250,250,250,250,250,250,250,250,250,250,250,250,250,250,250,250,250,250,250,250,250,250,250,250,250,250,250,250,250,250,250,250,250,250,250,250,250,250,250,250,250,250,250,250,250,250,250,250,250,250,250,250,250,250,250,250,250,250,250,250,250]
["2002-10-12","sábado","Nossa Sr.a Aparecida - Padroeira do Brasil",null,null,584,19,"2027-05-07",250,190.48385364883882,190.48385364883882,5.701181739709746,null,null,null,null,null,null,19,250,184.50342898856022,184.50342898856022,184.50342898856022,184.50342898856022,184.50342898856022,184.50342898856022,{"$error":"#N/A"},{"$error":"#N/A"},{"$error":"#N/A"},{"$error":"#N/A"},{"$error":"#N/A"},{"$error":"#N/A"},null,0,0,0,0,0,0,0,0,0,0,0,0,null,250,250,250,250,250,250,250,250,250,250,250,250,null,584,19,"2027-05-07",250,250,250,250,"2027-05-07","2027-05-07",null,280.15693363560268,250,250,250,null,null,null,250,250,250,250,250,250,250,250,250,250,250,250,250,250,250,250,250,250,250,250,250,250,250,250,250,250,250,250,250,250,250,250,250,250,250,250,250,250,250,250,250,250,250,250,250,250,250,250,250,250,250,250,250,250,250,250,250,250,250,250,250,250,250,250,250,250,250,250,250,250,250,250,250,250,250,250,250,250]
["2002-11-02","sábado","Finados",null,null,615,20,"2027-06-07",250,187.75440100283876,187.75440100283876,5.6194892220149644,null,null,null,null,null,null,20,250,181.55198969073172,181.55198969073172,181.55198969073172,181.55198969073172,181.55198969073172,181.55198969073172,{"$error":"#N/A"},{"$error":"#N/A"},{"$error":"#N/A"},{"$error":"#N/A"},{"$error":"#N/A"},{"$error":"#N/A"},null,0,0,0,0,0,0,0,0,0,0,0,0,null,250,250,250,250,250,250,250,250,250,250,250,250,null,615,20,"2027-06-07",250,250,250,250,"2027-06-07","2027-06-07",null,280.15693363560268,250,250,250,null,null,null,250,250,250,250,250,250,250,250,250,250,250,250,250,250,250,250,250,250,250,250,250,250,250,250,250,250,250,250,250,250,250,250,250,250,250,250,250,250,250,250,250,250,250,250,250,250,250,250,250,250,250,250,250,{"$f":"IF($G55>DZ$33,0,$I$9)","v":250},250,250,250,250,250,250,250,250,250,250,250,250,250,250,250,250,250,250,250,250,250,250,250,0]
["2002-11-15","sexta-feira","Proclamação da República",null,null,645,21,"2027-07-07",250,185.15023934552036,185.15023934552036,5.5415466636114248,null,null,null,null,null,null,21,250,178.74071911417391,178.74071911417391,178.74071911417391,178.74071911417391,178.74071911417391,178.74071911417391,{"$error":"#N/A"},{"$error":"#N/A"},{"$error":"#N/A"},{"$error":"#N/A"},{"$error":"#N/A"},{"$error":"#N/A"},null,0,0,0,0,0,0,0,0,0,0,0,0,null,250,250,250,250,250,250,250,250,250,250,250,250,null,645,21,"2027-07-07",250,250,250,250,"2027-07-07","2027-07-07",null,280.15693363560268,250,250,250,null,null,null,250,250,250,250,250,250,250,250,250,250,250,250,250,250,250,250,250,250,250,250,250,250,250,250,250,250,250,250,250,250,250,250,250,250,250,250,250,250,250,250,250,250,250,250,250,250,250,250,250,250,250,250,250,250,250,250,250,250,250,250,250,250,250,250,250,250,250,250,250,250,250,250,250,250,250,250,0,0]
["2002-12-25","quarta-feira","Natal",null,null,676,22,"2027-08-07",250,182.49721232507369,182.49721232507369,5.4621415648894551,null,null,null,null,null,null,22,250,175.88146394798179,175.88146394798179,175.88146394798179,175.88146394798179,175.88146394798179,175.88146394798179,{"$error":"#N/A"},{"$error":"#N/A"},{"$error":"#N/A"},{"$error":"#N/A"},{"$error":"#N/A"},{"$error":"#N/A"},null,0,0,0,0,0,0,0,0,0,0,0,0,null,250,250,250,250,250,250,250,250,250,250,250,250,null,676,22,"2027-08-07",250,250,250,250,"2027-08-07","2027-08-07",null,280.15693363560268,250,250,250,null,null,null,250,250,250,250,250,250,250,250,250,250,250,250,250,250,250,250,250,250,250,250,250,250,250,250,250,250,250,250,250,250,250,250,250,250,250,250,250,250,250,250,250,250,250,250,250,250,250,250,250,250,250,250,250,250,250,250,250,250,250,250,250,250,250,250,250,250,250,250,250,250,250,250,250,250,250,0,0,0]
["2003-01-01","quarta-feira","Confraternização Universal",null,null,707,23,"2027-09-07",250,179.88220066121582,179.88220066121582,5.3838742657901895,null,null,null,null,null,null,23,250,173.06794732500424,173.06794732500424,173.06794732500424,173.06794732500424,173.06794732500424,173.06794732500424,{"$error":"#N/A"},{"$error":"#N/A"},{"$error":"#N/A"},{"$error":"#N/A"},{"$error":"#N/A"},{"$error":"#N/A"},null,0,0,0,0,0,0,0,0,0,0,0,0,null,250,250,250,250,250,250,250,250,250,250,250,250,null,707,23,"2027-09-07",250,250,250,250,"2027-09-07","2027-09-07",null,280.15693363560268,250,250,250,null,null,null,250,250,250,250,250,250,250,250,250,250,250,250,250,250,250,250,250,250,250,250,250,250,250,250,250,250,250,250,250,250,250,250,250,250,250,250,250,250,250,250,250,250,250,250,250,250,250,250,250,250,250,250,250,250,250,250,250,250,250,250,250,250,250,250,250,250,250,250,250,250,250,250,250,250,0,0,0,0]
["2003-03-03","segunda-feira","Carnaval",null,null,737,24,"2027-10-07",250,177.3872267629001,177.3872267629001,5.3091996970136002,null,null,null,null,null,null,24,250,170.38804924793632,170.38804924793632,170.38804924793632,170.38804924793632,170.38804924793632,170.38804924793632,{"$error":"#N/A"},{"$error":"#N/A"},{"$error":"#N/A"},{"$error":"#N/A"},{"$error":"#N/A"},{"$error":"#N/A"},null,0,0,0,0,0,0,0,0,0,0,0,0,null,250,250,250,250,250,250,250,250,250,250,250,250,null,737,24,"2027-10-07",250,250,250,250,"2027-10-07","2027-10-07",null,280.15693363560268,250,250,250,null,null,null,250,250,250,250,250,250,250,250,250,250,250,250,250,250,250,250,250,250,250,250,250,250,250,250,250,250,250,250,250,250,250,250,250,250,250,250,250,250,250,250,250,250,250,250,250,250,250,250,250,250,250,250,250,250,250,250,250,250,250,250,250,250,250,250,250,250,250,250,250,250,250,250,250,0,0,0,0,0]
["2003-03-04","terça-feira","Carnaval",null,null,768,25,"2027-11-07",250,174.84543633720236,174.84543633720236,5.2331239095724671,null,null,null,null,null,null,25,250,167.66240893226566,167.66240893226566,167.66240893226566,167.66240893226566,167.66240893226566,167.66240893226566,{"$error":"#N/A"},{"$error":"#N/A"},{"$error":"#N/A"},{"$error":"#N/A"},{"$error":"#N/A"},{"$error":"#N/A"},null,0,0,0,0,0,0,0,0,0,0,0,0,null,250,250,250,250,250,250,250,250,250,250,250,250,null,768,25,"2027-11-07",250,250,250,250,"2027-11-07","2027-11-07",null,280.15693363560268,250,250,250,null,null,null,250,250,250,250,250,250,250,250,250,250,250,250,250,250,250,250,250,250,250,250,250,250,250,250,250,250,250,250,250,250,250,250,250,250,250,250,250,250,250,250,250,250,250,{"$f":"IF($G60>DP$33,0,$I$9)","v":250},250,250,250,250,250,250,250,250,250,250,250,250,250,250,250,250,250,250,250,250,250,250,250,250,250,250,250,250,0,0,0,0,0,0]
["2003-04-18","sexta-feira","Paixão de Cristo",null,null,798,26,"2027-12-07",250,172.42032257776748,172.42032257776748,5.1605402547525809,null,null,null,null,null,null,26,250,165.06621377170035,165.06621377170035,165.06621377170035,165.06621377170035,165.06621377170035,165.06621377170035,{"$error":"#N/A"},{"$error":"#N/A"},{"$error":"#N/A"},{"$error":"#N/A"},{"$error":"#N/A"},{"$error":"#N/A"},null,0,0,0,0,0,0,0,0,0,0,0,0,null,250,250,250,250,250,250,250,250,250,250,250,250,null,798,26,"2027-12-07",250,250,250,250,"2027-12-07","2027-12-07",null,280.15693363560268,250,250,250,null,null,null,250,250,250,250,250,250,250,250,250,250,250,250,250,250,250,250,250,250,250,250,250,250,250,250,250,250,250,250,250,250,250,250,250,250,250,250,250,250,250,250,250,250,250,250,250,250,250,250,250,250,250,250,250,250,250,250,250,250,250,250,250,250,250,250,250,250,250,250,250,250,250,0,0,0,0,0,0,0]
["2003-04-21","segunda-feira","Tiradentes",null,null,829,27,"2028-01-07",250,169.9497031700372,169.9497031700372,5.0865946158792132,null,null,null,null,null,null,27,250,162.42570506820215,162.42570506820215,162.42570506820215,162.42570506820215,162.42570506820215,162.42570506820215,{"$error":"#N/A"},{"$f":"$T62/((AB$29)^($H62-$H$35))","v":{"$error":"#N/A"}},{"$error":"#N/A"},{"$error":"#N/A"},{"$error":"#N/A"},{"$error":"#N/A"},null,0,0,0,0,0,0,0,0,0,0,0,0,null,250,250,250,250,250,250,250,250,250,250,250,250,null,829,27,"2028-01-07",250,250,250,250,"2028-01-07","2028-01-07",null,280.15693363560268,250,250,250,null,null,null,250,250,250,250,250,250,250,250,250,250,250,250,250,250,250,250,250,250,250,250,250,250,250,250,250,250,250,250,250,250,250,250,250,250,250,250,250,250,250,250,250,250,250,250,250,250,250,250,250,250,250,250,250,250,250,250,250,250,250,250,250,250,250,250,250,250,250,250,250,250,0,0,0,0,0,0,0,0]
["2003-05-01","quinta-feira","Dia do Trabalho",null,null,860,28,"2028-02-07",250,167.51448539110908,167.51448539110908,5.0137085477558951,null,null,null,null,null,null,28,250,159.82743569432773,159.82743569432773,159.82743569432773,159.82743569432773,159.82743569432773,159.82743569432773,{"$error":"#N/A"},{"$error":"#N/A"},{"$error":"#N/A"},{"$error":"#N/A"},{"$error":"#N/A"},{"$error":"#N/A"},null,0,0,0,0,0,0,0,0,0,0,0,0,null,250,250,250,250,250,250,250,250,250,250,250,250,null,860,28,"2028-02-07",250,250,250,250,"2028-02-07","2028-02-07",null,280.15693363560268,250,250,250,null,null,null,250,250,250,250,250,250,250,250,250,250,250,250,250,250,250,250,250,250,250,250,250,250,250,250,250,250,250,250,250,250,250,250,250,250,250,250,250,250,250,250,250,250,250,250,250,250,250,250,250,250,250,250,250,250,250,250,250,250,250,250,250,250,250,250,250,250,250,250,250,0,0,0,0,0,0,0,0,0]
["2003-06-19","quinta-feira","Corpus Christi",null,null,889,29,"2028-03-07",250,165.26797831327173,165.26797831327173,4.9464705909162232,null,null,null,null,null,null,29,250,157.43443745685519,157.43443745685519,157.43443745685519,157.43443745685519,157.43443745685519,157.43443745685519,{"$error":"#N/A"},{"$error":"#N/A"},{"$error":"#N/A"},{"$error":"#N/A"},{"$error":"#N/A"},{"$error":"#N/A"},null,0,0,0,0,0,0,0,0,0,0,0,0,null,250,250,250,250,250,250,250,250,250,250,250,250,null,889,29,"2028-03-07",250,250,250,250,"2028-03-07","2028-03-07",null,280.15693363560268,250,250,250,null,null,null,250,250,250,250,250,250,250,250,250,250,250,250,250,250,250,250,250,250,250,250,250,250,250,250,250,250,250,250,250,250,250,250,250,250,250,250,250,250,250,250,250,250,250,250,250,250,250,250,250,250,250,250,250,250,250,250,250,250,250,250,250,250,250,250,250,250,250,250,0,0,0,0,0,0,0,0,0,0]
["2003-09-07","domingo","Independência do Brasil",null,null,920,30,"2028-04-07",250,162.89984520348153,162.89984520348153,4.8755923669402019,null,null,null,null,null,null,30,250,154.91601171220142,154.91601171220142,154.91601171220142,154.91601171220142,154.91601171220142,154.91601171220142,{"$error":"#N/A"},{"$error":"#N/A"},{"$error":"#N/A"},{"$error":"#N/A"},{"$error":"#N/A"},{"$error":"#N/A"},null,0,0,0,0,0,0,0,0,0,0,0,0,null,250,250,250,250,250,250,250,250,250,250,250,250,null,920,30,"2028-04-07",250,250,250,250,"2028-04-07","2028-04-07",null,280.15693363560268,250,250,250,null,null,null,250,250,250,250,250,250,250,250,250,250,250,250,250,250,250,250,250,250,250,250,250,250,250,250,250,250,250,250,250,250,250,250,250,{"$f":"IF($G65>DF$33,0,$I$9)","v":250},250,250,250,250,250,250,250,250,250,250,250,250,250,250,250,250,250,250,250,250,250,250,250,250,250,250,250,250,250,250,250,250,250,0,0,0,0,0,0,0,0,0,0,0]
["2003-10-12","domingo","Nossa Sr.a Aparecida - Padroeira do Brasil",null,null,950,31,"2028-05-07",250,160.64041730940201,160.64041730940201,4.8079676900704023,null,null,null,null,null,null,31,250,152.51719016083166,152.51719016083166,152.51719016083166,152.51719016083166,152.51719016083166,152.51719016083166,{"$error":"#N/A"},{"$error":"#N/A"},{"$error":"#N/A"},{"$error":"#N/A"},{"$error":"#N/A"},{"$error":"#N/A"},null,0,0,0,0,0,0,0,0,0,0,0,0,null,250,250,250,250,250,250,250,250,250,250,250,250,null,950,31,"2028-05-07",250,250,250,250,"2028-05-07","2028-05-07",null,280.15693363560268,250,250,250,null,null,null,250,250,250,250,250,250,250,250,250,250,250,250,250,250,250,250,250,250,250,250,250,250,250,250,250,250,250,250,250,250,250,250,250,250,250,250,250,250,250,250,250,250,250,250,250,250,250,250,250,250,250,250,250,250,250,250,250,250,250,250,250,250,250,250,250,250,0,0,0,0,0,0,0,0,0,0,0,0]
["2003-11-02","domingo","Finados",null,null,981,32,"2028-06-07",250,158.33859275219817,158.33859275219817,4.7390740810732908,null,null,null,null,null,null,32,250,150.0774239673103,150.0774239673103,150.0774239673103,150.0774239673103,150.0774239673103,150.0774239673103,{"$error":"#N/A"},{"$error":"#N/A"},{"$error":"#N/A"},{"$error":"#N/A"},{"$error":"#N/A"},{"$error":"#N/A"},null,0,0,0,0,0,0,0,0,0,0,0,0,null,250,250,250,250,250,250,250,250,250,250,250,250,null,981,32,"2028-06-07",250,250,250,250,"2028-06-07","2028-06-07",null,280.15693363560268,250,250,250,null,null,null,250,250,250,250,250,250,250,250,250,250,250,250,250,250,250,250,{"$f":"IF($G67>CO$33,0,$I$9)","v":250},250,250,250,250,250,250,250,250,250,250,250,250,250,250,250,250,250,250,250,250,250,250,250,250,250,250,250,250,250,250,250,250,250,250,250,250,250,250,250,250,250,250,250,250,250,250,250,250,0,0,0,0,0,0,0,0,0,0,0,0,0]
["2003-11-15","sábado","Proclamação da República",null,null,1011,33,"2028-07-07",250,156.14242962677147,156.14242962677147,4.6733429187292703,null,null,null,null,null,null,33,250,{"$f":"$T68/((U$29)^($H68-$H$35))","v":147.75352629522425},147.75352629522425,147.75352629522425,147.75352629522425,147.75352629522425,147.75352629522425,{"$error":"#N/A"},{"$error":"#N/A"},{"$error":"#N/A"},{"$error":"#N/A"},{"$error":"#N/A"},{"$error":"#N/A"},null,0,0,0,0,0,0,0,0,0,0,0,0,null,{"$f":"$T68","v":250},250,250,250,250,250,250,250,250,250,250,250,null,1011,33,"2028-07-07",250,250,250,250,"2028-07-07","2028-07-07",null,280.15693363560268,250,250,250,null,null,null,250,250,250,250,250,250,250,250,250,250,250,250,250,250,250,{"$f":"IF($G68>CN$33,0,$I$9)","v":250},250,250,250,250,250,250,250,250,250,250,250,250,250,250,250,250,250,250,250,250,250,250,250,250,250,250,250,250,250,250,250,250,250,250,250,250,250,250,250,250,250,250,250,250,250,250,250,250,0,0,0,0,0,0,0,0,0,0,0,0,0,0]
["2003-12-25","quinta-feira","Natal",null,null,1042,34,"2028-08-07",250,153.90505695956708,153.90505695956708,4.6063783547998423,null,null,null,null,null,null,34,250,145.38996283035496,145.38996283035496,145.38996283035496,145.38996283035496,145.38996283035496,145.38996283035496,{"$error":"#N/A"},{"$error":"#N/A"},{"$error":"#N/A"},{"$error":"#N/A"},{"$error":"#N/A"},{"$error":"#N/A"},null,0,0,0,0,0,0,0,0,0,0,0,0,null,250,250,250,250,250,250,250,250,250,250,250,250,null,1042,34,"2028-08-07",250,250,250,250,"2028-08-07","2028-08-07",null,280.15693363560268,250,250,{"$f":"IF(G69>$BU$31,0,$BU$32)","v":250},null,null,null,{"$f":"IF($G69>BY$33,0,$I$9)","v":250},250,250,250,250,250,250,250,250,250,250,250,250,250,250,250,250,250,250,250,250,250,250,250,250,250,250,250,250,250,250,250,250,250,250,250,250,250,250,250,250,250,250,250,250,250,250,250,250,250,250,250,250,250,250,250,250,250,250,250,250,250,250,0,0,0,0,0,0,0,0,0,0,0,0,0,0,0]
["2004-01-01","quinta-feira","Confraternização Universal",null,null,1073,35,"2028-09-07",250,151.69974371697853,151.69974371697853,4.5403733294491673,null,null,null,null,null,null,35,250,143.06420849527458,143.06420849527458,143.06420849527458,143.06420849527458,143.06420849527458,143.06420849527458,{"$error":"#N/A"},{"$error":"#N/A"},{"$error":"#N/A"},{"$error":"#N/A"},{"$error":"#N/A"},{"$error":"#N/A"},null,0,0,0,0,0,0,0,0,0,0,0,0,null,250,250,250,250,250,250,250,250,250,250,250,250,null,1073,35,"2028-09-07",250,250,250,250,"2028-09-07","2028-09-07",null,280.15693363560268,250,250,250,null,null,null,250,250,250,250,250,250,250,250,250,250,250,250,250,250,250,250,250,250,250,250,250,250,250,250,250,250,250,250,250,250,{"$f":"IF($G70>DC$33,0,$I$9)","v":250},250,250,250,250,250,250,250,250,250,250,250,250,250,250,250,250,250,250,250,250,250,250,250,250,250,250,250,250,250,250,250,0,0,0,0,0,0,0,0,0,0,0,0,0,0,0,0]
["2004-02-23","segunda-feira","Carnaval",null,null,1103,36,"2028-10-07",250,149.59566171462481,149.59566171462481,4.4773981551187205,null,null,null,null,null,null,36,250,140.84890807038573,140.84890807038573,140.84890807038573,140.84890807038573,140.84890807038573,140.84890807038573,{"$error":"#N/A"},{"$error":"#N/A"},{"$error":"#N/A"},{"$error":"#N/A"},{"$error":"#N/A"},{"$error":"#N/A"},null,0,0,0,0,0,0,0,0,0,0,0,0,null,250,250,250,250,250,250,250,250,250,250,250,250,null,1103,36,"2028-10-07",250,250,250,250,"2028-10-07","2028-10-07",null,280.15693363560268,250,250,250,null,null,null,250,250,250,250,250,250,250,250,250,250,250,250,250,250,250,250,250,250,250,250,250,250,250,250,250,250,250,250,250,250,250,250,250,250,250,250,250,250,250,250,250,250,250,250,250,250,250,250,250,250,250,250,250,250,250,250,250,250,250,250,250,0,0,0,0,0,0,0,0,0,0,0,0,0,0,0,0,0]
["2004-02-24","terça-feira","Carnaval",null,null,1134,37,"2028-11-07",250,147.45209801158327,147.45209801158327,4.4132412934866876,null,null,null,null,null,null,37,250,138.59579546096671,138.59579546096671,138.59579546096671,138.59579546096671,138.59579546096671,138.59579546096671,{"$error":"#N/A"},{"$error":"#N/A"},{"$error":"#N/A"},{"$error":"#N/A"},{"$error":"#N/A"},{"$error":"#N/A"},null,0,0,0,0,0,0,0,0,0,0,0,0,null,250,250,250,250,250,250,250,250,250,250,250,250,null,1134,37,"2028-11-07",250,250,250,250,"2028-11-07","2028-11-07",null,280.15693363560268,250,250,250,null,null,null,250,250,250,250,250,250,250,250,250,250,250,250,250,250,250,250,250,250,250,250,250,250,250,250,250,250,250,250,250,250,250,250,250,250,250,250,250,250,250,250,250,250,250,250,250,250,250,250,250,250,250,250,250,250,250,250,250,250,250,250,0,0,0,0,0,0,0,0,0,0,0,0,0,0,0,0,0,0]
["2004-04-09","sexta-feira","Paixão de Cristo",null,null,1164,38,"2028-12-07",250,145.40693103876166,145.40693103876166,4.3520294459901363,null,null,null,null,null,null,38,250,136.44968688634984,136.44968688634984,136.44968688634984,136.44968688634984,136.44968688634984,136.44968688634984,{"$error":"#N/A"},{"$error":"#N/A"},{"$error":"#N/A"},{"$error":"#N/A"},{"$error":"#N/A"},{"$error":"#N/A"},null,0,0,0,0,0,0,0,0,0,0,0,0,null,250,250,250,250,250,250,250,250,250,250,250,250,null,1164,38,"2028-12-07",250,250,250,250,"2028-12-07","2028-12-07",null,280.15693363560268,250,250,250,null,null,null,250,250,250,250,250,250,250,250,250,250,250,250,250,250,250,250,250,250,250,250,250,250,250,250,250,250,250,250,250,250,250,250,250,250,250,250,250,250,250,250,250,250,250,250,250,250,250,250,250,250,250,250,250,250,250,250,250,250,250,0,0,0,0,0,0,0,0,0,0,0,0,0,0,0,0,0,0,0]
["2004-04-21","quarta-feira","Tiradentes",null,null,1195,39,"2029-01-07",250,143.32338786663456,143.32338786663456,4.2896689988483727,null,null,null,null,null,null,39,250,134.26694713858217,134.26694713858217,134.26694713858217,134.26694713858217,134.26694713858217,134.26694713858217,{"$error":"#N/A"},{"$error":"#N/A"},{"$error":"#N/A"},{"$error":"#N/A"},{"$error":"#N/A"},{"$error":"#N/A"},null,0,0,0,0,0,0,0,0,0,0,0,0,null,250,250,250,250,250,250,250,250,250,250,250,250,null,1195,39,"2029-01-07",250,250,250,250,"2029-01-07","2029-01-07",null,280.15693363560268,250,250,250,null,null,null,250,250,250,250,250,250,250,250,250,250,250,250,250,250,250,250,250,250,250,250,250,250,250,250,250,250,250,250,250,250,250,250,250,250,250,250,250,250,250,250,250,250,250,250,250,250,250,250,250,250,250,250,250,250,250,250,250,250,0,0,0,0,0,0,0,0,0,0,0,0,0,0,0,{"$f":"IF($G74>ET$33,0,$I$9)","v":0},0,0,0,0]
["2004-05-01","sábado","Dia do Trabalho",null,null,1226,40,"2029-02-07",250,141.26969988861069,141.26969988861069,4.2282021176661182,null,null,null,null,null,null,40,250,132.11912394441893,132.11912394441893,132.11912394441893,132.11912394441893,132.11912394441893,132.11912394441893,{"$error":"#N/A"},{"$error":"#N/A"},{"$error":"#N/A"},{"$error":"#N/A"},{"$error":"#N/A"},{"$error":"#N/A"},null,0,0,0,0,0,0,0,0,0,0,0,0,null,250,250,250,250,250,250,250,250,250,250,250,250,null,1226,40,"2029-02-07",250,250,250,250,"2029-02-07","2029-02-07",null,280.15693363560268,250,250,250,null,null,null,250,250,250,250,250,250,250,250,250,250,250,250,250,250,250,250,250,250,250,250,250,250,250,250,250,250,250,250,250,250,250,250,250,250,250,250,250,250,250,250,250,250,250,250,250,250,250,250,250,250,250,250,250,250,250,250,250,0,0,0,0,0,0,0,0,0,0,0,0,0,0,0,0,0,0,0,0,0]
["2004-06-10","quinta-feira","Corpus Christi",null,null,1254,41,"2029-03-07",250,139.44006112193722,139.44006112193722,4.1734410293795809,null,null,null,null,null,null,41,250,130.20870135232946,130.20870135232946,130.20870135232946,130.20870135232946,130.20870135232946,130.20870135232946,{"$error":"#N/A"},{"$error":"#N/A"},{"$error":"#N/A"},{"$error":"#N/A"},{"$error":"#N/A"},{"$error":"#N/A"},null,0,0,0,0,0,0,0,0,0,0,0,0,null,250,250,250,250,250,250,250,250,250,250,250,250,null,1254,41,"2029-03-07",250,250,250,250,"2029-03-07","2029-03-07",null,280.15693363560268,250,250,250,null,null,null,250,250,250,250,250,250,250,250,250,250,250,250,250,250,250,250,250,250,250,250,250,250,250,250,250,250,250,250,250,250,250,250,250,250,250,250,250,250,250,250,250,250,250,250,250,250,250,250,250,250,250,250,250,250,250,250,0,0,0,0,0,0,0,0,0,0,0,0,0,0,0,0,0,0,0,0,0,0]
["2004-09-07","terça-feira","Independência do Brasil",null,null,1285,42,"2029-04-07",250,137.44201752665523,137.44201752665523,4.1136395845727911,null,null,null,null,null,null,42,250,128.12579655106254,128.12579655106254,128.12579655106254,128.12579655106254,128.12579655106254,128.12579655106254,{"$error":"#N/A"},{"$error":"#N/A"},{"$error":"#N/A"},{"$error":"#N/A"},{"$error":"#N/A"},{"$error":"#N/A"},null,0,0,0,0,0,0,0,0,0,0,0,0,null,250,250,250,250,250,250,250,250,250,250,250,250,null,1285,42,"2029-04-07",250,250,250,250,"2029-04-07","2029-04-07",null,280.15693363560268,250,250,250,null,null,null,250,250,250,250,250,250,250,250,250,250,250,250,250,250,250,250,250,250,250,250,250,250,250,250,250,250,250,250,250,250,250,250,250,250,250,250,250,250,250,250,250,250,250,250,250,250,250,250,250,250,250,250,250,250,250,0,0,0,0,0,0,0,0,0,0,0,0,0,0,0,0,0,0,0,0,0,0,0]
["2004-10-12","terça-feira","Nossa Sr.a Aparecida - Padroeira do Brasil",null,null,1315,43,"2029-05-07",250,135.53569080283066,135.53569080283066,4.0565832257287218,null,null,null,null,null,null,43,250,126.14181233499521,126.14181233499521,126.14181233499521,126.14181233499521,126.14181233499521,{"$f":"$T78/((Z$29)^($H78-$H$35))","v":126.14181233499521},{"$error":"#N/A"},{"$error":"#N/A"},{"$error":"#N/A"},{"$error":"#N/A"},{"$error":"#N/A"},{"$error":"#N/A"},null,0,0,0,0,0,0,0,0,0,0,0,0,null,250,250,250,250,250,250,250,250,250,250,250,250,null,1315,43,"2029-05-07",250,250,250,250,"2029-05-07","2029-05-07",null,280.15693363560268,250,250,250,null,null,null,250,250,250,250,250,250,250,250,250,250,250,250,250,250,250,250,250,250,250,250,250,250,250,250,250,250,250,250,250,250,250,250,250,250,250,250,250,250,250,250,250,250,250,250,250,250,250,250,250,250,250,250,250,250,0,0,0,0,0,0,0,0,0,0,0,0,0,0,0,0,0,0,0,0,0,0,0,0]
["2004-11-02","terça-feira","Finados",null,null,1346,44,"2029-06-07",250,133.59359312471864,133.59359312471864,3.9984562422228289,null,null,null,null,null,null,44,250,124.12396418948514,124.12396418948514,124.12396418948514,124.12396418948514,124.12396418948514,124.12396418948514,{"$error":"#N/A"},{"$error":"#N/A"},{"$error":"#N/A"},{"$error":"#N/A"},{"$error":"#N/A"},{"$error":"#N/A"},null,0,0,0,0,0,0,0,0,0,0,0,0,null,250,250,250,250,250,250,250,250,250,250,250,250,null,1346,44,"2029-06-07",250,250,250,250,"2029-06-07","2029-06-07",null,280.15693363560268,250,250,250,null,null,null,250,250,250,250,250,250,250,250,250,250,250,250,250,250,250,250,250,250,250,250,250,250,250,250,250,250,250,250,250,250,250,250,250,250,250,250,250,250,250,250,250,250,250,250,250,250,250,250,250,250,250,250,250,0,0,0,0,0,0,0,0,0,0,{"$f":"IF($G79>EJ$33,0,$I$9)","v":0},0,0,0,0,0,0,0,0,0,0,0,0,0,0]
["2004-11-15","segunda-feira","Proclamação da República",null,null,1376,45,"2029-07-07",250,131.74064421369138,131.74064421369138,3.9429974813157833,null,null,null,null,null,null,45,250,122.20194698126821,122.20194698126821,122.20194698126821,122.20194698126821,122.20194698126821,122.20194698126821,{"$error":"#N/A"},{"$error":"#N/A"},{"$error":"#N/A"},{"$error":"#N/A"},{"$error":"#N/A"},{"$error":"#N/A"},null,0,0,0,0,0,0,0,0,0,0,0,0,null,250,250,250,250,250,250,250,250,250,250,250,250,null,1376,45,"2029-07-07",250,250,250,250,"2029-07-07","2029-07-07",null,280.15693363560268,250,250,250,null,null,null,250,250,250,250,250,250,250,250,250,250,250,250,250,250,250,250,250,250,250,250,250,250,250,250,250,250,250,250,250,250,250,250,250,250,250,250,250,250,250,250,250,250,250,250,250,250,250,250,250,250,250,250,0,0,0,0,0,0,0,0,0,0,0,0,0,0,0,0,0,0,0,0,0,0,0,0,0,0]
["2004-12-25","sábado","Natal",null,null,1407,46,"2029-08-07",250,129.85292594756629,129.85292594756629,3.8864980736106589,null,null,null,null,null,null,46,250,120.24712353669126,120.24712353669126,120.24712353669126,120.24712353669126,120.24712353669126,120.24712353669126,{"$error":"#N/A"},{"$error":"#N/A"},{"$error":"#N/A"},{"$error":"#N/A"},{"$error":"#N/A"},{"$error":"#N/A"},null,0,0,0,0,0,0,0,0,0,0,0,0,null,250,250,250,250,250,250,250,250,250,250,250,250,null,1407,46,"2029-08-07",250,250,250,250,"2029-08-07","2029-08-07",null,280.15693363560268,250,250,250,null,null,null,250,250,250,250,250,250,250,250,250,250,250,250,250,250,250,250,250,250,250,250,250,250,250,250,250,250,250,250,250,250,250,250,250,250,250,250,250,250,250,250,250,250,250,250,250,250,250,250,250,250,250,0,0,0,0,0,0,0,0,0,0,0,0,0,0,0,0,0,0,0,0,0,0,0,0,0,0,0]
["2005-01-01","sábado","Confraternização Universal",null,null,1438,47,"2029-09-07",250,127.99225689069264,127.99225689069264,3.830808248738431,null,null,null,null,null,null,47,250,118.32357074527384,118.32357074527384,118.32357074527384,118.32357074527384,118.32357074527384,118.32357074527384,{"$error":"#N/A"},{"$error":"#N/A"},{"$error":"#N/A"},{"$error":"#N/A"},{"$error":"#N/A"},{"$error":"#N/A"},null,0,0,0,0,0,0,0,0,0,0,0,0,null,250,250,250,250,250,250,250,250,250,250,250,250,null,1438,47,"2029-09-07",250,250,250,250,"2029-09-07","2029-09-07",null,280.15693363560268,250,250,250,null,null,null,250,250,250,250,250,250,250,250,250,250,250,250,250,250,250,250,250,250,250,250,250,250,250,250,250,250,250,250,250,250,250,250,250,250,250,250,250,250,250,250,250,250,250,250,250,250,250,250,250,250,0,0,0,0,0,0,0,0,0,0,0,0,0,0,0,0,0,0,0,0,0,0,0,0,0,0,0,0]
["2005-02-07","segunda-feira","Carnaval",null,null,1468,48,"2029-10-07",250,126.2169987553409,126.2169987553409,3.7776747727473534,null,null,null,null,null,null,48,250,116.49137064922374,116.49137064922374,116.49137064922374,116.49137064922374,116.49137064922374,116.49137064922374,{"$error":"#N/A"},{"$error":"#N/A"},{"$error":"#N/A"},{"$error":"#N/A"},{"$error":"#N/A"},{"$error":"#N/A"},null,0,0,0,0,0,0,0,0,0,0,0,0,null,250,250,250,250,250,250,250,250,250,250,250,250,null,1468,48,"2029-10-07",250,250,250,250,"2029-10-07","2029-10-07",null,280.15693363560268,250,250,250,null,null,null,250,250,250,250,250,250,250,250,250,250,250,250,250,250,250,250,{"$f":"IF($G83>CO$33,0,$I$9)","v":250},250,250,250,250,250,250,250,250,250,250,250,250,250,250,250,250,250,250,250,250,250,250,250,250,250,250,250,250,250,250,250,250,0,0,0,0,0,0,0,0,0,0,0,0,0,0,0,0,0,0,0,0,0,0,0,0,0,0,0,0,0]
["2005-02-08","terça-feira","Carnaval",null,null,1499,49,"2029-11-07",250,124.40842908067414,124.40842908067414,3.723544282384577,null,null,null,null,null,null,49,250,{"$f":"$T84/((U$29)^($H84-$H$35))","v":114.62789737354097},114.62789737354097,114.62789737354097,114.62789737354097,114.62789737354097,114.62789737354097,{"$error":"#N/A"},{"$error":"#N/A"},{"$error":"#N/A"},{"$error":"#N/A"},{"$error":"#N/A"},{"$error":"#N/A"},null,0,0,0,0,0,0,0,0,0,0,0,0,null,{"$f":"$T84","v":250},250,250,250,250,250,250,250,250,250,250,250,null,1499,49,"2029-11-07",250,250,250,250,"2029-11-07","2029-11-07",null,280.15693363560268,250,250,250,null,null,null,250,250,250,250,250,250,250,250,250,250,250,250,250,250,250,250,{"$f":"IF($G84>CO$33,0,$I$9)","v":250},250,250,250,250,250,250,250,250,250,250,250,250,250,250,250,250,250,250,250,250,250,250,250,250,250,250,250,250,250,250,250,0,0,0,0,0,0,0,0,0,0,0,0,0,0,0,0,0,0,{"$f":"IF($G84>EM$33,0,$I$9)","v":0},0,0,0,0,0,0,0,0,0,0,0]
["2005-03-25","sexta-feira","Paixão de Cristo",null,null,1529,50,"2029-12-07",250,122.68287879195304,122.68287879195304,3.6718985622431548,null,null,null,null,null,null,50,250,112.8529235179095,112.8529235179095,112.8529235179095,112.8529235179095,112.8529235179095,112.8529235179095,{"$error":"#N/A"},{"$error":"#N/A"},{"$error":"#N/A"},{"$error":"#N/A"},{"$error":"#N/A"},{"$error":"#N/A"},null,0,0,0,0,0,0,0,0,0,0,0,0,null,250,250,250,250,250,250,250,250,250,250,250,250,null,1529,50,"2029-12-07",250,250,250,250,"2029-12-07","2029-12-07",null,280.15693363560268,250,250,250,null,null,null,{"$f":"IF($G85>BY$33,0,$I$9)","v":250},250,250,250,250,250,250,250,250,250,250,250,250,250,250,250,250,250,250,250,250,250,250,250,250,250,250,250,250,250,250,250,250,250,250,250,250,250,250,250,250,250,250,250,250,250,250,0,0,0,0,0,0,0,0,0,0,0,0,0,0,0,0,0,0,0,0,0,0,0,0,0,0,0,0,0,0,0]
["2005-04-21","quinta-feira","Tiradentes",null,null,1560,51,"2030-01-07",250,120.92494969862987,120.92494969862987,3.6192837444799921,null,null,null,null,null,null,51,250,111.04765325723456,111.04765325723456,111.04765325723456,111.04765325723456,111.04765325723456,111.04765325723456,{"$error":"#N/A"},{"$error":"#N/A"},{"$error":"#N/A"},{"$error":"#N/A"},{"$error":"#N/A"},{"$error":"#N/A"},null,0,0,0,0,0,0,0,0,0,0,0,0,null,250,250,250,250,250,250,250,250,250,250,250,250,null,1560,51,"2030-01-07",250,250,250,250,"2030-01-07","2030-01-07",null,280.15693363560268,250,250,250,null,null,null,250,250,250,250,250,250,250,250,250,250,250,250,250,250,250,250,250,250,250,250,250,250,250,250,250,250,250,250,250,250,250,250,250,250,250,250,250,250,250,250,250,250,250,250,250,250,0,0,0,0,0,0,0,0,0,0,0,0,0,0,0,0,0,0,0,0,0,0,0,0,0,0,0,0,0,0,0,0]
["2005-05-01","domingo","Dia do Trabalho",null,null,1591,52,"2030-02-07",250,119.19221005902335,119.19221005902335,3.567422847066569,null,null,null,null,null,null,52,250,109.27126129773687,109.27126129773687,109.27126129773687,109.27126129773687,109.27126129773687,109.27126129773687,{"$error":"#N/A"},{"$error":"#N/A"},{"$error":"#N/A"},{"$error":"#N/A"},{"$error":"#N/A"},{"$error":"#N/A"},null,0,0,0,0,0,0,0,0,0,0,0,0,null,250,250,250,250,250,250,250,250,250,250,250,250,null,1591,52,"2030-02-07",250,250,250,250,"2030-02-07","2030-02-07",null,280.15693363560268,250,250,250,null,null,null,250,250,250,250,250,250,250,250,250,250,250,250,250,250,250,250,250,250,250,250,250,250,250,250,250,250,250,250,250,250,250,250,250,250,250,250,250,250,250,250,250,250,250,250,250,0,0,0,0,0,0,0,0,0,0,0,0,0,0,0,0,0,0,0,0,0,0,0,0,0,0,0,0,0,0,0,0,0]
["2005-05-26","quinta-feira","Corpus Christi",null,null,1619,53,"2030-03-07",250,117.64850544025919,117.64850544025919,3.5212197678269574,null,null,null,null,null,null,53,250,107.69121535119302,107.69121535119302,107.69121535119302,107.69121535119302,107.69121535119302,107.69121535119302,{"$error":"#N/A"},{"$error":"#N/A"},{"$error":"#N/A"},{"$error":"#N/A"},{"$error":"#N/A"},{"$error":"#N/A"},null,0,0,0,0,0,0,0,0,0,0,0,0,null,250,250,250,250,250,250,250,250,250,250,250,250,null,1619,53,"2030-03-07",250,250,250,250,"2030-03-07","2030-03-07",null,280.15693363560268,250,250,250,null,null,null,250,250,250,250,250,250,250,250,250,250,250,250,250,250,250,250,250,250,250,250,250,250,250,250,250,250,250,250,250,250,250,250,250,250,250,250,250,250,250,250,250,250,250,250,0,0,0,0,0,0,0,0,0,0,0,0,0,0,0,0,0,0,0,0,0,0,0,0,0,0,0,0,0,0,0,0,0,0]
["2005-09-07","quarta-feira","Independência do Brasil",null,null,1650,54,"2030-04-07",250,115.96271413395846,115.96271413395846,3.4707640340293771,null,null,null,null,null,null,54,250,105.9685151999772,105.9685151999772,105.9685151999772,105.9685151999772,105.9685151999772,105.9685151999772,{"$error":"#N/A"},{"$error":"#N/A"},{"$error":"#N/A"},{"$error":"#N/A"},{"$error":"#N/A"},{"$error":"#N/A"},null,0,0,0,0,0,0,0,0,0,0,0,0,null,250,250,250,250,250,250,250,250,250,250,250,250,null,1650,54,"2030-04-07",250,250,250,250,"2030-04-07","2030-04-07",null,280.15693363560268,250,250,250,null,null,null,250,250,250,250,250,250,250,250,250,250,250,250,250,250,250,250,250,250,250,250,250,250,250,250,250,250,250,250,250,250,250,250,250,250,250,250,250,250,250,250,250,250,250,0,0,0,0,0,0,0,0,0,0,0,0,0,{"$f":"IF($G89>EC$33,0,$I$9)","v":0},0,0,0,0,0,0,0,0,0,0,0,0,0,0,0,0,0,0,0,0,0]
["2005-10-12","quarta-feira","Nossa Sr.a Aparecida - Padroeira do Brasil",null,null,1680,55,"2030-05-07",250,114.35430627660196,114.35430627660196,3.422624386858697,null,null,null,null,null,null,55,250,104.32762892089711,104.32762892089711,104.32762892089711,104.32762892089711,104.32762892089711,104.32762892089711,{"$error":"#N/A"},{"$error":"#N/A"},{"$error":"#N/A"},{"$error":"#N/A"},{"$error":"#N/A"},{"$error":"#N/A"},null,0,0,0,0,0,0,0,0,0,0,0,0,null,250,250,250,250,250,250,250,250,250,250,250,250,null,1680,55,"2030-05-07",250,250,250,250,"2030-05-07","2030-05-07",null,280.15693363560268,250,250,250,null,null,null,250,250,250,250,250,250,250,250,250,250,250,250,250,250,250,250,250,250,250,250,250,250,250,250,250,250,250,250,250,250,250,250,250,250,250,250,250,250,250,250,250,250,0,0,0,0,0,0,0,0,0,0,0,0,0,0,0,0,0,0,0,0,0,0,0,0,0,0,0,0,0,0,0,0,0,0,0,0]
["2005-11-02","quarta-feira","Finados",null,null,1711,56,"2030-06-07",250,112.71571771453111,112.71571771453111,3.3735814311959165,null,null,null,null,null,null,56,250,102.65873493050141,102.65873493050141,102.65873493050141,102.65873493050141,102.65873493050141,102.65873493050141,{"$error":"#N/A"},{"$error":"#N/A"},{"$error":"#N/A"},{"$error":"#N/A"},{"$error":"#N/A"},{"$error":"#N/A"},null,0,0,0,0,0,0,0,0,0,0,0,0,null,250,250,250,250,250,250,250,250,250,250,250,250,null,1711,56,"2030-06-07",250,250,250,250,"2030-06-07","2030-06-07",null,280.15693363560268,250,250,250,null,null,null,250,250,250,250,250,250,250,250,250,250,250,250,250,250,250,250,250,250,250,250,250,250,250,250,250,250,250,250,250,250,250,250,250,250,250,250,250,250,250,250,250,0,0,0,0,0,0,0,0,0,0,0,0,0,0,0,0,0,0,0,0,0,0,0,0,0,0,0,0,0,0,0,0,0,0,0,0,0]
["2005-11-15","terça-feira","Proclamação da República",null,null,1741,57,"2030-07-07",250,111.15234583785872,111.15234583785872,3.3267897109271116,null,null,null,null,null,null,57,250,101.06909946889957,101.06909946889957,101.06909946889957,101.06909946889957,101.06909946889957,101.06909946889957,{"$error":"#N/A"},{"$error":"#N/A"},{"$error":"#N/A"},{"$error":"#N/A"},{"$error":"#N/A"},{"$error":"#N/A"},null,0,0,0,0,0,0,0,0,0,0,0,0,null,250,250,250,250,250,250,250,250,250,250,250,250,null,1741,57,"2030-07-07",250,250,250,250,"2030-07-07","2030-07-07",null,280.15693363560268,250,250,250,null,null,null,250,250,250,250,250,250,250,250,250,250,250,250,250,250,250,250,250,250,250,250,250,250,250,250,250,250,250,250,250,250,250,250,250,250,250,250,250,250,250,250,0,0,0,0,0,0,0,0,0,0,0,0,0,0,0,0,0,0,0,0,0,0,0,0,0,0,0,0,0,0,0,0,0,0,0,0,0,0]
["2005-12-25","domingo","Natal",null,null,1772,58,"2030-08-07",250,109.55963832672468,109.55963832672468,3.2791199751188693,null,null,null,null,null,null,58,250,99.452331078176911,99.452331078176911,99.452331078176911,99.452331078176911,99.452331078176911,99.452331078176911,{"$error":"#N/A"},{"$error":"#N/A"},{"$error":"#N/A"},{"$error":"#N/A"},{"$error":"#N/A"},{"$error":"#N/A"},null,0,0,0,0,0,0,0,0,0,0,0,0,null,250,250,250,250,250,250,250,250,250,250,250,250,null,1772,58,"2030-08-07",250,250,250,250,"2030-08-07","2030-08-07",null,280.15693363560268,250,250,250,null,null,null,250,250,250,250,250,250,250,250,250,250,250,250,250,250,250,250,250,250,250,250,250,250,250,250,250,250,250,250,250,250,250,250,250,250,250,250,250,250,250,0,0,0,0,0,0,0,0,0,0,0,0,0,0,0,0,0,0,0,0,0,0,0,0,0,0,0,0,0,0,0,0,0,0,0,0,0,0,0]
["2006-01-01","domingo","Confraternização Universal",null,null,1803,59,"2030-09-07",250,107.98975280100986,107.98975280100986,3.2321333013342253,null,null,null,null,null,null,59,250,97.861425587618356,97.861425587618356,97.861425587618356,97.861425587618356,97.861425587618356,{"$f":"$T94/((Z$29)^($H94-$H$35))","v":97.861425587618356},{"$error":"#N/A"},{"$error":"#N/A"},{"$error":"#N/A"},{"$error":"#N/A"},{"$error":"#N/A"},{"$error":"#N/A"},null,0,0,0,0,0,0,0,0,0,0,0,0,null,250,250,250,250,250,250,250,250,250,250,250,250,null,1803,59,"2030-09-07",250,250,250,0,"2030-09-07","2030-09-07",null,280.15693363560268,250,250,250,null,null,null,250,250,250,250,250,250,250,250,250,250,250,250,250,250,250,250,250,250,250,250,250,250,250,250,250,250,250,250,250,250,250,250,250,250,250,250,250,250,0,0,0,0,0,0,0,0,{"$f":"IF($G94>DS$33,0,$I$9)","v":0},0,0,0,0,0,0,0,0,0,0,0,0,0,0,0,0,0,0,0,0,0,0,0,0,0,0,0,0,0,0,0]
["2006-02-27","segunda-feira","Carnaval",null,null,1833,60,"2030-10-07",250,106.49193026196096,106.49193026196096,3.1873034727404912,null,null,null,null,null,null,60,250,96.346074823337958,96.346074823337958,96.346074823337958,96.346074823337958,96.346074823337958,96.346074823337958,{"$error":"#N/A"},{"$error":"#N/A"},{"$error":"#N/A"},{"$error":"#N/A"},{"$error":"#N/A"},{"$error":"#N/A"},null,0,0,0,0,0,0,0,0,0,0,0,0,null,250,250,250,250,250,250,250,250,250,250,250,250,null,1833,60,"2030-10-07",250,250,0,0,"2030-10-07","2030-10-07",null,280.15693363560268,250,250,250,null,null,null,250,250,250,250,250,250,250,250,250,250,250,250,250,250,250,250,250,250,250,250,250,250,250,250,250,250,250,250,250,250,250,250,250,250,250,250,250,0,0,0,0,0,0,0,0,0,0,0,0,0,0,0,0,0,0,0,0,0,0,0,0,0,0,0,0,0,0,0,0,0,0,0,0,0,0,0,0,0]
["2006-02-28","terça-feira","Carnaval",null,null,1864,61,"2030-11-07",0,0,0,0,null,null,null,null,null,null,61,250,94.804859069332878,94.804859069332878,94.804859069332878,94.804859069332878,94.804859069332878,94.804859069332878,{"$error":"#N/A"},{"$error":"#N/A"},{"$error":"#N/A"},{"$error":"#N/A"},{"$error":"#N/A"},{"$error":"#N/A"},null,2.8375094319451328,2.8375094319451328,2.8375094319451328,2.8375094319451328,2.8375094319451328,2.8375094319451328,{"$error":"#N/A"},{"$error":"#N/A"},{"$error":"#N/A"},{"$error":"#N/A"},{"$error":"#N/A"},{"$error":"#N/A"},null,250,250,250,250,250,250,250,250,250,250,250,250,null,1864,61,"2030-11-07",250,250,0,0,"2030-11-07","2030-11-07",null,0,0,0,0,null,null,null,250,250,250,250,250,250,250,250,250,250,250,250,250,250,250,250,250,250,250,250,250,250,250,250,250,250,250,250,250,250,250,250,250,250,250,250,0,0,0,0,0,0,0,0,0,0,0,0,0,0,0,0,0,0,0,0,0,0,0,0,0,0,0,0,0,0,0,0,0,0,0,0,0,0,0,0,0,0]
["2006-04-14","sexta-feira","Paixão de Cristo",null,null,1894,62,"2030-12-07",0,0,0,0,null,null,null,null,null,null,62,250,93.336838194043466,93.336838194043466,93.336838194043466,93.336838194043466,93.336838194043466,93.336838194043466,{"$error":"#N/A"},{"$error":"#N/A"},{"$error":"#N/A"},{"$error":"#N/A"},{"$error":"#N/A"},{"$error":"#N/A"},null,2.7935715671477208,2.7935715671477208,2.7935715671477208,2.7935715671477208,2.7935715671477208,2.7935715671477208,{"$error":"#N/A"},{"$error":"#N/A"},{"$error":"#N/A"},{"$error":"#N/A"},{"$error":"#N/A"},{"$error":"#N/A"},null,250,250,250,250,250,250,250,250,250,250,250,250,null,1894,62,"2030-12-07",0,250,0,0,"2030-12-07","2030-12-07",null,0,0,0,0,null,null,null,250,250,250,250,250,250,250,250,250,250,250,250,250,250,250,250,250,250,250,250,250,250,250,250,250,250,250,250,250,250,250,250,250,250,250,0,0,0,0,0,0,0,0,0,0,0,0,0,0,0,0,0,0,0,0,0,0,0,0,0,0,0,0,0,0,0,0,0,0,0,0,0,0,0,0,0,0,0]
["2006-04-21","sexta-feira","Tiradentes",null,null,1925,63,"2031-01-07",0,0,0,0,null,null,null,null,null,null,63,250,91.843760186273528,91.843760186273528,91.843760186273528,91.843760186273528,91.843760186273528,91.843760186273528,{"$error":"#N/A"},{"$error":"#N/A"},{"$error":"#N/A"},{"$error":"#N/A"},{"$error":"#N/A"},{"$error":"#N/A"},null,2.7488837423751669,2.7488837423751669,2.7488837423751669,2.7488837423751669,2.7488837423751669,2.7488837423751669,{"$error":"#N/A"},{"$error":"#N/A"},{"$error":"#N/A"},{"$error":"#N/A"},{"$error":"#N/A"},{"$error":"#N/A"},null,250,250,250,250,250,250,250,250,250,250,250,250,null,1925,63,"2031-01-07",0,0,0,0,"2031-01-07","2031-01-07",null,0,0,0,0,null,null,null,250,250,250,250,250,250,250,250,250,250,250,250,250,250,250,250,250,250,250,250,250,250,250,250,250,250,250,250,250,250,250,250,250,250,0,0,0,0,0,0,0,0,0,0,0,0,0,0,0,0,0,0,0,0,0,0,0,0,0,0,0,0,0,0,0,0,0,0,0,0,0,0,0,0,0,0,0,0]
["2006-05-01","segunda-feira","Dia do Trabalho",null,null,1956,64,"2031-02-07",0,0,0,0,null,null,null,null,null,null,{"$f":"S98+1","v":64},250,90.374566445213503,90.374566445213503,90.374566445213503,90.374566445213503,90.374566445213503,90.374566445213503,{"$error":"#N/A"},{"$error":"#N/A"},{"$error":"#N/A"},{"$error":"#N/A"},{"$error":"#N/A"},{"$error":"#N/A"},null,2.7049107737052402,2.7049107737052402,2.7049107737052402,2.7049107737052402,2.7049107737052402,2.7049107737052402,{"$error":"#N/A"},{"$error":"#N/A"},{"$error":"#N/A"},{"$error":"#N/A"},{"$error":"#N/A"},{"$error":"#N/A"},null,250,250,250,250,250,250,250,250,250,250,250,250,null,1956,64,"2031-02-07",0,0,0,0,"2031-02-07","2031-02-07",null,0,0,0,0,null,null,null,250,250,250,250,250,250,250,250,250,250,250,250,250,250,250,250,250,250,250,250,250,250,250,250,250,250,250,250,250,250,250,250,250,0,0,0,{"$f":"IF($G99>DI$33,0,$I$9)","v":0},0,0,0,0,0,0,0,0,0,0,0,0,0,0,0,0,0,0,0,0,0,0,0,0,0,0,0,0,0,0,0,0,0,0,0,0,0,0,0,0,0]
["2006-06-15","quinta-feira","Corpus Christi",null,null,1984,65,"2031-03-07",{"$f":"IF($G100>$I$10,0,$I$9)","v":0},{"$f":"I100/($J$32^(H100-$H$35))","v":0},{"$f":"I100/($I$32^(H100-$H$35))","v":0},{"$f":"J100*0.0082%*MIN(F100,365)","v":0},null,null,null,null,null,null,65,{"$f":"IF($G100>$P$3,0,$J$9)","v":250},{"$f":"$T100/((U$29)^($H100-$H$35))","v":89.067763854243722},89.067763854243722,89.067763854243722,89.067763854243722,89.067763854243722,89.067763854243722,{"$error":"#N/A"},{"$error":"#N/A"},{"$error":"#N/A"},{"$error":"#N/A"},{"$error":"#N/A"},{"$error":"#N/A"},null,2.6657981721575146,{"$f":"IF($I100<>0,0,V100*$B$1*MIN($F100,365))","v":2.6657981721575146},{"$f":"IF($I100<>0,0,W100*$B$1*MIN($F100,365))","v":2.6657981721575146},{"$f":"IF($I100<>0,0,X100*$B$1*MIN($F100,365))","v":2.6657981721575146},{"$f":"IF($I100<>0,0,Y100*$B$1*MIN($F100,365))","v":2.6657981721575146},{"$f":"IF($I100<>0,0,Z100*$B$1*MIN($F100,365))","v":2.6657981721575146},{"$f":"IF($I100<>0,0,AA100*$B$1*MIN($F100,365))","v":{"$error":"#N/A"}},{"$f":"IF($I100<>0,0,AB100*$B$1*MIN($F100,365))","v":{"$error":"#N/A"}},{"$f":"IF($I100<>0,0,AC100*$B$1*MIN($F100,365))","v":{"$error":"#N/A"}},{"$f":"IF($I100<>0,0,AD100*$B$1*MIN($F100,365))","v":{"$error":"#N/A"}},{"$f":"IF($I100<>0,0,AE100*$B$1*MIN($F100,365))","v":{"$error":"#N/A"}},{"$f":"IF($I100<>0,0,AF100*$B$1*MIN($F100,365))","v":{"$error":"#N/A"}},null,{"$f":"$T100","v":250},250,250,250,250,250,250,250,250,250,250,250,null,1984,65,"2031-03-07",0,0,0,0,{"$f":"H100","v":"2031-03-07"},"2031-03-07",null,0,0,0,0,null,null,null,250,250,250,250,250,250,250,250,250,250,250,250,250,250,250,{"$f":"IF($G100>CN$33,0,$I$9)","v":250},250,250,250,250,250,250,250,250,250,250,250,250,250,250,250,{"$f":"IF($G100>DD$33,0,$I$9)","v":250},0,0,0,0,0,0,0,0,0,0,0,0,0,0,0,0,0,0,0,0,0,0,0,0,0,0,0,0,0,0,0,0,0,0,0,0,0,0,0,0,0,0,0,0,0,0]
["2006-09-07","quinta-feira","Independência do Brasil",null,null,{"$f":"H101-$H$35","v":2015},66,"2031-04-07",0,0,0,0,null,null,null,null,null,null,66,250,87.642976792831305,87.642976792831305,87.642976792831305,{"$f":"$T101/((X$29)^($H101-$H$35))","v":87.642976792831305},87.642976792831305,87.642976792831305,{"$error":"#N/A"},{"$error":"#N/A"},{"$error":"#N/A"},{"$error":"#N/A"},{"$error":"#N/A"},{"$error":"#N/A"},null,{"$f":"IF($I101<>0,0,U101*$B$1*MIN($F101,365))","v":2.6231542954094409},2.6231542954094409,2.6231542954094409,2.6231542954094409,2.6231542954094409,2.6231542954094409,{"$error":"#N/A"},{"$error":"#N/A"},{"$error":"#N/A"},{"$error":"#N/A"},{"$error":"#N/A"},{"$error":"#N/A"},null,250,250,250,250,250,250,250,250,250,250,250,250,null,{"$f":"BJ101-$H$35","v":2015},66,"2031-04-07",0,0,{"$f":"I102","v":0},{"$f":"BM102","v":0},"2031-04-07",{"$f":"BJ101","v":"2031-04-07"},null,{"$f":"IF(I101=0,0,PMT($BR$31,$I$10,$BR$35))","v":0},{"$f":"MIN(BR101,$I$9)","v":0},0,{"$f":"IF(G101>$BU$31,0,$BU$32)","v":0},null,null,null,{"$f":"IF($G101>BY$33,0,$I$9)","v":250},250,250,250,250,250,250,250,250,250,250,250,250,250,250,250,250,250,250,250,250,250,250,250,250,250,250,250,250,250,250,0,0,0,0,0,0,0,0,0,0,0,0,0,0,0,0,0,0,0,0,0,0,0,0,0,0,0,0,0,0,0,0,0,0,0,0,0,0,0,0,0,0,0,0,0,0,0]
["2006-10-12","quinta-feira","Nossa Sr.a Aparecida - Padroeira do Brasil",null,null,2045,{"$f":"G101+1","v":67},{"$f":"EDATE(H101,1)","v":"2031-05-07"},0,0,0,0,null,null,null,null,null,null,67,250,86.285855219449829,86.285855219449829,86.285855219449829,86.285855219449829,86.285855219449829,86.285855219449829,{"$error":"#N/A"},{"$error":"#N/A"},{"$error":"#N/A"},{"$error":"#N/A"},{"$error":"#N/A"},{"$error":"#N/A"},null,2.5825356467181333,2.5825356467181333,2.5825356467181333,2.5825356467181333,2.5825356467181333,2.5825356467181333,{"$error":"#N/A"},{"$error":"#N/A"},{"$error":"#N/A"},{"$error":"#N/A"},{"$error":"#N/A"},{"$error":"#N/A"},null,250,250,250,250,250,250,250,250,250,250,250,250,null,2045,{"$f":"BI101+1","v":67},{"$f":"EDATE(BJ101,1)","v":"2031-05-07"},{"$f":"I101","v":0},{"$f":"BK101","v":0},0,0,"2031-05-07","2031-05-07",null,0,0,{"$f":"IF(G102>$BT$31,0,$BT$32)","v":0},0,null,null,null,250,250,250,250,250,250,250,250,250,250,250,250,250,250,250,250,250,250,250,250,250,250,250,250,250,250,250,250,250,250,0,0,0,0,0,0,0,0,0,0,0,0,0,0,0,0,0,0,0,0,0,0,0,0,0,0,0,0,0,0,0,0,0,0,0,0,0,0,0,0,0,0,0,0,0,0,0,0]
["2006-11-02","quinta-feira","Finados",null,null,2076,68,"2031-06-07",0,0,0,0,null,null,null,null,null,null,68,250,84.905569414803807,84.905569414803807,84.905569414803807,84.905569414803807,84.905569414803807,84.905569414803807,{"$error":"#N/A"},{"$error":"#N/A"},{"$error":"#N/A"},{"$error":"#N/A"},{"$error":"#N/A"},{"$error":"#N/A"},null,2.5412236925850782,2.5412236925850782,2.5412236925850782,2.5412236925850782,2.5412236925850782,2.5412236925850782,{"$error":"#N/A"},{"$error":"#N/A"},{"$error":"#N/A"},{"$error":"#N/A"},{"$error":"#N/A"},{"$error":"#N/A"},null,250,250,250,250,250,250,250,250,250,250,250,250,null,2076,68,"2031-06-07",0,0,0,0,"2031-06-07","2031-06-07",null,0,0,0,0,null,null,null,250,250,250,250,250,250,250,250,250,250,250,250,250,250,250,250,250,250,250,250,250,250,250,250,250,250,250,250,250,0,0,0,0,0,0,0,0,0,0,0,0,0,0,0,0,0,0,0,0,0,0,0,0,0,0,0,0,0,0,0,0,0,0,0,0,0,0,0,0,0,0,0,0,0,0,0,0,0]
["2006-11-15","quarta-feira","Proclamação da República",null,null,2106,69,"2031-07-07",0,0,0,0,null,null,null,null,null,null,69,250,83.590835660090761,83.590835660090761,83.590835660090761,83.590835660090761,83.590835660090761,83.590835660090761,{"$error":"#N/A"},{"$error":"#N/A"},{"$error":"#N/A"},{"$error":"#N/A"},{"$error":"#N/A"},{"$error":"#N/A"},null,2.5018737113065166,2.5018737113065166,2.5018737113065166,2.5018737113065166,2.5018737113065166,2.5018737113065166,{"$error":"#N/A"},{"$error":"#N/A"},{"$error":"#N/A"},{"$error":"#N/A"},{"$error":"#N/A"},{"$error":"#N/A"},null,250,250,250,250,250,250,250,250,250,250,250,250,null,2106,69,"2031-07-07",0,0,0,0,"2031-07-07","2031-07-07",null,0,0,0,0,null,null,null,250,250,250,250,250,250,250,250,250,250,250,250,250,250,250,250,250,250,250,250,250,250,250,250,250,250,250,250,0,0,0,0,0,0,0,0,0,0,0,0,0,0,0,0,0,0,0,0,0,0,0,0,0,0,0,0,0,0,0,0,0,0,0,0,0,0,0,0,0,0,0,0,0,0,{"$f":"IF($G104>EU$33,0,$I$9)","v":0},0,0,0]
["2006-12-25","segunda-feira","Natal",null,null,2137,70,"2031-08-07",0,0,0,0,null,null,null,null,null,null,70,250,82.253661176895562,82.253661176895562,82.253661176895562,82.253661176895562,82.253661176895562,82.253661176895562,{"$error":"#N/A"},{"$error":"#N/A"},{"$error":"#N/A"},{"$error":"#N/A"},{"$error":"#N/A"},{"$error":"#N/A"},null,2.4618520790244842,2.4618520790244842,2.4618520790244842,2.4618520790244842,2.4618520790244842,2.4618520790244842,{"$error":"#N/A"},{"$error":"#N/A"},{"$error":"#N/A"},{"$error":"#N/A"},{"$error":"#N/A"},{"$error":"#N/A"},null,250,250,250,250,250,250,250,250,250,250,250,250,null,2137,70,"2031-08-07",0,0,0,0,"2031-08-07","2031-08-07",null,0,0,0,0,null,null,null,250,250,250,250,250,250,250,250,250,250,250,250,250,250,250,250,250,250,250,250,250,250,250,250,250,250,250,0,0,0,0,0,0,0,0,0,0,0,0,0,0,0,0,0,0,0,0,0,0,0,0,0,0,0,0,0,0,0,0,0,0,0,0,0,0,0,0,0,0,0,0,0,0,0,0,0,0,0]
["2007-01-01","segunda-feira","Confraternização Universal",null,null,2168,71,"2031-09-07",0,0,0,0,null,null,null,null,null,null,71,250,80.937877024164123,80.937877024164123,80.937877024164123,80.937877024164123,80.937877024164123,80.937877024164123,{"$error":"#N/A"},{"$error":"#N/A"},{"$error":"#N/A"},{"$error":"#N/A"},{"$error":"#N/A"},{"$error":"#N/A"},null,2.4224706593332321,2.4224706593332321,2.4224706593332321,2.4224706593332321,2.4224706593332321,2.4224706593332321,{"$error":"#N/A"},{"$error":"#N/A"},{"$error":"#N/A"},{"$error":"#N/A"},{"$error":"#N/A"},{"$error":"#N/A"},null,250,250,250,250,250,250,250,250,250,250,250,250,null,2168,71,"2031-09-07",0,0,0,0,"2031-09-07","2031-09-07",null,0,0,0,0,null,null,null,250,250,250,250,250,250,250,250,250,250,250,250,250,250,250,250,250,250,250,250,250,250,250,250,250,250,0,0,0,0,0,0,0,0,0,0,0,0,0,0,0,0,0,0,0,0,0,0,0,0,0,0,0,0,0,0,0,0,0,0,0,0,0,0,0,0,0,0,0,0,0,0,0,0,0,0,0,0]
["2007-02-19","segunda-feira","Carnaval",null,null,2198,72,"2031-10-07",0,0,0,0,null,null,null,null,null,null,72,250,79.684581631507214,79.684581631507214,79.684581631507214,79.684581631507214,79.684581631507214,79.684581631507214,{"$error":"#N/A"},{"$error":"#N/A"},{"$error":"#N/A"},{"$error":"#N/A"},{"$error":"#N/A"},{"$error":"#N/A"},null,2.3849595282310108,2.3849595282310108,2.3849595282310108,2.3849595282310108,2.3849595282310108,2.3849595282310108,{"$error":"#N/A"},{"$error":"#N/A"},{"$error":"#N/A"},{"$error":"#N/A"},{"$error":"#N/A"},{"$error":"#N/A"},null,250,250,250,250,250,250,250,250,250,250,250,250,null,2198,72,"2031-10-07",0,0,0,0,"2031-10-07","2031-10-07",null,0,0,0,0,null,null,null,250,250,250,250,250,250,250,250,250,250,250,250,250,250,250,250,250,250,250,250,250,250,250,250,250,0,0,0,0,0,0,0,0,0,0,0,0,0,0,0,0,0,0,0,0,0,0,0,0,0,0,0,0,0,0,0,0,0,0,0,0,0,0,0,0,0,0,0,0,0,0,0,0,0,0,0,0,0]
["2007-02-20","terça-feira","Carnaval",null,null,2229,73,"2031-11-07",0,0,0,0,null,null,null,null,null,null,73,250,78.409894180181666,78.409894180181666,78.409894180181666,78.409894180181666,78.409894180181666,78.409894180181666,{"$error":"#N/A"},{"$error":"#N/A"},{"$error":"#N/A"},{"$error":"#N/A"},{"$error":"#N/A"},{"$f":"$T108/((AF$29)^($H108-$H$35))","v":{"$error":"#N/A"}},null,2.3468081328128374,2.3468081328128374,2.3468081328128374,2.3468081328128374,2.3468081328128374,2.3468081328128374,{"$error":"#N/A"},{"$error":"#N/A"},{"$error":"#N/A"},{"$error":"#N/A"},{"$error":"#N/A"},{"$error":"#N/A"},null,250,250,250,250,250,250,250,250,250,250,250,250,null,2229,73,"2031-11-07",0,0,0,0,"2031-11-07","2031-11-07",null,0,0,0,0,null,null,null,250,250,250,250,250,250,250,250,250,250,250,250,250,250,250,250,250,250,250,250,250,250,250,250,0,0,0,0,0,0,0,0,0,0,0,0,0,0,0,0,0,0,0,0,0,0,0,0,0,0,0,0,0,0,0,0,0,0,0,0,0,0,0,0,0,0,0,0,0,0,0,0,0,0,0,0,0,0]
["2007-04-06","sexta-feira","Paixão de Cristo",null,null,2259,74,"2031-12-07",0,0,0,0,null,null,null,null,null,null,74,250,77.195743738783307,77.195743738783307,77.195743738783307,77.195743738783307,77.195743738783307,77.195743738783307,{"$error":"#N/A"},{"$error":"#N/A"},{"$error":"#N/A"},{"$error":"#N/A"},{"$error":"#N/A"},{"$error":"#N/A"},null,2.3104686101017844,2.3104686101017844,2.3104686101017844,2.3104686101017844,2.3104686101017844,2.3104686101017844,{"$error":"#N/A"},{"$error":"#N/A"},{"$error":"#N/A"},{"$error":"#N/A"},{"$error":"#N/A"},{"$error":"#N/A"},null,250,250,250,250,250,250,250,250,250,250,250,250,null,2259,74,"2031-12-07",0,0,0,0,"2031-12-07","2031-12-07",null,0,0,0,0,null,null,null,250,250,250,250,250,250,250,250,250,250,250,250,250,250,250,250,250,250,250,250,250,250,250,0,0,0,0,0,0,0,0,0,0,0,0,0,0,0,0,0,0,0,0,0,0,0,0,0,0,0,0,0,0,0,0,0,0,0,0,0,0,0,0,0,{"$f":"IF($G109>EK$33,0,$I$9)","v":0},0,0,0,0,0,0,0,0,0,0,0,0,0]
["2007-04-21","sábado","Tiradentes",null,null,2290,75,"2032-01-07",0,0,0,0,null,null,null,null,null,null,75,250,75.960869390134363,75.960869390134363,75.960869390134363,75.960869390134363,75.960869390134363,75.960869390134363,{"$error":"#N/A"},{"$error":"#N/A"},{"$error":"#N/A"},{"$error":"#N/A"},{"$error":"#N/A"},{"$error":"#N/A"},null,2.2735088208467218,2.2735088208467218,2.2735088208467218,2.2735088208467218,2.2735088208467218,2.2735088208467218,{"$error":"#N/A"},{"$error":"#N/A"},{"$error":"#N/A"},{"$error":"#N/A"},{"$error":"#N/A"},{"$error":"#N/A"},null,250,250,250,250,250,250,250,250,250,250,250,250,null,2290,75,"2032-01-07",0,0,0,0,"2032-01-07","2032-01-07",null,0,0,0,0,null,null,null,250,250,250,250,250,250,250,250,250,250,250,250,250,250,250,250,250,250,250,250,250,250,0,0,0,0,0,0,0,0,0,0,0,0,0,0,0,0,0,0,0,0,0,0,0,0,0,0,0,0,0,0,0,0,0,0,0,0,0,0,0,0,0,0,0,0,0,0,0,0,0,0,0,0,0,0,0,0]
["2007-05-01","terça-feira","Dia do Trabalho",null,null,2321,76,"2032-02-07",0,0,0,0,null,null,null,null,null,null,76,250,74.745748911104329,74.745748911104329,74.745748911104329,74.745748911104329,74.745748911104329,74.745748911104329,{"$error":"#N/A"},{"$error":"#N/A"},{"$error":"#N/A"},{"$error":"#N/A"},{"$error":"#N/A"},{"$error":"#N/A"},null,2.2371402649093528,2.2371402649093528,2.2371402649093528,2.2371402649093528,2.2371402649093528,2.2371402649093528,{"$error":"#N/A"},{"$error":"#N/A"},{"$error":"#N/A"},{"$error":"#N/A"},{"$error":"#N/A"},{"$error":"#N/A"},null,250,250,250,250,250,250,250,250,250,250,250,250,null,2321,76,"2032-02-07",0,0,0,0,"2032-02-07","2032-02-07",null,0,0,0,0,null,null,null,250,250,250,250,250,250,250,250,250,250,250,250,250,250,250,250,250,250,250,250,250,0,0,0,0,0,0,0,0,0,0,0,0,0,0,0,0,0,0,0,0,0,0,0,0,0,0,0,0,0,0,0,0,0,0,0,0,0,0,0,0,0,0,0,0,0,0,0,0,0,0,0,0,0,0,0,0,0]
["2007-06-07","quinta-feira","Corpus Christi",null,null,2350,77,"2032-03-07",0,0,0,0,null,null,null,null,null,null,77,250,73.626626623833715,73.626626623833715,73.626626623833715,73.626626623833715,73.626626623833715,73.626626623833715,{"$error":"#N/A"},{"$error":"#N/A"},{"$error":"#N/A"},{"$error":"#N/A"},{"$error":"#N/A"},{"$error":"#N/A"},null,2.2036449348513432,2.2036449348513432,2.2036449348513432,2.2036449348513432,2.2036449348513432,2.2036449348513432,{"$error":"#N/A"},{"$error":"#N/A"},{"$error":"#N/A"},{"$error":"#N/A"},{"$error":"#N/A"},{"$error":"#N/A"},null,250,250,250,250,250,250,250,250,250,250,250,250,null,2350,77,"2032-03-07",0,0,0,0,"2032-03-07","2032-03-07",null,0,0,0,0,null,null,null,250,250,250,250,250,250,250,250,250,250,250,250,250,250,250,250,250,250,250,250,0,0,0,0,0,0,0,0,0,0,0,0,0,0,0,0,0,0,0,0,0,0,0,0,0,0,0,0,0,0,0,0,0,0,0,0,0,0,0,0,0,0,0,0,0,0,0,0,0,0,0,0,0,0,0,0,0,0]
["2007-09-07","sexta-feira","Independência do Brasil",null,null,2381,78,"2032-04-07",0,0,0,0,null,null,null,null,null,null,78,250,72.448846241239281,72.448846241239281,72.448846241239281,72.448846241239281,72.448846241239281,72.448846241239281,{"$error":"#N/A"},{"$error":"#N/A"},{"$error":"#N/A"},{"$error":"#N/A"},{"$error":"#N/A"},{"$error":"#N/A"},null,2.1683939680002919,2.1683939680002919,2.1683939680002919,2.1683939680002919,2.1683939680002919,2.1683939680002919,{"$error":"#N/A"},{"$error":"#N/A"},{"$error":"#N/A"},{"$error":"#N/A"},{"$error":"#N/A"},{"$error":"#N/A"},null,250,250,250,250,250,250,250,250,250,250,250,250,null,2381,78,"2032-04-07",0,0,0,0,"2032-04-07","2032-04-07",null,0,0,0,0,null,null,null,250,250,250,250,250,250,250,250,250,250,250,250,250,250,250,250,250,250,250,0,0,0,0,0,0,0,0,0,0,0,0,0,0,0,0,0,0,0,0,0,0,0,0,0,0,0,0,0,0,0,0,0,0,0,0,0,0,0,0,0,0,0,0,0,0,0,0,0,0,0,0,0,0,0,0,0,0,0]
["2007-10-12","sexta-feira","Nossa Sr.a Aparecida - Padroeira do Brasil",null,null,2411,79,"2032-05-07",0,0,0,0,null,null,null,null,null,null,79,250,71.32700059200954,71.32700059200954,71.32700059200954,71.32700059200954,71.32700059200954,71.32700059200954,{"$error":"#N/A"},{"$error":"#N/A"},{"$error":"#N/A"},{"$error":"#N/A"},{"$error":"#N/A"},{"$error":"#N/A"},null,2.1348171277188457,2.1348171277188457,2.1348171277188457,2.1348171277188457,2.1348171277188457,2.1348171277188457,{"$error":"#N/A"},{"$error":"#N/A"},{"$error":"#N/A"},{"$error":"#N/A"},{"$error":"#N/A"},{"$error":"#N/A"},null,250,250,250,250,250,250,250,250,250,250,250,250,null,2411,79,"2032-05-07",0,0,0,0,"2032-05-07","2032-05-07",null,0,0,0,0,null,null,null,250,250,250,250,250,250,250,250,250,250,250,250,250,250,250,250,250,250,0,0,0,0,0,0,0,0,0,0,0,0,0,0,0,0,0,0,0,0,0,0,0,0,0,0,0,0,0,0,0,0,0,0,0,0,{"$f":"IF($G114>EA$33,0,$I$9)","v":0},0,0,0,0,0,0,0,0,0,0,0,0,0,0,0,0,0,0,0,0,0,0,0]
["2007-11-02","sexta-feira","Finados",null,null,2442,80,"2032-06-07",0,0,0,0,null,null,null,null,null,null,80,250,70.186006553592236,70.186006553592236,70.186006553592236,70.186006553592236,70.186006553592236,70.186006553592236,{"$error":"#N/A"},{"$error":"#N/A"},{"$error":"#N/A"},{"$error":"#N/A"},{"$error":"#N/A"},{"$error":"#N/A"},null,2.1006671761490159,2.1006671761490159,2.1006671761490159,2.1006671761490159,2.1006671761490159,2.1006671761490159,{"$error":"#N/A"},{"$error":"#N/A"},{"$error":"#N/A"},{"$error":"#N/A"},{"$error":"#N/A"},{"$error":"#N/A"},null,250,250,250,250,250,250,250,250,250,250,250,250,null,2442,80,"2032-06-07",0,0,0,0,"2032-06-07","2032-06-07",null,0,0,0,0,null,null,null,250,250,250,250,250,250,250,250,250,250,250,250,250,250,250,250,250,0,0,0,0,0,0,0,0,0,0,0,0,0,0,0,0,0,0,0,0,0,0,0,0,0,0,0,0,0,0,0,0,0,0,0,0,0,0,0,0,0,0,0,0,0,0,0,0,0,0,0,0,0,0,0,0,0,0,0,0,0]
["2007-11-15","quinta-feira","Proclamação da República",null,null,2472,81,"2032-07-07",0,0,0,0,null,null,null,null,null,null,81,250,{"$f":"$T116/((U$29)^($H116-$H$35))","v":69.099200204367847},69.099200204367847,69.099200204367847,69.099200204367847,69.099200204367847,69.099200204367847,{"$error":"#N/A"},{"$error":"#N/A"},{"$error":"#N/A"},{"$error":"#N/A"},{"$error":"#N/A"},{"$error":"#N/A"},null,2.0681390621167295,2.0681390621167295,2.0681390621167295,2.0681390621167295,2.0681390621167295,2.0681390621167295,{"$error":"#N/A"},{"$error":"#N/A"},{"$error":"#N/A"},{"$error":"#N/A"},{"$error":"#N/A"},{"$error":"#N/A"},null,{"$f":"$T116","v":250},250,250,250,250,250,250,250,250,250,250,250,null,2472,81,"2032-07-07",0,0,0,0,"2032-07-07","2032-07-07",null,0,0,0,0,null,null,null,250,250,250,250,250,250,250,250,250,250,250,250,250,250,250,250,{"$f":"IF($G116>CO$33,0,$I$9)","v":0},0,0,0,0,0,0,0,0,0,0,0,0,0,0,0,0,0,0,0,0,0,0,0,0,0,0,0,0,0,0,0,0,0,0,0,0,0,0,0,0,0,0,0,0,0,0,0,0,0,0,0,0,0,0,0,0,0,0,0,0,0]
["2007-12-25","terça-feira","Natal",null,null,2503,82,"2032-08-07",0,0,0,0,null,null,null,null,null,null,82,250,67.993843539455483,67.993843539455483,67.993843539455483,67.993843539455483,67.993843539455483,67.993843539455483,{"$error":"#N/A"},{"$error":"#N/A"},{"$error":"#N/A"},{"$error":"#N/A"},{"$error":"#N/A"},{"$error":"#N/A"},null,2.0350557371359028,2.0350557371359028,2.0350557371359028,2.0350557371359028,2.0350557371359028,2.0350557371359028,{"$error":"#N/A"},{"$error":"#N/A"},{"$error":"#N/A"},{"$error":"#N/A"},{"$error":"#N/A"},{"$error":"#N/A"},null,250,250,250,250,250,250,250,250,250,250,250,250,null,2503,82,"2032-08-07",0,0,0,0,"2032-08-07","2032-08-07",null,0,0,0,0,null,null,null,{"$f":"IF($G117>BY$33,0,$I$9)","v":250},250,250,250,250,250,250,250,250,250,250,250,250,250,250,0,0,0,0,0,0,0,0,0,0,0,0,0,0,0,0,0,0,0,0,0,0,0,0,0,0,0,0,0,0,0,0,0,0,0,0,0,0,0,0,0,0,0,0,0,0,0,0,0,0,0,0,0,0,0,0,0,0,0,0,0,0,0]
["2008-01-01","terça-feira","Confraternização Universal",null,null,2534,83,"2032-09-07",0,0,0,0,null,null,null,null,null,null,83,250,66.906168893337153,66.906168893337153,66.906168893337153,66.906168893337153,66.906168893337153,66.906168893337153,{"$error":"#N/A"},{"$error":"#N/A"},{"$error":"#N/A"},{"$error":"#N/A"},{"$error":"#N/A"},{"$error":"#N/A"},null,2.0025016349775813,2.0025016349775813,2.0025016349775813,2.0025016349775813,2.0025016349775813,2.0025016349775813,{"$error":"#N/A"},{"$error":"#N/A"},{"$error":"#N/A"},{"$error":"#N/A"},{"$error":"#N/A"},{"$error":"#N/A"},null,250,250,250,250,250,250,250,250,250,250,250,250,null,2534,83,"2032-09-07",0,0,0,0,"2032-09-07","2032-09-07",null,0,0,0,0,null,null,null,250,250,250,250,250,250,250,250,250,250,250,250,250,250,0,0,0,0,0,0,0,0,0,0,0,0,0,0,0,0,0,0,0,0,0,0,0,0,0,0,0,0,0,0,0,0,0,0,0,0,0,0,0,0,0,0,0,0,0,0,0,0,0,0,0,0,0,0,0,0,0,0,0,0,0,0,0,0]
["2008-02-04","segunda-feira","Carnaval",null,null,2564,84,"2032-10-07",0,0,0,0,null,null,null,null,null,null,84,250,65.870149710509949,65.870149710509949,65.870149710509949,65.870149710509949,65.870149710509949,65.870149710509949,{"$error":"#N/A"},{"$error":"#N/A"},{"$error":"#N/A"},{"$error":"#N/A"},{"$error":"#N/A"},{"$error":"#N/A"},null,1.9714935808355629,1.9714935808355629,1.9714935808355629,1.9714935808355629,1.9714935808355629,1.9714935808355629,{"$error":"#N/A"},{"$error":"#N/A"},{"$error":"#N/A"},{"$error":"#N/A"},{"$error":"#N/A"},{"$error":"#N/A"},null,250,250,250,250,250,250,250,250,250,250,250,250,null,2564,84,"2032-10-07",0,0,0,0,"2032-10-07","2032-10-07",null,0,0,0,0,null,null,null,250,250,250,250,250,250,250,250,250,250,250,250,250,0,0,0,0,0,0,0,0,0,0,0,0,0,0,0,0,0,0,0,0,0,0,0,0,0,0,0,0,0,0,0,0,0,0,0,0,0,0,{"$f":"IF($G119>DX$33,0,$I$9)","v":0},0,0,0,0,0,0,0,0,0,0,0,0,0,0,0,0,0,0,0,0,0,0,0,0,0,0]
["2008-02-05","terça-feira","Carnaval",null,null,2595,85,"2032-11-07",0,0,0,0,null,null,null,null,null,null,85,250,64.816447080292164,64.816447080292164,64.816447080292164,64.816447080292164,64.816447080292164,64.816447080292164,{"$error":"#N/A"},{"$error":"#N/A"},{"$error":"#N/A"},{"$error":"#N/A"},{"$error":"#N/A"},{"$error":"#N/A"},null,1.9399562611131445,1.9399562611131445,1.9399562611131445,1.9399562611131445,1.9399562611131445,1.9399562611131445,{"$error":"#N/A"},{"$error":"#N/A"},{"$error":"#N/A"},{"$error":"#N/A"},{"$error":"#N/A"},{"$error":"#N/A"},null,250,250,250,250,250,250,250,250,250,250,250,250,null,2595,85,"2032-11-07",0,0,0,0,"2032-11-07","2032-11-07",null,0,0,0,0,null,null,null,250,250,250,250,250,250,250,250,250,250,250,250,0,0,0,0,0,0,0,0,0,0,0,0,0,0,0,0,0,0,0,0,0,0,0,0,0,0,0,0,0,0,0,0,0,0,0,0,0,0,0,0,0,0,0,0,0,0,0,0,0,0,0,0,0,0,0,0,0,0,0,0,0,0,0,0,0,0]
["2008-03-21","sexta-feira","Paixão de Cristo",null,null,2625,86,"2032-12-07",0,0,0,0,null,null,null,null,null,null,86,250,63.812786526286445,63.812786526286445,63.812786526286445,63.812786526286445,63.812786526286445,63.812786526286445,{"$error":"#N/A"},{"$error":"#N/A"},{"$error":"#N/A"},{"$error":"#N/A"},{"$error":"#N/A"},{"$error":"#N/A"},null,1.9099167007317532,1.9099167007317532,1.9099167007317532,1.9099167007317532,1.9099167007317532,1.9099167007317532,{"$error":"#N/A"},{"$error":"#N/A"},{"$error":"#N/A"},{"$error":"#N/A"},{"$error":"#N/A"},{"$error":"#N/A"},null,250,250,250,250,250,250,250,250,250,250,250,250,null,2625,86,"2032-12-07",0,0,0,0,"2032-12-07","2032-12-07",null,0,0,0,0,null,null,null,250,250,250,250,250,250,250,250,250,250,250,0,0,0,0,0,0,0,0,0,0,0,0,0,0,0,0,0,0,0,0,0,0,0,0,0,0,0,0,0,0,0,0,0,0,0,0,0,0,0,0,0,0,0,0,0,0,0,0,0,0,0,0,0,0,0,0,0,0,0,0,0,0,0,0,0,0,0]
["2008-04-21","segunda-feira","Tiradentes",null,null,2656,87,"2033-01-07",0,0,0,0,null,null,null,null,null,null,87,250,62.791994842955184,62.791994842955184,62.791994842955184,62.791994842955184,62.791994842955184,62.791994842955184,{"$error":"#N/A"},{"$error":"#N/A"},{"$error":"#N/A"},{"$error":"#N/A"},{"$error":"#N/A"},{"$error":"#N/A"},null,1.8793644056496488,1.8793644056496488,1.8793644056496488,1.8793644056496488,1.8793644056496488,1.8793644056496488,{"$error":"#N/A"},{"$error":"#N/A"},{"$error":"#N/A"},{"$error":"#N/A"},{"$error":"#N/A"},{"$error":"#N/A"},null,250,250,250,250,250,250,250,250,250,250,250,250,null,2656,87,"2033-01-07",0,0,0,0,"2033-01-07","2033-01-07",null,0,0,0,0,null,null,null,250,250,250,250,250,250,250,250,250,250,0,0,0,0,0,0,0,0,0,0,0,0,0,0,0,0,0,0,0,0,0,0,0,0,0,0,0,0,0,0,0,0,0,0,0,0,0,0,0,0,0,0,0,0,0,0,0,0,0,0,0,0,0,0,0,0,0,0,0,0,0,0,0,0,0,0,0,0]
["2008-05-01","quinta-feira","Dia do Trabalho",null,null,2687,88,"2033-02-07",0,0,0,0,null,null,null,null,null,null,88,250,61.787532420850091,61.787532420850091,61.787532420850091,61.787532420850091,61.787532420850091,61.787532420850091,{"$error":"#N/A"},{"$error":"#N/A"},{"$error":"#N/A"},{"$error":"#N/A"},{"$error":"#N/A"},{"$error":"#N/A"},null,1.8493008453560433,1.8493008453560433,1.8493008453560433,1.8493008453560433,1.8493008453560433,1.8493008453560433,{"$error":"#N/A"},{"$error":"#N/A"},{"$error":"#N/A"},{"$error":"#N/A"},{"$error":"#N/A"},{"$error":"#N/A"},null,250,250,250,250,250,250,250,250,250,250,250,250,null,2687,88,"2033-02-07",0,0,0,0,"2033-02-07","2033-02-07",null,0,0,0,0,null,null,null,250,250,250,250,250,250,250,250,250,0,0,0,0,0,0,0,0,0,0,0,0,0,0,0,0,0,0,0,0,0,0,0,0,0,0,0,0,0,0,0,0,0,0,0,0,0,0,0,0,0,0,0,0,0,0,0,0,0,0,0,0,0,0,0,0,0,0,0,0,0,0,0,0,0,0,0,0,0]
["2008-05-22","quinta-feira","Corpus Christi",null,null,2715,89,"2033-03-07",0,0,0,0,null,null,null,null,null,null,89,250,60.894094027359785,60.894094027359785,60.894094027359785,60.894094027359785,60.894094027359785,60.894094027359785,{"$error":"#N/A"},{"$error":"#N/A"},{"$error":"#N/A"},{"$error":"#N/A"},{"$error":"#N/A"},{"$error":"#N/A"},null,1.8225602342388785,1.8225602342388785,1.8225602342388785,1.8225602342388785,1.8225602342388785,1.8225602342388785,{"$error":"#N/A"},{"$error":"#N/A"},{"$error":"#N/A"},{"$error":"#N/A"},{"$error":"#N/A"},{"$error":"#N/A"},null,250,250,250,250,250,250,250,250,250,250,250,250,null,2715,89,"2033-03-07",0,0,0,0,"2033-03-07","2033-03-07",null,0,0,0,0,null,null,null,250,250,250,250,250,250,250,250,0,0,0,0,0,0,0,0,0,0,0,0,0,0,0,0,0,0,0,0,0,0,0,0,0,0,0,0,0,0,0,0,0,{"$f":"IF($G124>DN$33,0,$I$9)","v":0},0,0,0,0,0,0,0,0,0,0,0,0,0,0,0,0,0,0,0,0,0,0,0,0,0,0,0,0,0,0,0,0,0,0,0,0]
["2008-09-07","domingo","Independência do Brasil",null,null,2746,90,"2033-04-07",0,0,0,0,null,null,null,null,null,null,90,250,59.919991686263685,59.919991686263685,59.919991686263685,59.919991686263685,59.919991686263685,59.919991686263685,{"$error":"#N/A"},{"$error":"#N/A"},{"$error":"#N/A"},{"$error":"#N/A"},{"$error":"#N/A"},{"$error":"#N/A"},null,1.7934053511698722,1.7934053511698722,1.7934053511698722,1.7934053511698722,1.7934053511698722,1.7934053511698722,{"$error":"#N/A"},{"$error":"#N/A"},{"$error":"#N/A"},{"$error":"#N/A"},{"$error":"#N/A"},{"$error":"#N/A"},null,250,250,250,250,250,250,250,250,250,250,250,250,null,2746,90,"2033-04-07",0,0,0,0,"2033-04-07","2033-04-07",null,0,0,0,0,null,null,null,250,250,250,250,250,250,250,0,0,0,0,0,0,0,0,0,0,0,0,0,0,0,0,0,0,0,0,0,0,0,0,0,0,0,0,0,0,0,0,0,0,0,0,0,0,0,0,0,0,0,0,0,0,0,0,0,0,0,0,0,0,0,0,0,0,0,0,0,0,0,0,0,0,0,0,0,0,0]
["2008-10-12","domingo","Nossa Sr.a Aparecida - Padroeira do Brasil",null,null,2776,91,"2033-05-07",0,0,0,0,null,null,null,null,null,null,91,250,58.992151072331914,58.992151072331914,58.992151072331914,58.992151072331914,58.992151072331914,58.992151072331914,{"$error":"#N/A"},{"$error":"#N/A"},{"$error":"#N/A"},{"$error":"#N/A"},{"$error":"#N/A"},{"$error":"#N/A"},null,1.765635081594894,1.765635081594894,1.765635081594894,1.765635081594894,1.765635081594894,1.765635081594894,{"$error":"#N/A"},{"$error":"#N/A"},{"$error":"#N/A"},{"$error":"#N/A"},{"$error":"#N/A"},{"$error":"#N/A"},null,250,250,250,250,250,250,250,250,250,250,250,250,null,2776,91,"2033-05-07",0,0,0,0,"2033-05-07","2033-05-07",null,0,0,0,0,null,null,null,250,250,250,250,250,250,0,0,0,0,0,0,0,0,0,0,0,0,0,0,0,0,0,0,0,0,0,0,0,0,0,0,0,0,0,0,0,0,0,0,0,0,0,0,0,0,0,0,0,0,0,0,0,0,0,0,0,0,0,0,0,0,0,0,0,0,0,0,0,0,0,0,0,0,0,0,0,0]
["2008-11-02","domingo","Finados",null,null,2807,92,"2033-06-07",0,0,0,0,null,null,null,null,null,null,92,250,58.048473472989798,58.048473472989798,58.048473472989798,58.048473472989798,58.048473472989798,58.048473472989798,{"$error":"#N/A"},{"$error":"#N/A"},{"$error":"#N/A"},{"$error":"#N/A"},{"$error":"#N/A"},{"$error":"#N/A"},null,1.7373908110465845,1.7373908110465845,1.7373908110465845,1.7373908110465845,1.7373908110465845,1.7373908110465845,{"$error":"#N/A"},{"$error":"#N/A"},{"$error":"#N/A"},{"$error":"#N/A"},{"$error":"#N/A"},{"$error":"#N/A"},null,250,250,250,250,250,250,250,250,250,250,250,250,null,2807,92,"2033-06-07",0,0,0,0,"2033-06-07","2033-06-07",null,0,0,0,0,null,null,null,250,250,250,250,250,0,0,0,0,0,0,0,0,0,0,0,0,0,0,0,0,0,0,0,0,0,0,0,0,0,0,0,0,0,0,0,0,0,0,0,0,0,0,0,0,0,0,0,0,0,0,0,0,0,0,0,0,0,0,0,0,0,0,0,0,0,0,0,0,0,0,0,0,0,0,0,0,0]
["2008-11-15","sábado","Proclamação da República",null,null,2837,93,"2033-07-07",0,0,0,0,null,null,null,null,null,null,93,250,57.14961267963411,57.14961267963411,57.14961267963411,57.14961267963411,57.14961267963411,57.14961267963411,{"$error":"#N/A"},{"$error":"#N/A"},{"$error":"#N/A"},{"$error":"#N/A"},{"$error":"#N/A"},{"$error":"#N/A"},null,1.7104879075014492,1.7104879075014492,1.7104879075014492,1.7104879075014492,1.7104879075014492,1.7104879075014492,{"$error":"#N/A"},{"$error":"#N/A"},{"$error":"#N/A"},{"$error":"#N/A"},{"$error":"#N/A"},{"$error":"#N/A"},null,250,250,250,250,250,250,250,250,250,250,250,250,null,2837,93,"2033-07-07",0,0,0,0,"2033-07-07","2033-07-07",null,0,0,0,0,null,null,null,250,250,250,250,0,0,0,0,0,0,0,0,0,0,0,0,0,0,0,0,0,0,0,0,0,0,0,0,0,0,0,0,0,0,0,0,0,0,0,0,0,0,0,0,0,0,0,0,0,0,0,0,0,0,0,0,0,0,0,0,0,0,0,0,0,0,0,0,0,0,0,0,0,0,0,0,0,0]
["2008-12-25","quinta-feira","Natal",null,null,2868,94,"2033-08-07",0,0,0,0,null,null,null,null,null,null,94,250,56.235409547242405,56.235409547242405,56.235409547242405,56.235409547242405,56.235409547242405,56.235409547242405,{"$error":"#N/A"},{"$error":"#N/A"},{"$error":"#N/A"},{"$error":"#N/A"},{"$error":"#N/A"},{"$error":"#N/A"},null,1.6831258077489653,1.6831258077489653,1.6831258077489653,1.6831258077489653,1.6831258077489653,1.6831258077489653,{"$error":"#N/A"},{"$error":"#N/A"},{"$error":"#N/A"},{"$error":"#N/A"},{"$error":"#N/A"},{"$error":"#N/A"},null,250,250,250,250,250,250,250,250,250,250,250,250,null,2868,94,"2033-08-07",0,0,0,0,"2033-08-07","2033-08-07",null,0,0,0,0,null,null,null,250,250,250,0,0,0,0,0,0,0,0,0,0,0,0,0,0,0,0,0,0,0,0,0,0,0,0,0,0,0,0,{"$f":"IF($G129>DD$33,0,$I$9)","v":0},0,0,0,0,0,0,0,0,0,0,0,0,0,0,0,0,0,0,0,0,0,0,0,0,0,0,0,0,0,0,0,0,0,0,0,0,0,0,0,0,0,0,0,0,0,0]
["2009-01-01","quinta-feira","Confraternização Universal",null,null,2899,95,"2033-09-07",0,0,0,0,null,null,null,null,null,null,95,250,55.335830614877409,55.335830614877409,55.335830614877409,55.335830614877409,55.335830614877409,55.335830614877409,{"$error":"#N/A"},{"$error":"#N/A"},{"$error":"#N/A"},{"$error":"#N/A"},{"$error":"#N/A"},{"$error":"#N/A"},null,1.6562014103032807,1.6562014103032807,1.6562014103032807,1.6562014103032807,1.6562014103032807,1.6562014103032807,{"$error":"#N/A"},{"$error":"#N/A"},{"$error":"#N/A"},{"$error":"#N/A"},{"$error":"#N/A"},{"$error":"#N/A"},null,250,250,250,250,250,250,250,250,250,250,250,250,null,2899,95,"2033-09-07",0,0,0,0,"2033-09-07","2033-09-07",null,0,0,0,0,null,null,null,250,250,0,0,0,0,0,0,0,0,0,0,0,0,0,0,0,0,0,0,0,0,0,0,0,0,0,0,0,0,0,0,0,0,0,0,0,0,0,0,0,0,0,0,0,0,0,0,0,0,0,0,0,0,0,0,0,0,0,0,0,0,0,0,0,0,0,0,0,0,0,0,0,0,0,0,0,0]
["2009-02-23","segunda-feira","Carnaval",null,null,2929,96,"2033-10-07",0,0,0,0,null,null,null,null,null,null,{"$f":"S130+1","v":96},250,54.478974170054137,54.478974170054137,54.478974170054137,54.478974170054137,54.478974170054137,54.478974170054137,{"$error":"#N/A"},{"$error":"#N/A"},{"$error":"#N/A"},{"$error":"#N/A"},{"$error":"#N/A"},{"$error":"#N/A"},null,1.6305556969097204,1.6305556969097204,1.6305556969097204,1.6305556969097204,1.6305556969097204,1.6305556969097204,{"$error":"#N/A"},{"$error":"#N/A"},{"$error":"#N/A"},{"$error":"#N/A"},{"$error":"#N/A"},{"$error":"#N/A"},null,250,250,250,250,250,250,250,250,250,250,250,250,null,2929,96,"2033-10-07",0,0,0,0,"2033-10-07","2033-10-07",null,0,0,0,0,null,null,null,250,0,0,0,0,0,0,0,0,0,0,0,0,0,0,0,0,0,0,0,0,0,0,0,0,0,0,0,0,0,0,0,0,0,0,0,0,0,0,0,0,0,0,0,0,0,0,0,0,0,0,0,0,0,0,0,0,0,0,0,0,0,0,0,0,0,0,0,0,0,0,0,0,0,0,0,0,0]
["2009-02-24","terça-feira","Carnaval"]
["2009-04-10","sexta-feira","Paixão de Cristo"]
["2009-04-21","terça-feira","Tiradentes"]
["2009-05-01","sexta-feira","Dia do Trabalho"]
["2009-06-11","quinta-feira","Corpus Christi"]
["2009-09-07","segunda-feira","Independência do Brasil"]
["2009-10-12","segunda-feira","Nossa Sr.a Aparecida - Padroeira do Brasil"]
["2009-11-02","segunda-feira","Finados"]
["2009-11-15","domingo","Proclamação da República"]
["2009-12-25","sexta-feira","Natal"]
["2010-01-01","sexta-feira","Confraternização Universal"]
["2010-02-15","segunda-feira","Carnaval"]
["2010-02-16","terça-feira","Carnaval"]
["2010-04-02","sexta-feira","Paixão de Cristo"]
["2010-04-21","quarta-feira","Tiradentes"]
["2010-05-01","sábado","Dia do Trabalho"]
["2010-06-03","quinta-feira","Corpus Christi"]
["2010-09-07","terça-feira","Independência do Brasil"]
["2010-10-12","terça-feira","Nossa Sr.a Aparecida - Padroeira do Brasil"]
["2010-11-02","terça-feira","Finados"]
["2010-11-15","segunda-feira","Proclamação da República"]
["2010-12-25","sábado","Natal"]
["2011-01-01","sábado","Confraternização Universal"]
["2011-03-07","segunda-feira","Carnaval"]
["2011-03-08","terça-feira","Carnaval"]
["2011-04-21","quinta-feira","Tiradentes"]
["2011-04-22","sexta-feira","Paixão de Cristo"]
["2011-05-01","domingo","Dia do Trabalho"]
["2011-06-23","quinta-feira","Corpus Christi"]
["2011-09-07","quarta-feira","Independência do Brasil"]
["2011-10-12","quarta-feira","Nossa Sr.a Aparecida - Padroeira do Brasil"]
["2011-11-02","quarta-feira","Finados"]
["2011-11-15","terça-feira","Proclamação da República"]
["2011-12-25","domingo","Natal"]
["2012-01-01","domingo","Confraternização Universal"]
["2012-02-20","segunda-feira","Carnaval"]
["2012-02-21","terça-feira","Carnaval"]
["2012-04-06","sexta-feira","Paixão de Cristo"]
["2012-04-21","sábado","Tiradentes"]
["2012-05-01","terça-feira","Dia do Trabalho"]
["2012-06-07","quinta-feira","Corpus Christi"]
["2012-09-07","sexta-feira","Independência do Brasil"]
["2012-10-12","sexta-feira","Nossa Sr.a Aparecida - Padroeira do Brasil"]
["2012-11-02","sexta-feira","Finados"]
["2012-11-15","quinta-feira","Proclamação da República"]
["2012-12-25","terça-feira","Natal"]
["2013-01-01","terça-feira","Confraternização Universal"]
["2013-02-11","segunda-feira","Carnaval"]
["2013-02-12","terça-feira","Carnaval"]
["2013-03-29","sexta-feira","Paixão de Cristo"]
["2013-04-21","domingo","Tiradentes"]
["2013-05-01","quarta-feira","Dia do Trabalho"]
["2013-05-30","quinta-feira","Corpus Christi"]
["2013-09-07","sábado","Independência do Brasil"]
["2013-10-12","sábado","Nossa Sr.a Aparecida - Padroeira do Brasil"]
["2013-11-02","sábado","Finados"]
["2013-11-15","sexta-feira","Proclamação da República"]
["2013-12-25","quarta-feira","Natal"]
["2014-01-01","quarta-feira","Confraternização Universal"]
["2014-03-03","segunda-feira","Carnaval"]
["2014-03-04","terça-feira","Carnaval"]
["2014-04-18","sexta-feira","Paixão de Cristo"]
["2014-04-21","segunda-feira","Tiradentes"]
["2014-05-01","quinta-feira","Dia do Trabalho"]
["2014-06-19","quinta-feira","Corpus Christi"]
["2014-09-07","domingo","Independência do Brasil"]
["2014-10-12","domingo","Nossa Sr.a Aparecida - Padroeira do Brasil"]
["2014-11-02","domingo","Finados"]
["2014-11-15","sábado","Proclamação da República"]
["2014-12-25","quinta-feira","Natal"]
["2015-01-01","quinta-feira","Confraternização Universal"]
["2015-02-16","segunda-feira","Carnaval"]
["2015-02-17","terça-feira","Carnaval"]
["2015-04-03","sexta-feira","Paixão de Cristo"]
["2015-04-21","terça-feira","Tiradentes"]
["2015-05-01","sexta-feira","Dia do Trabalho"]
["2015-06-04","quinta-feira","Corpus Christi"]
["2015-09-07","segunda-feira","Independência do Brasil"]
["2015-10-12","segunda-feira","Nossa Sr.a Aparecida - Padroeira do Brasil"]
["2015-11-02","segunda-feira","Finados"]
["2015-11-15","domingo","Proclamação da República"]
["2015-12-25","sexta-feira","Natal"]
["2016-01-01","sexta-feira","Confraternização Universal"]
["2016-02-08","segunda-feira","Carnaval"]
["2016-02-09","terça-feira","Carnaval"]
["2016-03-25","sexta-feira","Paixão de Cristo"]
["2016-04-21","quinta-feira","Tiradentes"]
["2016-05-01","domingo","Dia do Trabalho"]
["2016-05-26","quinta-feira","Corpus Christi"]
["2016-09-07","quarta-feira","Independência do Brasil"]
["2016-10-12","quarta-feira","Nossa Sr.a Aparecida - Padroeira do Brasil"]
["2016-11-02","quarta-feira","Finados"]
["2016-11-15","terça-feira","Proclamação da República"]
["2016-12-25","domingo","Natal"]
["2017-01-01","domingo","Confraternização Universal"]
["2017-02-27","segunda-feira","Carnaval"]
["2017-02-28","terça-feira","Carnaval"]
["2017-04-14","sexta-feira","Paixão de Cristo"]
["2017-04-21","sexta-feira","Tiradentes"]
["2017-05-01","segunda-feira","Dia do Trabalho"]
["2017-06-15","quinta-feira","Corpus Christi"]
["2017-09-07","quinta-feira","Independência do Brasil"]
["2017-10-12","quinta-feira","Nossa Sr.a Aparecida - Padroeira do Brasil"]
["2017-11-02","quinta-feira","Finados"]
["2017-11-15","quarta-feira","Proclamação da República"]
["2017-12-25","segunda-feira","Natal"]
["2018-01-01","segunda-feira","Confraternização Universal"]
["2018-02-12","segunda-feira","Carnaval"]
["2018-02-13","terça-feira","Carnaval"]
["2018-03-30","sexta-feira","Paixão de Cristo"]
["2018-04-21","sábado","Tiradentes"]
["2018-05-01","terça-feira","Dia do Trabalho"]
["2018-05-31","quinta-feira","Corpus Christi"]
["2018-09-07","sexta-feira","Independência do Brasil"]
["2018-10-12","sexta-feira","Nossa Sr.a Aparecida - Padroeira do Brasil"]
["2018-11-02","sexta-feira","Finados"]
["2018-11-15","quinta-feira","Proclamação da República"]
["2018-12-25","terça-feira","Natal"]
["2019-01-01","terça-feira","Confraternização Universal"]
["2019-03-04","segunda-feira","Carnaval"]
["2019-03-05","terça-feira","Carnaval"]
["2019-04-19","sexta-feira","Paixão de Cristo"]
["2019-04-21","domingo","Tiradentes"]
["2019-05-01","quarta-feira","Dia do Trabalho"]
["2019-06-20","quinta-feira","Corpus Christi"]
["2019-09-07","sábado","Independência do Brasil"]
["2019-10-12","sábado","Nossa Sr.a Aparecida - Padroeira do Brasil"]
["2019-11-02","sábado","Finados"]
["2019-11-15","sexta-feira","Proclamação da República"]
["2019-12-25","quarta-feira","Natal"]
["2020-01-01","quarta-feira","Confraternização Universal"]
["2020-02-24","segunda-feira","Carnaval"]
["2020-02-25","terça-feira","Carnaval"]
["2020-04-10","sexta-feira","Paixão de Cristo"]
["2020-04-21","terça-feira","Tiradentes"]
["2020-05-01","sexta-feira","Dia do Trabalho"]
["2020-06-11","quinta-feira","Corpus Christi"]
["2020-09-07","segunda-feira","Independência do Brasil"]
["2020-10-12","segunda-feira","Nossa Sr.a Aparecida - Padroeira do Brasil"]
["2020-11-02","segunda-feira","Finados"]
["2020-11-15","domingo","Proclamação da República"]
["2020-12-25","sexta-feira","Natal"]
["2021-01-01","sexta-feira","Confraternização Universal"]
["2021-02-15","segunda-feira","Carnaval"]
["2021-02-16","terça-feira","Carnaval"]
["2021-04-02","sexta-feira","Paixão de Cristo"]
["2021-04-21","quarta-feira","Tiradentes"]
["2021-05-01","sábado","Dia do Trabalho"]
["2021-06-03","quinta-feira","Corpus Christi"]
["2021-09-07","terça-feira","Independência do Brasil"]
["2021-10-12","terça-feira","Nossa Sr.a Aparecida - Padroeira do Brasil"]
["2021-11-02","terça-feira","Finados"]
["2021-11-15","segunda-feira","Proclamação da República"]
["2021-12-25","sábado","Natal"]
["2022-01-01","sábado","Confraternização Universal"]
["2022-02-28","segunda-feira","Carnaval"]
["2022-03-01","terça-feira","Carnaval"]
["2022-04-15","sexta-feira","Paixão de Cristo"]
["2022-04-21","quinta-feira","Tiradentes"]
["2022-05-01","domingo","Dia do Trabalho"]
["2022-06-16","quinta-feira","Corpus Christi"]
["2022-09-07","quarta-feira","Independência do Brasil"]
["2022-10-12","quarta-feira","Nossa Sr.a Aparecida - Padroeira do Brasil"]
["2022-11-02","quarta-feira","Finados"]
["2022-11-15","terça-feira","Proclamação da República"]
["2022-12-25","domingo","Natal"]
["2023-01-01","domingo","Confraternização Universal"]
["2023-02-20","segunda-feira","Carnaval"]
["2023-02-21","terça-feira","Carnaval"]
["2023-04-07","sexta-feira","Paixão de Cristo"]
["2023-04-21","sexta-feira","Tiradentes"]
["2023-05-01","segunda-feira","Dia do Trabalho"]
["2023-06-08","quinta-feira","Corpus Christi"]
["2023-09-07","quinta-feira","Independência do Brasil"]
["2023-10-12","quinta-feira","Nossa Sr.a Aparecida - Padroeira do Brasil"]
["2023-11-02","quinta-feira","Finados"]
["2023-11-15","quarta-feira","Proclamação da República"]
["2023-12-25","segunda-feira","Natal"]
["2024-01-01","segunda-feira","Confraternização Universal"]
["2024-02-12","segunda-feira","Carnaval"]
["2024-02-13","terça-feira","Carnaval"]
["2024-03-29","sexta-feira","Paixão de Cristo"]
["2024-04-21","domingo","Tiradentes"]
["2024-05-01","quarta-feira","Dia do Trabalho"]
["2024-05-30","quinta-feira","Corpus Christi"]
["2024-09-07","sábado","Independência do Brasil"]
["2024-10-12","sábado","Nossa Sr.a Aparecida - Padroeira do Brasil"]
["2024-11-02","sábado","Finados"]
["2024-11-15","sexta-feira","Proclamação da República"]
["2024-11-20","quarta-feira","Dia Nacional de Zumbi e da Consciência Negra"]
["2024-12-25","quarta-feira","Natal"]
["2025-01-01","quarta-feira","Confraternização Universal"]
["2025-03-03","segunda-feira","Carnaval"]
["2025-03-04","terça-feira","Carnaval"]
["2025-04-18","sexta-feira","Paixão de Cristo"]
["2025-04-21","segunda-feira","Tiradentes"]
["2025-05-01","quinta-feira","Dia do Trabalho"]
["2025-06-19","quinta-feira","Corpus Christi"]
["2025-09-07","domingo","Independência do Brasil"]
["2025-10-12","domingo","Nossa Sr.a Aparecida - Padroeira do Brasil"]
["2025-11-02","domingo","Finados"]
["2025-11-15","sábado","Proclamação da República"]
["2025-11-20","quinta-feira","Dia Nacional de Zumbi e da Consciência Negra"]
["2025-12-25","quinta-feira","Natal"]
["2026-01-01","quinta-feira","Confraternização Universal"]
["2026-02-16","segunda-feira","Carnaval"]
["2026-02-17","terça-feira","Carnaval"]
["2026-04-03","sexta-feira","Paixão de Cristo"]
["2026-04-21","terça-feira","Tiradentes"]
["2026-05-01","sexta-feira","Dia do Trabalho"]
["2026-06-04","quinta-feira","Corpus Christi"]
["2026-09-07","segunda-feira","Independência do Brasil"]
["2026-10-12","segunda-feira","Nossa Sr.a Aparecida - Padroeira do Brasil"]
["2026-11-02","segunda-feira","Finados"]
["2026-11-15","domingo","Proclamação da República"]
["2026-11-20","sexta-feira","Dia Nacional de Zumbi e da Consciência Negra"]
["2026-12-25","sexta-feira","Natal"]
["2027-01-01","sexta-feira","Confraternização Universal"]
["2027-02-08","segunda-feira","Carnaval"]
["2027-02-09","terça-feira","Carnaval"]
["2027-03-26","sexta-feira","Paixão de Cristo"]
["2027-04-21","quarta-feira","Tiradentes"]
["2027-05-01","sábado","Dia do Trabalho"]
["2027-05-27","quinta-feira","Corpus Christi"]
["2027-09-07","terça-feira","Independência do Brasil"]
["2027-10-12","terça-feira","Nossa Sr.a Aparecida - Padroeira do Brasil"]
["2027-11-02","terça-feira","Finados"]
["2027-11-15","segunda-feira","Proclamação da República"]
["2027-11-20","sábado","Dia Nacional de Zumbi e da Consciência Negra"]
["2027-12-25","sábado","Natal"]
["2028-01-01","sábado","Confraternização Universal"]
["2028-02-28","segunda-feira","Carnaval"]
["2028-02-29","terça-feira","Carnaval"]
["2028-04-14","sexta-feira","Paixão de Cristo"]
["2028-04-21","sexta-feira","Tiradentes"]
["2028-05-01","segunda-feira","Dia do Trabalho"]
["2028-06-15","quinta-feira","Corpus Christi"]
["2028-09-07","quinta-feira","Independência do Brasil"]
["2028-10-12","quinta-feira","Nossa Sr.a Aparecida - Padroeira do Brasil"]
["2028-11-02","quinta-feira","Finados"]
["2028-11-15","quarta-feira","Proclamação da República"]
["2028-11-20","segunda-feira","Dia Nacional de Zumbi e da Consciência Negra"]
["2028-12-25","segunda-feira","Natal"]
["2029-01-01","segunda-feira","Confraternização Universal"]
["2029-02-12","segunda-feira","Carnaval"]
["2029-02-13","terça-feira","Carnaval"]
["2029-03-30","sexta-feira","Paixão de Cristo"]
["2029-04-21","sábado","Tiradentes"]
["2029-05-01","terça-feira","Dia do Trabalho"]
["2029-05-31","quinta-feira","Corpus Christi"]
["2029-09-07","sexta-feira","Independência do Brasil"]
["2029-10-12","sexta-feira","Nossa Sr.a Aparecida - Padroeira do Brasil"]
["2029-11-02","sexta-feira","Finados"]
["2029-11-15","quinta-feira","Proclamação da República"]
["2029-11-20","terça-feira","Dia Nacional de Zumbi e da Consciência Negra"]
["2029-12-25","terça-feira","Natal"]
["2030-01-01","terça-feira","Confraternização Universal"]
["2030-03-04","segunda-feira","Carnaval"]
["2030-03-05","terça-feira","Carnaval"]
["2030-04-19","sexta-feira","Paixão de Cristo"]
["2030-04-21","domingo","Tiradentes"]
["2030-05-01","quarta-feira","Dia do Trabalho"]
["2030-06-20","quinta-feira","Corpus Christi"]
["2030-09-07","sábado","Independência do Brasil"]
["2030-10-12","sábado","Nossa Sr.a Aparecida - Padroeira do Brasil"]
["2030-11-02","sábado","Finados"]
["2030-11-15","sexta-feira","Proclamação da República"]
["2030-11-20","quarta-feira","Dia Nacional de Zumbi e da Consciência Negra"]
["2030-12-25","quarta-feira","Natal"]
["2031-01-01","quarta-feira","Confraternização Universal"]
["2031-02-24","segunda-feira","Carnaval"]
["2031-02-25","terça-feira","Carnaval"]
["2031-04-11","sexta-feira","Paixão de Cristo"]
["2031-04-21","segunda-feira","Tiradentes"]
["2031-05-01","quinta-feira","Dia do Trabalho"]
["2031-06-12","quinta-feira","Corpus Christi"]
["2031-09-07","domingo","Independência do Brasil"]
["2031-10-12","domingo","Nossa Sr.a Aparecida - Padroeira do Brasil"]
["2031-11-02","domingo","Finados"]
["2031-11-15","sábado","Proclamação da República"]
["2031-11-20","quinta-feira","Dia Nacional de Zumbi e da Consciência Negra"]
["2031-12-25","quinta-feira","Natal"]
["2032-01-01","quinta-feira","Confraternização Universal"]
["2032-02-09","segunda-feira","Carnaval"]
["2032-02-10","terça-feira","Carnaval"]
["2032-03-26","sexta-feira","Paixão de Cristo"]
["2032-04-21","quarta-feira","Tiradentes"]
["2032-05-01","sábado","Dia do Trabalho"]
["2032-05-27","quinta-feira","Corpus Christi"]
["2032-09-07","terça-feira","Independência do Brasil"]
["2032-10-12","terça-feira","Nossa Sr.a Aparecida - Padroeira do Brasil"]
["2032-11-02","terça-feira","Finados"]
["2032-11-15","segunda-feira","Proclamação da República"]
["2032-11-20","sábado","Dia Nacional de Zumbi e da Consciência Negra"]
["2032-12-25","sábado","Natal"]
["2033-01-01","sábado","Confraternização Universal"]
["2033-02-28","segunda-feira","Carnaval"]
["2033-03-01","terça-feira","Carnaval"]
["2033-04-15","sexta-feira","Paixão de Cristo"]
["2033-04-21","quinta-feira","Tiradentes"]
["2033-05-01","domingo","Dia do Trabalho"]
["2033-06-16","quinta-feira","Corpus Christi"]
["2033-09-07","quarta-feira","Independência do Brasil"]
["2033-10-12","quarta-feira","Nossa Sr.a Aparecida - Padroeira do Brasil"]
["2033-11-02","quarta-feira","Finados"]
["2033-11-15","terça-feira","Proclamação da República"]
["2033-11-20","domingo","Dia Nacional de Zumbi e da Consciência Negra"]
["2033-12-25","domingo","Natal"]
["2034-01-01","domingo","Confraternização Universal"]
["2034-02-20","segunda-feira","Carnaval"]
["2034-02-21","terça-feira","Carnaval"]
["2034-04-07","sexta-feira","Paixão de Cristo"]
["2034-04-21","sexta-feira","Tiradentes"]
["2034-05-01","segunda-feira","Dia do Trabalho"]
["2034-06-08","quinta-feira","Corpus Christi"]
["2034-09-07","quinta-feira","Independência do Brasil"]
["2034-10-12","quinta-feira","Nossa Sr.a Aparecida - Padroeira do Brasil"]
["2034-11-02","quinta-feira","Finados"]
["2034-11-15","quarta-feira","Proclamação da República"]
["2034-11-20","segunda-feira","Dia Nacional de Zumbi e da Consciência Negra"]
["2034-12-25","segunda-feira","Natal"]
["2035-01-01","segunda-feira","Confraternização Universal"]
["2035-02-05","segunda-feira","Carnaval"]
["2035-02-06","terça-feira","Carnaval"]
["2035-03-23","sexta-feira","Paixão de Cristo"]
["2035-04-21","sábado","Tiradentes"]
["2035-05-01","terça-feira","Dia do Trabalho"]
["2035-05-24","quinta-feira","Corpus Christi"]
["2035-09-07","sexta-feira","Independência do Brasil"]
["2035-10-12","sexta-feira","Nossa Sr.a Aparecida - Padroeira do Brasil"]
["2035-11-02","sexta-feira","Finados"]
["2035-11-15","quinta-feira","Proclamação da República"]
["2035-11-20","terça-feira","Dia Nacional de Zumbi e da Consciência Negra"]
["2035-12-25","terça-feira","Natal"]
["2036-01-01","terça-feira","Confraternização Universal"]
["2036-02-25","segunda-feira","Carnaval"]
["2036-02-26","terça-feira","Carnaval"]
["2036-04-11","sexta-feira","Paixão de Cristo"]
["2036-04-21","segunda-feira","Tiradentes"]
["2036-05-01","quinta-feira","Dia do Trabalho"]
["2036-06-12","quinta-feira","Corpus Christi"]
["2036-09-07","domingo","Independência do Brasil"]
["2036-10-12","domingo","Nossa Sr.a Aparecida - Padroeira do Brasil"]
["2036-11-02","domingo","Finados"]
["2036-11-15","sábado","Proclamação da República"]
["2036-11-20","quinta-feira","Dia Nacional de Zumbi e da Consciência Negra"]
["2036-12-25","quinta-feira","Natal"]
["2037-01-01","quinta-feira","Confraternização Universal"]
["2037-02-16","segunda-feira","Carnaval"]
["2037-02-17","terça-feira","Carnaval"]
["2037-04-03","sexta-feira","Paixão de Cristo"]
["2037-04-21","terça-feira","Tiradentes"]
["2037-05-01","sexta-feira","Dia do Trabalho"]
["2037-06-04","quinta-feira","Corpus Christi"]
["2037-09-07","segunda-feira","Independência do Brasil"]
["2037-10-12","segunda-feira","Nossa Sr.a Aparecida - Padroeira do Brasil"]
["2037-11-02","segunda-feira","Finados"]
["2037-11-15","domingo","Proclamação da República"]
["2037-11-20","sexta-feira","Dia Nacional de Zumbi e da Consciência Negra"]
["2037-12-25","sexta-feira","Natal"]
["2038-01-01","sexta-feira","Confraternização Universal"]
["2038-03-08","segunda-feira","Carnaval"]
["2038-03-09","terça-feira","Carnaval"]
["2038-04-21","quarta-feira","Tiradentes"]
["2038-04-23","sexta-feira","Paixão de Cristo"]
["2038-05-01","sábado","Dia do Trabalho"]
["2038-06-24","quinta-feira","Corpus Christi"]
["2038-09-07","terça-feira","Independência do Brasil"]
["2038-10-12","terça-feira","Nossa Sr.a Aparecida - Padroeira do Brasil"]
["2038-11-02","terça-feira","Finados"]
["2038-11-15","segunda-feira","Proclamação da República"]
["2038-11-20","sábado","Dia Nacional de Zumbi e da Consciência Negra"]
["2038-12-25","sábado","Natal"]
["2039-01-01","sábado","Confraternização Universal"]
["2039-02-21","segunda-feira","Carnaval"]
["2039-02-22","terça-feira","Carnaval"]
["2039-04-08","sexta-feira","Paixão de Cristo"]
["2039-04-21","quinta-feira","Tiradentes"]
["2039-05-01","domingo","Dia do Trabalho"]
["2039-06-09","quinta-feira","Corpus Christi"]
["2039-09-07","quarta-feira","Independência do Brasil"]
["2039-10-12","quarta-feira","Nossa Sr.a Aparecida - Padroeira do Brasil"]
["2039-11-02","quarta-feira","Finados"]
["2039-11-15","terça-feira","Proclamação da República"]
["2039-11-20","domingo","Dia Nacional de Zumbi e da Consciência Negra"]
["2039-12-25","domingo","Natal"]
["2040-01-01","domingo","Confraternização Universal"]
["2040-02-13","segunda-feira","Carnaval"]
["2040-02-14","terça-feira","Carnaval"]
["2040-03-30","sexta-feira","Paixão de Cristo"]
["2040-04-21","sábado","Tiradentes"]
["2040-05-01","terça-feira","Dia do Trabalho"]
["2040-05-31","quinta-feira","Corpus Christi"]
["2040-09-07","sexta-feira","Independência do Brasil"]
["2040-10-12","sexta-feira","Nossa Sr.a Aparecida - Padroeira do Brasil"]
["2040-11-02","sexta-feira","Finados"]
["2040-11-15","quinta-feira","Proclamação da República"]
["2040-11-20","terça-feira","Dia Nacional de Zumbi e da Consciência Negra"]
["2040-12-25","terça-feira","Natal"]
["2041-01-01","terça-feira","Confraternização Universal"]
["2041-03-04","segunda-feira","Carnaval"]
["2041-03-05","terça-feira","Carnaval"]
["2041-04-19","sexta-feira","Paixão de Cristo"]
["2041-04-21","domingo","Tiradentes"]
["2041-05-01","quarta-feira","Dia do Trabalho"]
["2041-06-20","quinta-feira","Corpus Christi"]
["2041-09-07","sábado","Independência do Brasil"]
["2041-10-12","sábado","Nossa Sr.a Aparecida - Padroeira do Brasil"]
["2041-11-02","sábado","Finados"]
["2041-11-15","sexta-feira","Proclamação da República"]
["2041-11-20","quarta-feira","Dia Nacional de Zumbi e da Consciência Negra"]
["2041-12-25","quarta-feira","Natal"]
["2042-01-01","quarta-feira","Confraternização Universal"]
["2042-02-17","segunda-feira","Carnaval"]
["2042-02-18","terça-feira","Carnaval"]
["2042-04-04","sexta-feira","Paixão de Cristo"]
["2042-04-21","segunda-feira","Tiradentes"]
["2042-05-01","quinta-feira","Dia do Trabalho"]
["2042-06-05","quinta-feira","Corpus Christi"]
["2042-09-07","domingo","Independência do Brasil"]
["2042-10-12","domingo","Nossa Sr.a Aparecida - Padroeira do Brasil"]
["2042-11-02","domingo","Finados"]
["2042-11-15","sábado","Proclamação da República"]
["2042-11-20","quinta-feira","Dia Nacional de Zumbi e da Consciência Negra"]
["2042-12-25","quinta-feira","Natal"]
["2043-01-01","quinta-feira","Confraternização Universal"]
["2043-02-09","segunda-feira","Carnaval"]
["2043-02-10","terça-feira","Carnaval"]
["2043-03-27","sexta-feira","Paixão de Cristo"]
["2043-04-21","terça-feira","Tiradentes"]
["2043-05-01","sexta-feira","Dia do Trabalho"]
["2043-05-28","quinta-feira","Corpus Christi"]
["2043-09-07","segunda-feira","Independência do Brasil"]
["2043-10-12","segunda-feira","Nossa Sr.a Aparecida - Padroeira do Brasil"]
["2043-11-02","segunda-feira","Finados"]
["2043-11-15","domingo","Proclamação da República"]
["2043-11-20","sexta-feira","Dia Nacional de Zumbi e da Consciência Negra"]
["2043-12-25","sexta-feira","Natal"]
["2044-01-01","sexta-feira","Confraternização Universal"]
["2044-02-29","segunda-feira","Carnaval"]
["2044-03-01","terça-feira","Carnaval"]
["2044-04-15","sexta-feira","Paixão de Cristo"]
["2044-04-21","quinta-feira","Tiradentes"]
["2044-05-01","domingo","Dia do Trabalho"]
["2044-06-16","quinta-feira","Corpus Christi"]
["2044-09-07","quarta-feira","Independência do Brasil"]
["2044-10-12","quarta-feira","Nossa Sr.a Aparecida - Padroeira do Brasil"]
["2044-11-02","quarta-feira","Finados"]
["2044-11-15","terça-feira","Proclamação da República"]
["2044-11-20","domingo","Dia Nacional de Zumbi e da Consciência Negra"]
["2044-12-25","domingo","Natal"]
["2045-01-01","domingo","Confraternização Universal"]
["2045-02-20","segunda-feira","Carnaval"]
["2045-02-21","terça-feira","Carnaval"]
["2045-04-07","sexta-feira","Paixão de Cristo"]
["2045-04-21","sexta-feira","Tiradentes"]
["2045-05-01","segunda-feira","Dia do Trabalho"]
["2045-06-08","quinta-feira","Corpus Christi"]
["2045-09-07","quinta-feira","Independência do Brasil"]
["2045-10-12","quinta-feira","Nossa Sr.a Aparecida - Padroeira do Brasil"]
["2045-11-02","quinta-feira","Finados"]
["2045-11-15","quarta-feira","Proclamação da República"]
["2045-11-20","segunda-feira","Dia Nacional de Zumbi e da Consciência Negra"]
["2045-12-25","segunda-feira","Natal"]
["2046-01-01","segunda-feira","Confraternização Universal"]
["2046-02-05","segunda-feira","Carnaval"]
["2046-02-06","terça-feira","Carnaval"]
["2046-03-23","sexta-feira","Paixão de Cristo"]
["2046-04-21","sábado","Tiradentes"]
["2046-05-01","terça-feira","Dia do Trabalho"]
["2046-05-24","quinta-feira","Corpus Christi"]
["2046-09-07","sexta-feira","Independência do Brasil"]
["2046-10-12","sexta-feira","Nossa Sr.a Aparecida - Padroeira do Brasil"]
["2046-11-02","sexta-feira","Finados"]
["2046-11-15","quinta-feira","Proclamação da República"]
["2046-11-20","terça-feira","Dia Nacional de Zumbi e da Consciência Negra"]
["2046-12-25","terça-feira","Natal"]
["2047-01-01","terça-feira","Confraternização Universal"]
["2047-02-25","segunda-feira","Carnaval"]
["2047-02-26","terça-feira","Carnaval"]
["2047-04-12","sexta-feira","Paixão de Cristo"]
["2047-04-21","domingo","Tiradentes"]
["2047-05-01","quarta-feira","Dia do Trabalho"]
["2047-06-13","quinta-feira","Corpus Christi"]
["2047-09-07","sábado","Independência do Brasil"]
["2047-10-12","sábado","Nossa Sr.a Aparecida - Padroeira do Brasil"]
["2047-11-02","sábado","Finados"]
["2047-11-15","sexta-feira","Proclamação da República"]
["2047-11-20","quarta-feira","Dia Nacional de Zumbi e da Consciência Negra"]
["2047-12-25","quarta-feira","Natal"]
["2048-01-01","quarta-feira","Confraternização Universal"]
["2048-02-17","segunda-feira","Carnaval"]
["2048-02-18","terça-feira","Carnaval"]
["2048-04-03","sexta-feira","Paixão de Cristo"]
["2048-04-21","terça-feira","Tiradentes"]
["2048-05-01","sexta-feira","Dia do Trabalho"]
["2048-06-04","quinta-feira","Corpus Christi"]
["2048-09-07","segunda-feira","Independência do Brasil"]
["2048-10-12","segunda-feira","Nossa Sr.a Aparecida - Padroeira do Brasil"]
["2048-11-02","segunda-feira","Finados"]
["2048-11-15","domingo","Proclamação da República"]
["2048-11-20","sexta-feira","Dia Nacional de Zumbi e da Consciência Negra"]
["2048-12-25","sexta-feira","Natal"]
["2049-01-01","sexta-feira","Confraternização Universal"]
["2049-03-01","segunda-feira","Carnaval"]
["2049-03-02","terça-feira","Carnaval"]
["2049-04-16","sexta-feira","Paixão de Cristo"]
["2049-04-21","quarta-feira","Tiradentes"]
["2049-05-01","sábado","Dia do Trabalho"]
["2049-06-17","quinta-feira","Corpus Christi"]
["2049-09-07","terça-feira","Independência do Brasil"]
["2049-10-12","terça-feira","Nossa Sr.a Aparecida - Padroeira do Brasil"]
["2049-11-02","terça-feira","Finados"]
["2049-11-15","segunda-feira","Proclamação da República"]
["2049-11-20","sábado","Dia Nacional de Zumbi e da Consciência Negra"]
["2049-12-25","sábado","Natal"]
["2050-01-01","sábado","Confraternização Universal"]
["2050-02-21","segunda-feira","Carnaval"]
["2050-02-22","terça-feira","Carnaval"]
["2050-04-08","sexta-feira","Paixão de Cristo"]
["2050-04-21","quinta-feira","Tiradentes"]
["2050-05-01","domingo","Dia do Trabalho"]
["2050-06-09","quinta-feira","Corpus Christi"]
["2050-09-07","quarta-feira","Independência do Brasil"]
["2050-10-12","quarta-feira","Nossa Sr.a Aparecida - Padroeira do Brasil"]
["2050-11-02","quarta-feira","Finados"]
["2050-11-15","terça-feira","Proclamação da República"]
["2050-11-20","domingo","Dia Nacional de Zumbi e da Consciência Negra"]
["2050-12-25","domingo","Natal"]
["2051-01-01","domingo","Confraternização Universal"]
["2051-02-13","segunda-feira","Carnaval"]
["2051-02-14","terça-feira","Carnaval"]
["2051-03-31","sexta-feira","Paixão de Cristo"]
["2051-04-21","sexta-feira","Tiradentes"]
["2051-05-01","segunda-feira","Dia do Trabalho"]
["2051-06-01","quinta-feira","Corpus Christi"]
["2051-09-07","quinta-feira","Independência do Brasil"]
["2051-10-12","quinta-feira","Nossa Sr.a Aparecida - Padroeira do Brasil"]
["2051-11-02","quinta-feira","Finados"]
["2051-11-15","quarta-feira","Proclamação da República"]
["2051-11-20","segunda-feira","Dia Nacional de Zumbi e da Consciência Negra"]
["2051-12-25","segunda-feira","Natal"]
["2052-01-01","segunda-feira","Confraternização Universal"]
["2052-03-04","segunda-feira","Carnaval"]
["2052-03-05","terça-feira","Carnaval"]
["2052-04-19","sexta-feira","Paixão de Cristo"]
["2052-04-21","domingo","Tiradentes"]
["2052-05-01","quarta-feira","Dia do Trabalho"]
["2052-06-20","quinta-feira","Corpus Christi"]
["2052-09-07","sábado","Independência do Brasil"]
["2052-10-12","sábado","Nossa Sr.a Aparecida - Padroeira do Brasil"]
["2052-11-02","sábado","Finados"]
["2052-11-15","sexta-feira","Proclamação da República"]
["2052-11-20","quarta-feira","Dia Nacional de Zumbi e da Consciência Negra"]
["2052-12-25","quarta-feira","Natal"]
["2053-01-01","quarta-feira","Confraternização Universal"]
["2053-02-17","segunda-feira","Carnaval"]
["2053-02-18","terça-feira","Carnaval"]
["2053-04-04","sexta-feira","Paixão de Cristo"]
["2053-04-21","segunda-feira","Tiradentes"]
["2053-05-01","quinta-feira","Dia do Trabalho"]
["2053-06-05","quinta-feira","Corpus Christi"]
["2053-09-07","domingo","Independência do Brasil"]
["2053-10-12","domingo","Nossa Sr.a Aparecida - Padroeira do Brasil"]
["2053-11-02","domingo","Finados"]
["2053-11-15","sábado","Proclamação da República"]
["2053-11-20","quinta-feira","Dia Nacional de Zumbi e da Consciência Negra"]
["2053-12-25","quinta-feira","Natal"]
["2054-01-01","quinta-feira","Confraternização Universal"]
["2054-02-09","segunda-feira","Carnaval"]
["2054-02-10","terça-feira","Carnaval"]
["2054-03-27","sexta-feira","Paixão de Cristo"]
["2054-04-21","terça-feira","Tiradentes"]
["2054-05-01","sexta-feira","Dia do Trabalho"]
["2054-05-28","quinta-feira","Corpus Christi"]
["2054-09-07","segunda-feira","Independência do Brasil"]
["2054-10-12","segunda-feira","Nossa Sr.a Aparecida - Padroeira do Brasil"]
["2054-11-02","segunda-feira","Finados"]
["2054-11-15","domingo","Proclamação da República"]
["2054-11-20","sexta-feira","Dia Nacional de Zumbi e da Consciência Negra"]
["2054-12-25","sexta-feira","Natal"]
["2055-01-01","sexta-feira","Confraternização Universal"]
["2055-03-01","segunda-feira","Carnaval"]
["2055-03-02","terça-feira","Carnaval"]
["2055-04-16","sexta-feira","Paixão de Cristo"]
["2055-04-21","quarta-feira","Tiradentes"]
["2055-05-01","sábado","Dia do Trabalho"]
["2055-06-17","quinta-feira","Corpus Christi"]
["2055-09-07","terça-feira","Independência do Brasil"]
["2055-10-12","terça-feira","Nossa Sr.a Aparecida - Padroeira do Brasil"]
["2055-11-02","terça-feira","Finados"]
["2055-11-15","segunda-feira","Proclamação da República"]
["2055-11-20","sábado","Dia Nacional de Zumbi e da Consciência Negra"]
["2055-12-25","sábado","Natal"]
["2056-01-01","sábado","Confraternização Universal"]
["2056-02-14","segunda-feira","Carnaval"]
["2056-02-15","terça-feira","Carnaval"]
["2056-03-31","sexta-feira","Paixão de Cristo"]
["2056-04-21","sexta-feira","Tiradentes"]
["2056-05-01","segunda-feira","Dia do Trabalho"]
["2056-06-01","quinta-feira","Corpus Christi"]
["2056-09-07","quinta-feira","Independência do Brasil"]
["2056-10-12","quinta-feira","Nossa Sr.a Aparecida - Padroeira do Brasil"]
["2056-11-02","quinta-feira","Finados"]
["2056-11-15","quarta-feira","Proclamação da República"]
["2056-11-20","segunda-feira","Dia Nacional de Zumbi e da Consciência Negra"]
["2056-12-25","segunda-feira","Natal"]
["2057-01-01","segunda-feira","Confraternização Universal"]
["2057-03-05","segunda-feira","Carnaval"]
["2057-03-06","terça-feira","Carnaval"]
["2057-04-20","sexta-feira","Paixão de Cristo"]
["2057-04-21","sábado","Tiradentes"]
["2057-05-01","terça-feira","Dia do Trabalho"]
["2057-06-21","quinta-feira","Corpus Christi"]
["2057-09-07","sexta-feira","Independência do Brasil"]
["2057-10-12","sexta-feira","Nossa Sr.a Aparecida - Padroeira do Brasil"]
["2057-11-02","sexta-feira","Finados"]
["2057-11-15","quinta-feira","Proclamação da República"]
["2057-11-20","terça-feira","Dia Nacional de Zumbi e da Consciência Negra"]
["2057-12-25","terça-feira","Natal"]
["2058-01-01","terça-feira","Confraternização Universal"]
["2058-02-25","segunda-feira","Carnaval"]
["2058-02-26","terça-feira","Carnaval"]
["2058-04-12","sexta-feira","Paixão de Cristo"]
["2058-04-21","domingo","Tiradentes"]
["2058-05-01","quarta-feira","Dia do Trabalho"]
["2058-06-13","quinta-feira","Corpus Christi"]
["2058-09-07","sábado","Independência do Brasil"]
["2058-10-12","sábado","Nossa Sr.a Aparecida - Padroeira do Brasil"]
["2058-11-02","sábado","Finados"]
["2058-11-15","sexta-feira","Proclamação da República"]
["2058-11-20","quarta-feira","Dia Nacional de Zumbi e da Consciência Negra"]
["2058-12-25","quarta-feira","Natal"]
["2059-01-01","quarta-feira","Confraternização Universal"]
["2059-02-10","segunda-feira","Carnaval"]
["2059-02-11","terça-feira","Carnaval"]
["2059-03-28","sexta-feira","Paixão de Cristo"]
["2059-04-21","segunda-feira","Tiradentes"]
["2059-05-01","quinta-feira","Dia do Trabalho"]
["2059-05-29","quinta-feira","Corpus Christi"]
["2059-09-07","domingo","Independência do Brasil"]
["2059-10-12","domingo","Nossa Sr.a Aparecida - Padroeira do Brasil"]
["2059-11-02","domingo","Finados"]
["2059-11-15","sábado","Proclamação da República"]
["2059-11-20","quinta-feira","Dia Nacional de Zumbi e da Consciência Negra"]
["2059-12-25","quinta-feira","Natal"]
["2060-01-01","quinta-feira","Confraternização Universal"]
["2060-03-01","segunda-feira","Carnaval"]
["2060-03-02","terça-feira","Carnaval"]
["2060-04-16","sexta-feira","Paixão de Cristo"]
["2060-04-21","quarta-feira","Tiradentes"]
["2060-05-01","sábado","Dia do Trabalho"]
["2060-06-17","quinta-feira","Corpus Christi"]
["2060-09-07","terça-feira","Independência do Brasil"]
["2060-10-12","terça-feira","Nossa Sr.a Aparecida - Padroeira do Brasil"]
["2060-11-02","terça-feira","Finados"]
["2060-11-15","segunda-feira","Proclamação da República"]
["2060-11-20","sábado","Dia Nacional de Zumbi e da Consciência Negra"]
["2060-12-25","sábado","Natal"]
["2061-01-01","sábado","Confraternização Universal"]
["2061-02-21","segunda-feira","Carnaval"]
["2061-02-22","terça-feira","Carnaval"]
["2061-04-08","sexta-feira","Paixão de Cristo"]
["2061-04-21","quinta-feira","Tiradentes"]
["2061-05-01","domingo","Dia do Trabalho"]
["2061-06-09","quinta-feira","Corpus Christi"]
["2061-09-07","quarta-feira","Independência do Brasil"]
["2061-10-12","quarta-feira","Nossa Sr.a Aparecida - Padroeira do Brasil"]
["2061-11-02","quarta-feira","Finados"]
["2061-11-15","terça-feira","Proclamação da República"]
["2061-11-20","domingo","Dia Nacional de Zumbi e da Consciência Negra"]
["2061-12-25","domingo","Natal"]
["2062-01-01","domingo","Confraternização Universal"]
["2062-02-06","segunda-feira","Carnaval"]
["2062-02-07","terça-feira","Carnaval"]
["2062-03-24","sexta-feira","Paixão de Cristo"]
["2062-04-21","sexta-feira","Tiradentes"]
["2062-05-01","segunda-feira","Dia do Trabalho"]
["2062-05-25","quinta-feira","Corpus Christi"]
["2062-09-07","quinta-feira","Independência do Brasil"]
["2062-10-12","quinta-feira","Nossa Sr.a Aparecida - Padroeira do Brasil"]
["2062-11-02","quinta-feira","Finados"]
["2062-11-15","quarta-feira","Proclamação da República"]
["2062-11-20","segunda-feira","Dia Nacional de Zumbi e da Consciência Negra"]
["2062-12-25","segunda-feira","Natal"]
["2063-01-01","segunda-feira","Confraternização Universal"]
["2063-02-26","segunda-feira","Carnaval"]
["2063-02-27","terça-feira","Carnaval"]
["2063-04-13","sexta-feira","Paixão de Cristo"]
["2063-04-21","sábado","Tiradentes"]
["2063-05-01","terça-feira","Dia do Trabalho"]
["2063-06-14","quinta-feira","Corpus Christi"]
["2063-09-07","sexta-feira","Independência do Brasil"]
["2063-10-12","sexta-feira","Nossa Sr.a Aparecida - Padroeira do Brasil"]
["2063-11-02","sexta-feira","Finados"]
["2063-11-15","quinta-feira","Proclamação da República"]
["2063-11-20","terça-feira","Dia Nacional de Zumbi e da Consciência Negra"]
["2063-12-25","terça-feira","Natal"]
["2064-01-01","terça-feira","Confraternização Universal"]
["2064-02-18","segunda-feira","Carnaval"]
["2064-02-19","terça-feira","Carnaval"]
["2064-04-04","sexta-feira","Paixão de Cristo"]
["2064-04-21","segunda-feira","Tiradentes"]
["2064-05-01","quinta-feira","Dia do Trabalho"]
["2064-06-05","quinta-feira","Corpus Christi"]
["2064-09-07","domingo","Independência do Brasil"]
["2064-10-12","domingo","Nossa Sr.a Aparecida - Padroeira do Brasil"]
["2064-11-02","domingo","Finados"]
["2064-11-15","sábado","Proclamação da República"]
["2064-11-20","quinta-feira","Dia Nacional de Zumbi e da Consciência Negra"]
["2064-12-25","quinta-feira","Natal"]
["2065-01-01","quinta-feira","Confraternização Universal"]
["2065-02-09","segunda-feira","Carnaval"]
["2065-02-10","terça-feira","Carnaval"]
["2065-03-27","sexta-feira","Paixão de Cristo"]
["2065-04-21","terça-feira","Tiradentes"]
["2065-05-01","sexta-feira","Dia do Trabalho"]
["2065-05-28","quinta-feira","Corpus Christi"]
["2065-09-07","segunda-feira","Independência do Brasil"]
["2065-10-12","segunda-feira","Nossa Sr.a Aparecida - Padroeira do Brasil"]
["2065-11-02","segunda-feira","Finados"]
["2065-11-15","domingo","Proclamação da República"]
["2065-11-20","sexta-feira","Dia Nacional de Zumbi e da Consciência Negra"]
["2065-12-25","sexta-feira","Natal"]
["2066-01-01","sexta-feira","Confraternização Universal"]
["2066-02-22","segunda-feira","Carnaval"]
["2066-02-23","terça-feira","Carnaval"]
["2066-04-09","sexta-feira","Paixão de Cristo"]
["2066-04-21","quarta-feira","Tiradentes"]
["2066-05-01","sábado","Dia do Trabalho"]
["2066-06-10","quinta-feira","Corpus Christi"]
["2066-09-07","terça-feira","Independência do Brasil"]
["2066-10-12","terça-feira","Nossa Sr.a Aparecida - Padroeira do Brasil"]
["2066-11-02","terça-feira","Finados"]
["2066-11-15","segunda-feira","Proclamação da República"]
["2066-11-20","sábado","Dia Nacional de Zumbi e da Consciência Negra"]
["2066-12-25","sábado","Natal"]
["2067-01-01","sábado","Confraternização Universal"]
["2067-02-14","segunda-feira","Carnaval"]
["2067-02-15","terça-feira","Carnaval"]
["2067-04-01","sexta-feira","Paixão de Cristo"]
["2067-04-21","quinta-feira","Tiradentes"]
["2067-05-01","domingo","Dia do Trabalho"]
["2067-06-02","quinta-feira","Corpus Christi"]
["2067-09-07","quarta-feira","Independência do Brasil"]
["2067-10-12","quarta-feira","Nossa Sr.a Aparecida - Padroeira do Brasil"]
["2067-11-02","quarta-feira","Finados"]
["2067-11-15","terça-feira","Proclamação da República"]
["2067-11-20","domingo","Dia Nacional de Zumbi e da Consciência Negra"]
["2067-12-25","domingo","Natal"]
["2068-01-01","domingo","Confraternização Universal"]
["2068-03-05","segunda-feira","Carnaval"]
["2068-03-06","terça-feira","Carnaval"]
["2068-04-20","sexta-feira","Paixão de Cristo"]
["2068-04-21","sábado","Tiradentes"]
["2068-05-01","terça-feira","Dia do Trabalho"]
["2068-06-21","quinta-feira","Corpus Christi"]
["2068-09-07","sexta-feira","Independência do Brasil"]
["2068-10-12","sexta-feira","Nossa Sr.a Aparecida - Padroeira do Brasil"]
["2068-11-02","sexta-feira","Finados"]
["2068-11-15","quinta-feira","Proclamação da República"]
["2068-11-20","terça-feira","Dia Nacional de Zumbi e da Consciência Negra"]
["2068-12-25","terça-feira","Natal"]
["2069-01-01","terça-feira","Confraternização Universal"]
["2069-02-25","segunda-feira","Carnaval"]
["2069-02-26","terça-feira","Carnaval"]
["2069-04-12","sexta-feira","Paixão de Cristo"]
["2069-04-21","domingo","Tiradentes"]
["2069-05-01","quarta-feira","Dia do Trabalho"]
["2069-06-13","quinta-feira","Corpus Christi"]
["2069-09-07","sábado","Independência do Brasil"]
["2069-10-12","sábado","Nossa Sr.a Aparecida - Padroeira do Brasil"]
["2069-11-02","sábado","Finados"]
["2069-11-15","sexta-feira","Proclamação da República"]
["2069-11-20","quarta-feira","Dia Nacional de Zumbi e da Consciência Negra"]
["2069-12-25","quarta-feira","Natal"]
["2070-01-01","quarta-feira","Confraternização Universal"]
["2070-02-10","segunda-feira","Carnaval"]
["2070-02-11","terça-feira","Carnaval"]
["2070-03-28","sexta-feira","Paixão de Cristo"]
["2070-04-21","segunda-feira","Tiradentes"]
["2070-05-01","quinta-feira","Dia do Trabalho"]
["2070-05-29","quinta-feira","Corpus Christi"]
["2070-09-07","domingo","Independência do Brasil"]
["2070-10-12","domingo","Nossa Sr.a Aparecida - Padroeira do Brasil"]
["2070-11-02","domingo","Finados"]
["2070-11-15","sábado","Proclamação da República"]
["2070-11-20","quinta-feira","Dia Nacional de Zumbi e da Consciência Negra"]
["2070-12-25","quinta-feira","Natal"]
["2071-01-01","quinta-feira","Confraternização Universal"]
["2071-03-02","segunda-feira","Carnaval"]
["2071-03-03","terça-feira","Carnaval"]
["2071-04-17","sexta-feira","Paixão de Cristo"]
["2071-04-21","terça-feira","Tiradentes"]
["2071-05-01","sexta-feira","Dia do Trabalho"]
["2071-06-18","quinta-feira","Corpus Christi"]
["2071-09-07","segunda-feira","Independência do Brasil"]
["2071-10-12","segunda-feira","Nossa Sr.a Aparecida - Padroeira do Brasil"]
["2071-11-02","segunda-feira","Finados"]
["2071-11-15","domingo","Proclamação da República"]
["2071-11-20","sexta-feira","Dia Nacional de Zumbi e da Consciência Negra"]
["2071-12-25","sexta-feira","Natal"]
["2072-01-01","sexta-feira","Confraternização Universal"]
["2072-02-22","segunda-feira","Carnaval"]
["2072-02-23","terça-feira","Carnaval"]
["2072-04-08","sexta-feira","Paixão de Cristo"]
["2072-04-21","quinta-feira","Tiradentes"]
["2072-05-01","domingo","Dia do Trabalho"]
["2072-06-09","quinta-feira","Corpus Christi"]
["2072-09-07","quarta-feira","Independência do Brasil"]
["2072-10-12","quarta-feira","Nossa Sr.a Aparecida - Padroeira do Brasil"]
["2072-11-02","quarta-feira","Finados"]
["2072-11-15","terça-feira","Proclamação da República"]
["2072-11-20","domingo","Dia Nacional de Zumbi e da Consciência Negra"]
["2072-12-25","domingo","Natal"]
["2073-01-01","domingo","Confraternização Universal"]
["2073-02-06","segunda-feira","Carnaval"]
["2073-02-07","terça-feira","Carnaval"]
["2073-03-24","sexta-feira","Paixão de Cristo"]
["2073-04-21","sexta-feira","Tiradentes"]
["2073-05-01","segunda-feira","Dia do Trabalho"]
["2073-05-25","quinta-feira","Corpus Christi"]
["2073-09-07","quinta-feira","Independência do Brasil"]
["2073-10-12","quinta-feira","Nossa Sr.a Aparecida - Padroeira do Brasil"]
["2073-11-02","quinta-feira","Finados"]
["2073-11-15","quarta-feira","Proclamação da República"]
["2073-11-20","segunda-feira","Dia Nacional de Zumbi e da Consciência Negra"]
["2073-12-25","segunda-feira","Natal"]
["2074-01-01","segunda-feira","Confraternização Universal"]
["2074-02-26","segunda-feira","Carnaval"]
["2074-02-27","terça-feira","Carnaval"]
["2074-04-13","sexta-feira","Paixão de Cristo"]
["2074-04-21","sábado","Tiradentes"]
["2074-05-01","terça-feira","Dia do Trabalho"]
["2074-06-14","quinta-feira","Corpus Christi"]
["2074-09-07","sexta-feira","Independência do Brasil"]
["2074-10-12","sexta-feira","Nossa Sr.a Aparecida - Padroeira do Brasil"]
["2074-11-02","sexta-feira","Finados"]
["2074-11-15","quinta-feira","Proclamação da República"]
["2074-11-20","terça-feira","Dia Nacional de Zumbi e da Consciência Negra"]
["2074-12-25","terça-feira","Natal"]
["2075-01-01","terça-feira","Confraternização Universal"]
["2075-02-18","segunda-feira","Carnaval"]
["2075-02-19","terça-feira","Carnaval"]
["2075-04-05","sexta-feira","Paixão de Cristo"]
["2075-04-21","domingo","Tiradentes"]
["2075-05-01","quarta-feira","Dia do Trabalho"]
["2075-06-06","quinta-feira","Corpus Christi"]
["2075-09-07","sábado","Independência do Brasil"]
["2075-10-12","sábado","Nossa Sr.a Aparecida - Padroeira do Brasil"]
["2075-11-02","sábado","Finados"]
["2075-11-15","sexta-feira","Proclamação da República"]
["2075-11-20","quarta-feira","Dia Nacional de Zumbi e da Consciência Negra"]
["2075-12-25","quarta-feira","Natal"]
["2076-01-01","quarta-feira","Confraternização Universal"]
["2076-03-02","segunda-feira","Carnaval"]
["2076-03-03","terça-feira","Carnaval"]
["2076-04-17","sexta-feira","Paixão de Cristo"]
["2076-04-21","terça-feira","Tiradentes"]
["2076-05-01","sexta-feira","Dia do Trabalho"]
["2076-06-18","quinta-feira","Corpus Christi"]
["2076-09-07","segunda-feira","Independência do Brasil"]
["2076-10-12","segunda-feira","Nossa Sr.a Aparecida - Padroeira do Brasil"]
["2076-11-02","segunda-feira","Finados"]
["2076-11-15","domingo","Proclamação da República"]
["2076-11-20","sexta-feira","Dia Nacional de Zumbi e da Consciência Negra"]
["2076-12-25","sexta-feira","Natal"]
["2077-01-01","sexta-feira","Confraternização Universal"]
["2077-02-22","segunda-feira","Carnaval"]
["2077-02-23","terça-feira","Carnaval"]
["2077-04-09","sexta-feira","Paixão de Cristo"]
["2077-04-21","quarta-feira","Tiradentes"]
["2077-05-01","sábado","Dia do Trabalho"]
["2077-06-10","quinta-feira","Corpus Christi"]
["2077-09-07","terça-feira","Independência do Brasil"]
["2077-10-12","terça-feira","Nossa Sr.a Aparecida - Padroeira do Brasil"]
["2077-11-02","terça-feira","Finados"]
["2077-11-15","segunda-feira","Proclamação da República"]
["2077-11-20","sábado","Dia Nacional de Zumbi e da Consciência Negra"]
["2077-12-25","sábado","Natal"]
["2078-01-01","sábado","Confraternização Universal"]
["2078-02-14","segunda-feira","Carnaval"]
["2078-02-15","terça-feira","Carnaval"]
["2078-04-01","sexta-feira","Paixão de Cristo"]
["2078-04-21","quinta-feira","Tiradentes"]
["2078-05-01","domingo","Dia do Trabalho"]
["2078-06-02","quinta-feira","Corpus Christi"]
["2078-09-07","quarta-feira","Independência do Brasil"]
["2078-10-12","quarta-feira","Nossa Sr.a Aparecida - Padroeira do Brasil"]
["2078-11-02","quarta-feira","Finados"]
["2078-11-15","terça-feira","Proclamação da República"]
["2078-11-20","domingo","Dia Nacional de Zumbi e da Consciência Negra"]
["2078-12-25","domingo","Natal"]
["2079-01-01","domingo","Confraternização Universal"]
["2079-03-06","segunda-feira","Carnaval"]
["2079-03-07","terça-feira","Carnaval"]
["2079-04-21","sexta-feira","Paixão de Cristo"]
["2079-04-21","sexta-feira","Tiradentes"]
["2079-05-01","segunda-feira","Dia do Trabalho"]
["2079-06-22","quinta-feira","Corpus Christi"]
["2079-09-07","quinta-feira","Independência do Brasil"]
["2079-10-12","quinta-feira","Nossa Sr.a Aparecida - Padroeira do Brasil"]
["2079-11-02","quinta-feira","Finados"]
["2079-11-15","quarta-feira","Proclamação da República"]
["2079-11-20","segunda-feira","Dia Nacional de Zumbi e da Consciência Negra"]
["2079-12-25","segunda-feira","Natal"]
["2080-01-01","segunda-feira","Confraternização Universal"]
["2080-02-19","segunda-feira","Carnaval"]
["2080-02-20","terça-feira","Carnaval"]
["2080-04-05","sexta-feira","Paixão de Cristo"]
["2080-04-21","domingo","Tiradentes"]
["2080-05-01","quarta-feira","Dia do Trabalho"]
["2080-06-06","quinta-feira","Corpus Christi"]
["2080-09-07","sábado","Independência do Brasil"]
["2080-10-12","sábado","Nossa Sr.a Aparecida - Padroeira do Brasil"]
["2080-11-02","sábado","Finados"]
["2080-11-15","sexta-feira","Proclamação da República"]
["2080-11-20","quarta-feira","Dia Nacional de Zumbi e da Consciência Negra"]
["2080-12-25","quarta-feira","Natal"]
["2081-01-01","quarta-feira","Confraternização Universal"]
["2081-02-10","segunda-feira","Carnaval"]
["2081-02-11","terça-feira","Carnaval"]
["2081-03-28","sexta-feira","Paixão de Cristo"]
["2081-04-21","segunda-feira","Tiradentes"]
["2081-05-01","quinta-feira","Dia do Trabalho"]
["2081-05-29","quinta-feira","Corpus Christi"]
["2081-09-07","domingo","Independência do Brasil"]
["2081-10-12","domingo","Nossa Sr.a Aparecida - Padroeira do Brasil"]
["2081-11-02","domingo","Finados"]
["2081-11-15","sábado","Proclamação da República"]
["2081-11-20","quinta-feira","Dia Nacional de Zumbi e da Consciência Negra"]
["2081-12-25","quinta-feira","Natal"]
["2082-01-01","quinta-feira","Confraternização Universal"]
["2082-03-02","segunda-feira","Carnaval"]
["2082-03-03","terça-feira","Carnaval"]
["2082-04-17","sexta-feira","Paixão de Cristo"]
["2082-04-21","terça-feira","Tiradentes"]
["2082-05-01","sexta-feira","Dia do Trabalho"]
["2082-06-18","quinta-feira","Corpus Christi"]
["2082-09-07","segunda-feira","Independência do Brasil"]
["2082-10-12","segunda-feira","Nossa Sr.a Aparecida - Padroeira do Brasil"]
["2082-11-02","segunda-feira","Finados"]
["2082-11-15","domingo","Proclamação da República"]
["2082-11-20","sexta-feira","Dia Nacional de Zumbi e da Consciência Negra"]
["2082-12-25","sexta-feira","Natal"]
["2083-01-01","sexta-feira","Confraternização Universal"]
["2083-02-15","segunda-feira","Carnaval"]
["2083-02-16","terça-feira","Carnaval"]
["2083-04-02","sexta-feira","Paixão de Cristo"]
["2083-04-21","quarta-feira","Tiradentes"]
["2083-05-01","sábado","Dia do Trabalho"]
["2083-06-03","quinta-feira","Corpus Christi"]
["2083-09-07","terça-feira","Independência do Brasil"]
["2083-10-12","terça-feira","Nossa Sr.a Aparecida - Padroeira do Brasil"]
["2083-11-02","terça-feira","Finados"]
["2083-11-15","segunda-feira","Proclamação da República"]
["2083-11-20","sábado","Dia Nacional de Zumbi e da Consciência Negra"]
["2083-12-25","sábado","Natal"]
["2084-01-01","sábado","Confraternização Universal"]
["2084-02-07","segunda-feira","Carnaval"]
["2084-02-08","terça-feira","Carnaval"]
["2084-03-24","sexta-feira","Paixão de Cristo"]
["2084-04-21","sexta-feira","Tiradentes"]
["2084-05-01","segunda-feira","Dia do Trabalho"]
["2084-05-25","quinta-feira","Corpus Christi"]
["2084-09-07","quinta-feira","Independência do Brasil"]
["2084-10-12","quinta-feira","Nossa Sr.a Aparecida - Padroeira do Brasil"]
["2084-11-02","quinta-feira","Finados"]
["2084-11-15","quarta-feira","Proclamação da República"]
["2084-11-20","segunda-feira","Dia Nacional de Zumbi e da Consciência Negra"]
["2084-12-25","segunda-feira","Natal"]
["2085-01-01","segunda-feira","Confraternização Universal"]
["2085-02-26","segunda-feira","Carnaval"]
["2085-02-27","terça-feira","Carnaval"]
["2085-04-13","sexta-feira","Paixão de Cristo"]
["2085-04-21","sábado","Tiradentes"]
["2085-05-01","terça-feira","Dia do Trabalho"]
["2085-06-14","quinta-feira","Corpus Christi"]
["2085-09-07","sexta-feira","Independência do Brasil"]
["2085-10-12","sexta-feira","Nossa Sr.a Aparecida - Padroeira do Brasil"]
["2085-11-02","sexta-feira","Finados"]
["2085-11-15","quinta-feira","Proclamação da República"]
["2085-11-20","terça-feira","Dia Nacional de Zumbi e da Consciência Negra"]
["2085-12-25","terça-feira","Natal"]
["2086-01-01","terça-feira","Confraternização Universal"]
["2086-02-11","segunda-feira","Carnaval"]
["2086-02-12","terça-feira","Carnaval"]
["2086-03-29","sexta-feira","Paixão de Cristo"]
["2086-04-21","domingo","Tiradentes"]
["2086-05-01","quarta-feira","Dia do Trabalho"]
["2086-05-30","quinta-feira","Corpus Christi"]
["2086-09-07","sábado","Independência do Brasil"]
["2086-10-12","sábado","Nossa Sr.a Aparecida - Padroeira do Brasil"]
["2086-11-02","sábado","Finados"]
["2086-11-15","sexta-feira","Proclamação da República"]
["2086-11-20","quarta-feira","Dia Nacional de Zumbi e da Consciência Negra"]
["2086-12-25","quarta-feira","Natal"]
["2087-01-01","quarta-feira","Confraternização Universal"]
["2087-03-03","segunda-feira","Carnaval"]
["2087-03-04","terça-feira","Carnaval"]
["2087-04-18","sexta-feira","Paixão de Cristo"]
["2087-04-21","segunda-feira","Tiradentes"]
["2087-05-01","quinta-feira","Dia do Trabalho"]
["2087-06-19","quinta-feira","Corpus Christi"]
["2087-09-07","domingo","Independência do Brasil"]
["2087-10-12","domingo","Nossa Sr.a Aparecida - Padroeira do Brasil"]
["2087-11-02","domingo","Finados"]
["2087-11-15","sábado","Proclamação da República"]
["2087-11-20","quinta-feira","Dia Nacional de Zumbi e da Consciência Negra"]
["2087-12-25","quinta-feira","Natal"]
["2088-01-01","quinta-feira","Confraternização Universal"]
["2088-02-23","segunda-feira","Carnaval"]
["2088-02-24","terça-feira","Carnaval"]
["2088-04-09","sexta-feira","Paixão de Cristo"]
["2088-04-21","quarta-feira","Tiradentes"]
["2088-05-01","sábado","Dia do Trabalho"]
["2088-06-10","quinta-feira","Corpus Christi"]
["2088-09-07","terça-feira","Independência do Brasil"]
["2088-10-12","terça-feira","Nossa Sr.a Aparecida - Padroeira do Brasil"]
["2088-11-02","terça-feira","Finados"]
["2088-11-15","segunda-feira","Proclamação da República"]
["2088-11-20","sábado","Dia Nacional de Zumbi e da Consciência Negra"]
["2088-12-25","sábado","Natal"]
["2089-01-01","sábado","Confraternização Universal"]
["2089-02-14","segunda-feira","Carnaval"]
["2089-02-15","terça-feira","Carnaval"]
["2089-04-01","sexta-feira","Paixão de Cristo"]
["2089-04-21","quinta-feira","Tiradentes"]
["2089-05-01","domingo","Dia do Trabalho"]
["2089-06-02","quinta-feira","Corpus Christi"]
["2089-09-07","quarta-feira","Independência do Brasil"]
["2089-10-12","quarta-feira","Nossa Sr.a Aparecida - Padroeira do Brasil"]
["2089-11-02","quarta-feira","Finados"]
["2089-11-15","terça-feira","Proclamação da República"]
["2089-11-20","domingo","Dia Nacional de Zumbi e da Consciência Negra"]
["2089-12-25","domingo","Natal"]
["2090-01-01","domingo","Confraternização Universal"]
["2090-02-27","segunda-feira","Carnaval"]
["2090-02-28","terça-feira","Carnaval"]
["2090-04-14","sexta-feira","Paixão de Cristo"]
["2090-04-21","sexta-feira","Tiradentes"]
["2090-05-01","segunda-feira","Dia do Trabalho"]
["2090-06-15","quinta-feira","Corpus Christi"]
["2090-09-07","quinta-feira","Independência do Brasil"]
["2090-10-12","quinta-feira","Nossa Sr.a Aparecida - Padroeira do Brasil"]
["2090-11-02","quinta-feira","Finados"]
["2090-11-15","quarta-feira","Proclamação da República"]
["2090-11-20","segunda-feira","Dia Nacional de Zumbi e da Consciência Negra"]
["2090-12-25","segunda-feira","Natal"]
["2091-01-01","segunda-feira","Confraternização Universal"]
["2091-02-19","segunda-feira","Carnaval"]
["2091-02-20","terça-feira","Carnaval"]
["2091-04-06","sexta-feira","Paixão de Cristo"]
["2091-04-21","sábado","Tiradentes"]
["2091-05-01","terça-feira","Dia do Trabalho"]
["2091-06-07","quinta-feira","Corpus Christi"]
["2091-09-07","sexta-feira","Independência do Brasil"]
["2091-10-12","sexta-feira","Nossa Sr.a Aparecida - Padroeira do Brasil"]
["2091-11-02","sexta-feira","Finados"]
["2091-11-15","quinta-feira","Proclamação da República"]
["2091-11-20","terça-feira","Dia Nacional de Zumbi e da Consciência Negra"]
["2091-12-25","terça-feira","Natal"]
["2092-01-01","terça-feira","Confraternização Universal"]
["2092-02-11","segunda-feira","Carnaval"]
["2092-02-12","terça-feira","Carnaval"]
["2092-03-28","sexta-feira","Paixão de Cristo"]
["2092-04-21","segunda-feira","Tiradentes"]
["2092-05-01","quinta-feira","Dia do Trabalho"]
["2092-05-29","quinta-feira","Corpus Christi"]
["2092-09-07","domingo","Independência do Brasil"]
["2092-10-12","domingo","Nossa Sr.a Aparecida - Padroeira do Brasil"]
["2092-11-02","domingo","Finados"]
["2092-11-15","sábado","Proclamação da República"]
["2092-11-20","quinta-feira","Dia Nacional de Zumbi e da Consciência Negra"]
["2092-12-25","quinta-feira","Natal"]
["2093-01-01","quinta-feira","Confraternização Universal"]
["2093-02-23","segunda-feira","Carnaval"]
["2093-02-24","terça-feira","Carnaval"]
["2093-04-10","sexta-feira","Paixão de Cristo"]
["2093-04-21","terça-feira","Tiradentes"]
["2093-05-01","sexta-feira","Dia do Trabalho"]
["2093-06-11","quinta-feira","Corpus Christi"]
["2093-09-07","segunda-feira","Independência do Brasil"]
["2093-10-12","segunda-feira","Nossa Sr.a Aparecida - Padroeira do Brasil"]
["2093-11-02","segunda-feira","Finados"]
["2093-11-15","domingo","Proclamação da República"]
["2093-11-20","sexta-feira","Dia Nacional de Zumbi e da Consciência Negra"]
["2093-12-25","sexta-feira","Natal"]
["2094-01-01","sexta-feira","Confraternização Universal"]
["2094-02-15","segunda-feira","Carnaval"]
["2094-02-16","terça-feira","Carnaval"]
["2094-04-02","sexta-feira","Paixão de Cristo"]
["2094-04-21","quarta-feira","Tiradentes"]
["2094-05-01","sábado","Dia do Trabalho"]
["2094-06-03","quinta-feira","Corpus Christi"]
["2094-09-07","terça-feira","Independência do Brasil"]
["2094-10-12","terça-feira","Nossa Sr.a Aparecida - Padroeira do Brasil"]
["2094-11-02","terça-feira","Finados"]
["2094-11-15","segunda-feira","Proclamação da República"]
["2094-11-20","sábado","Dia Nacional de Zumbi e da Consciência Negra"]
["2094-12-25","sábado","Natal"]
["2095-01-01","sábado","Confraternização Universal"]
["2095-03-07","segunda-feira","Carnaval"]
["2095-03-08","terça-feira","Carnaval"]
["2095-04-21","quinta-feira","Tiradentes"]
["2095-04-22","sexta-feira","Paixão de Cristo"]
["2095-05-01","domingo","Dia do Trabalho"]
["2095-06-23","quinta-feira","Corpus Christi"]
["2095-09-07","quarta-feira","Independência do Brasil"]
["2095-10-12","quarta-feira","Nossa Sr.a Aparecida - Padroeira do Brasil"]
["2095-11-02","quarta-feira","Finados"]
["2095-11-15","terça-feira","Proclamação da República"]
["2095-11-20","domingo","Dia Nacional de Zumbi e da Consciência Negra"]
["2095-12-25","domingo","Natal"]
["2096-01-01","domingo","Confraternização Universal"]
["2096-02-27","segunda-feira","Carnaval"]
["2096-02-28","terça-feira","Carnaval"]
["2096-04-13","sexta-feira","Paixão de Cristo"]
["2096-04-21","sábado","Tiradentes"]
["2096-05-01","terça-feira","Dia do Trabalho"]
["2096-06-14","quinta-feira","Corpus Christi"]
["2096-09-07","sexta-feira","Independência do Brasil"]
["2096-10-12","sexta-feira","Nossa Sr.a Aparecida - Padroeira do Brasil"]
["2096-11-02","sexta-feira","Finados"]
["2096-11-15","quinta-feira","Proclamação da República"]
["2096-11-20","terça-feira","Dia Nacional de Zumbi e da Consciência Negra"]
["2096-12-25","terça-feira","Natal"]
["2097-01-01","terça-feira","Confraternização Universal"]
["2097-02-11","segunda-feira","Carnaval"]
["2097-02-12","terça-feira","Carnaval"]
["2097-03-29","sexta-feira","Paixão de Cristo"]
["2097-04-21","domingo","Tiradentes"]
["2097-05-01","quarta-feira","Dia do Trabalho"]
["2097-05-30","quinta-feira","Corpus Christi"]
["2097-09-07","sábado","Independência do Brasil"]
["2097-10-12","sábado","Nossa Sr.a Aparecida - Padroeira do Brasil"]
["2097-11-02","sábado","Finados"]
["2097-11-15","sexta-feira","Proclamação da República"]
["2097-11-20","quarta-feira","Dia Nacional de Zumbi e da Consciência Negra"]
["2097-12-25","quarta-feira","Natal"]
["2098-01-01","quarta-feira","Confraternização Universal"]
["2098-03-03","segunda-feira","Carnaval"]
["2098-03-04","terça-feira","Carnaval"]
["2098-04-18","sexta-feira","Paixão de Cristo"]
["2098-04-21","segunda-feira","Tiradentes"]
["2098-05-01","quinta-feira","Dia do Trabalho"]
["2098-06-19","quinta-feira","Corpus Christi"]
["2098-09-07","domingo","Independência do Brasil"]
["2098-10-12","domingo","Nossa Sr.a Aparecida - Padroeira do Brasil"]
["2098-11-02","domingo","Finados"]
["2098-11-15","sábado","Proclamação da República"]
["2098-11-20","quinta-feira","Dia Nacional de Zumbi e da Consciência Negra"]
["2098-12-25","quinta-feira","Natal"]
["2099-01-01","quinta-feira","Confraternização Universal "]
["2099-02-23","segunda-feira","Carnaval"]
["2099-02-24","terça-feira","Carnaval"]
["2099-04-10","sexta-feira","Paixão de Cristo"]
["2099-04-21","terça-feira","Tiradentes"]
["2099-05-01","sexta-feira","Dia do Trabalho"]
["2099-06-11","quinta-feira","Corpus Christi"]
["2099-09-07","segunda-feira","Independência do Brasil"]
["2099-10-12","segunda-feira","Nossa Sr.a Aparecida - Padroeira do Brasil"]
["2099-11-02","segunda-feira","Finados"]
["2099-11-15","domingo","Proclamação da República"]
["2099-11-20","sexta-feira","Dia Nacional de Zumbi e da Consciência Negra"]
["2099-12-25","sexta-feira","Natal"]

{"sheet":"PZO","index":2,"n_rows":1297,"n_cols":66,"rows_kept":1297,"cut":false,"hidden":true,"merged":[]}
["IOF ad",{"$f":"ROUND(3%/365,6)","v":8.2000000000000001E-5},null,null,null,null,null,null,null,null,null,null,null,null,null,null,null,null,null,null,"Port final",null,{"$f":"J16","v":1.4065127144978096E-2},{"$f":"IF($P$2=$AH$4,AH1,AP1)","v":"INSS"},{"$f":"IF($P$2=$AH$4,AI1,AQ1)","v":1.35E-2},{"$f":"IF($P$2=$AH$4,AJ1,AR1)","v":1.8499999999999999E-2},{"$f":"IF($P$2=$AH$4,AK1,AS1)","v":"Port"},{"$f":"'Simulador Port'!C18","v":"FLEX 1"},null,null,null,null,null,"INSS",{"$f":"'Planilha 1'!AI1","v":1.35E-2},{"$f":"'Planilha 1'!AJ1","v":1.8499999999999999E-2},"Port",null,null,null,null,"SIAPE",{"$f":"'Planilha 1'!AQ1","v":1.6E-2},{"$f":"'Planilha 1'!AR1","v":1.7999999999999999E-2},"Port"]
["IOF adic.",3.8E-3,null,null,null,null,null,"CONVÊNIO",null,null,null,null,null,null,null,{"$f":"'Planilha 1'!P2","v":"INSS"},null,null,null,null,"TAXA TETO PONDERADO",{"$f":"((W1*W2)+(Z1*(Z2-W2)))/P3","v":1.5728204465611309E-2},{"$f":"J10","v":60},null,null,{"$f":"P3","v":96},null,null,null,null,null,null,null,null,null,null,null,null,null,null,null,null,96]
[null,null,null,null,null,null,null,null,null,null,null,null,null,null,"Prazo simulado (meses)",{"$f":"'Planilha 1'!P3","v":96},null,null,null,null,null,null,null,"Convenio","TxMax","TxMin","Nome",null,"Fator um jr","Novo Saldo","IOF","TROCO","VLR FIN","Convenio","TxMax","TxMin","Nome","Nome",null,null,null,"Convenio","TxMax","TxMin","Nome","Nome"]
[null,null,null,null,null,null,null,null,null,null,null,null,null,null,null,null,null,null,{"$f":"IF(AG4<$V$6,0,IF(AND(Z4>$V$2,Y4>$V$2),0,IF(OR(AF4/AD4>$V$4,$AF4>=$V$5),W3+1,0)))","v":0},null,"Torco min %",{"$f":"'Planilha 1'!V4","v":0},{"$f":"IF(AND(X4=\"INSS\",$AB$1=\"NORMAL\",OR(AA4=$AK$8,AA4=$AK$9)),0,IF($I$17<$Y$1,0,IFERROR(IF(AG4<$V$6,0,IF(AND(Z4>$V$2,Y4>$V$2),0,IF(OR(AF4/AD4>$V$4,$AF4>=$V$5),W3+1,0))),0)))","v":0},{"$f":"IF($P$2=$AH$4,AH4,AP4)","v":"INSS"},{"$f":"IF($P$2=$AH$4,AI4,AQ4)","v":1.8499999999999999E-2},{"$f":"IF($P$2=$AH$4,AJ4,AR4)","v":1.78E-2},{"$f":"IF($P$2=$AH$4,AK4,AS4)","v":"Normal"},{"$f":"IF($P$2=$AH$4,AL4,AT4)","v":"INSS RfnPort Tx1,850%~1,780% Normal"},{"$f":"(1+MIN(Y4,$V$2))^(1/30)","v":1.0005203285932471},{"$f":"OFFSET($U$32,,ROW()-ROW($AD$4))","v":12195.164292716507},{"$f":"OFFSET($AH$29,,ROW()-ROW($AE$4))","v":86.840907176081586},{"$f":"AD4-AE4-$J$8","v":2108.3234634141481},{"$f":"SUM(AD4,AF4)","v":14303.487756130655},{"$f":"'Planilha 1'!AH4","v":"INSS"},{"$f":"'Planilha 1'!AI4","v":1.8499999999999999E-2},{"$f":"'Planilha 1'!AJ4","v":1.78E-2},{"$f":"'Planilha 1'!AK4","v":"Normal"},{"$f":"'Planilha 1'!AL4","v":"INSS RfnPort Tx1,850%~1,780% Normal"},null,null,null,{"$f":"'Planilha 1'!AP4","v":"SIAPE"},{"$f":"'Planilha 1'!AQ4","v":1.7989999999999999E-2},{"$f":"'Planilha 1'!AR4","v":1.7989999999999999E-2},{"$f":"'Planilha 1'!AS4","v":"Normal"},{"$f":"'Planilha 1'!AT4","v":"SIAPE RfnPort Tx1.799 Normal Web"}]
[null,null,null,null,null,null,null,null,null,null,null,null,null,null,null,null,null,null,null,null,"Torco min R$",{"$f":"'Planilha 1'!V5","v":50},{"$f":"IF(AND(X5=\"INSS\",$AB$1=\"NORMAL\",OR(AA5=$AK$8,AA5=$AK$9)),0,IF($I$17<$Y$1,0,IFERROR(IF(AG5<$V$6,0,IF(AND(Z5>$V$2,Y5>$V$2),0,IF(OR(AF5/AD5>$V$4,$AF5>=$V$5),W4+1,0))),0)))","v":0},{"$f":"IF($P$2=$AH$4,AH5,AP5)","v":"INSS"},{"$f":"IF($P$2=$AH$4,AI5,AQ5)","v":1.779E-2},{"$f":"IF($P$2=$AH$4,AJ5,AR5)","v":1.7399999999999999E-2},{"$f":"IF($P$2=$AH$4,AK5,AS5)","v":"Flex 1"},{"$f":"IF($P$2=$AH$4,AL5,AT5)","v":"INSS RfnPort Tx1,779%~1,740% Flex1"},{"$f":"(1+MIN(Y5,$V$2))^(1/30)","v":1.0005203285932471},{"$f":"OFFSET($U$32,,ROW()-ROW($AD$4))","v":12195.164292716507},{"$f":"OFFSET($AH$29,,ROW()-ROW($AE$4))","v":86.840907176081586},{"$f":"AD5-AE5-$J$8","v":2108.3234634141481},{"$f":"SUM(AD5,AF5)","v":14303.487756130655},{"$f":"'Planilha 1'!AH5","v":"INSS"},{"$f":"'Planilha 1'!AI5","v":1.779E-2},{"$f":"'Planilha 1'!AJ5","v":1.7399999999999999E-2},{"$f":"'Planilha 1'!AK5","v":"Flex 1"},{"$f":"'Planilha 1'!AL5","v":"INSS RfnPort Tx1,779%~1,740% Flex1"},null,null,null,{"$f":"'Planilha 1'!AP5","v":"SIAPE"},{"$f":"'Planilha 1'!AQ5","v":1.7979999999999999E-2},{"$f":"'Planilha 1'!AR5","v":1.7499999999999998E-2},{"$f":"'Planilha 1'!AS5","v":"Flex 1"},{"$f":"'Planilha 1'!AT5","v":"SIAPE RfnPort Tx1.798 ~ 1.75 Flex 1 Web"}]
[null,null,null,null,null,null,null,null,null,null,"Observação",null,"Tabela",null,"Val Fin Novo","Troco",null,null,null,null,"Ticket Min",{"$f":"'Planilha 1'!V6","v":2000},0,"INSS",1.7389999999999999E-2,1.7000000000000001E-2,"Flex 2","INSS RfnPort Tx1,739%~1,700% Flex2",{"$f":"(1+MIN(Y6,$V$2))^(1/30)","v":1.0005203285932471},12195.164292716507,86.840907176081586,2108.3234634141481,14303.487756130655,{"$f":"'Planilha 1'!AH6","v":"INSS"},{"$f":"'Planilha 1'!AI6","v":1.7389999999999999E-2},{"$f":"'Planilha 1'!AJ6","v":1.7000000000000001E-2},{"$f":"'Planilha 1'!AK6","v":"Flex 2"},{"$f":"'Planilha 1'!AL6","v":"INSS RfnPort Tx1,739%~1,700% Flex2"},null,null,null,{"$f":"'Planilha 1'!AP6","v":"SIAPE"},{"$f":"'Planilha 1'!AQ6","v":1.7489999999999999E-2},{"$f":"'Planilha 1'!AR6","v":1.6999999999999998E-2},{"$f":"'Planilha 1'!AS6","v":"Flex 2"},{"$f":"'Planilha 1'!AT6","v":"SIAPE RfnPort Tx1.749 ~ 1.70 Flex 2 Web"}]
[null,null,null,null,null,null,null,"Data Saldo",{"$f":"'Simulador Port'!C7","v":"2025-09-30"},{"$f":"TODAY()","v":"2025-09-30"},{"$f":"'Simulador Port'!D7","v":0},null,null,null,null,null,null,null,null,null,null,null,0,"INSS",1.6990000000000002E-2,1.6500000000000001E-2,"Flex 3","INSS RfnPort Tx1,699%~1,650% Flex3",1.0005203285932471,12195.164292716507,86.840907176081586,2108.3234634141481,14303.487756130655,{"$f":"'Planilha 1'!AH7","v":"INSS"},{"$f":"'Planilha 1'!AI7","v":1.6990000000000002E-2},{"$f":"'Planilha 1'!AJ7","v":1.6500000000000001E-2},{"$f":"'Planilha 1'!AK7","v":"Flex 3"},{"$f":"'Planilha 1'!AL7","v":"INSS RfnPort Tx1,699%~1,650% Flex3"},null,null,null,{"$f":"'Planilha 1'!AP7","v":"SIAPE"},{"$f":"'Planilha 1'!AQ7","v":1.6990000000000002E-2},{"$f":"'Planilha 1'!AR7","v":1.6500000000000001E-2},{"$f":"'Planilha 1'!AS7","v":"Flex 3"},{"$f":"'Planilha 1'!AT7","v":"SIAPE RfnPort Tx1.699 ~ 1.65 Flex 3 Web"}]
[null,null,null,null,null,null,null,"Saldo Portado",{"$f":"'Simulador Port'!C8","v":10000},{"$f":"SUM(PZO!J35:J131)","v":9999.9999221262769},{"$f":"T8","v":""},1,{"$f":"IFERROR(VLOOKUP(L8,$W$4:$AF$15,6,0),\"\")","v":"INSS RfnPort Tx1,599%~1,550% Flex5"},null,{"$f":"IFERROR(VLOOKUP(L8,$W$4:$AF$15,8,0),\"\")","v":12195.164292716507},{"$f":"IFERROR(VLOOKUP(L8,$W$4:$AF$15,10,0),\"\")","v":2108.3234634141481},null,{"$f":"O8-$I$8","v":2195.1642927165067},null,{"$f":"IF(OR((J17-I17)/I17>2%,(J17-I17)/I17<-2%),\"Saldo e Parcela não correspondem à taxa informada\",\"\")","v":""},"TAXA TROCO",null,0,"INSS",1.6490000000000001E-2,1.6E-2,"Flex 4","INSS RfnPort Tx1,649%~1,600% Flex4",1.0005203285932471,12195.164292716507,86.840907176081586,2108.3234634141481,14303.487756130655,{"$f":"'Planilha 1'!AH8","v":"INSS"},{"$f":"'Planilha 1'!AI8","v":1.6490000000000001E-2},{"$f":"'Planilha 1'!AJ8","v":1.6E-2},{"$f":"'Planilha 1'!AK8","v":"Flex 4"},{"$f":"'Planilha 1'!AL8","v":"INSS RfnPort Tx1,649%~1,600% Flex4"}]
[null,null,null,null,null,null,null,"Valor Parcela",{"$f":"'Simulador Port'!C22","v":250},{"$f":"I9","v":250},{"$f":"'Simulador Port'!D9","v":0},{"$f":"L8+1","v":2},{"$f":"IFERROR(VLOOKUP(L9,$W$4:$AF$15,6,0),\"\")","v":""},null,{"$f":"IFERROR(VLOOKUP(L9,$W$4:$AF$15,8,0),\"\")","v":""},{"$f":"IFERROR(VLOOKUP(L9,$W$4:$AF$15,10,0),\"\")","v":""},null,{"$f":"O9-$I$8","v":{"$error":"#VALUE!"}},null,null,null,null,1,"INSS",1.5990000000000001E-2,1.55E-2,"Flex 5","INSS RfnPort Tx1,599%~1,550% Flex5",1.0005203285932471,12195.164292716507,86.840907176081586,2108.3234634141481,14303.487756130655,{"$f":"'Planilha 1'!AH9","v":"INSS"},{"$f":"'Planilha 1'!AI9","v":1.5990000000000001E-2},{"$f":"'Planilha 1'!AJ9","v":1.55E-2},{"$f":"'Planilha 1'!AK9","v":"Flex 5"},{"$f":"'Planilha 1'!AL9","v":"INSS RfnPort Tx1,599%~1,550% Flex5"}]
[null,null,null,null,null,null,null,"Nº de Parcelas Restantes",{"$f":"'Simulador Port'!C21","v":60},{"$f":"I10","v":60},{"$f":"T10","v":""},{"$f":"L9+1","v":3},"",null,"","",null,{"$error":"#VALUE!"},null,{"$f":"IF(P3-J10<12,\"Contrato com menos de 12 parcelas pagas\",\"\")","v":""},null,null,0,0,0,0,0,0,1,{"$error":"#N/A"},{"$error":"#N/A"},{"$error":"#N/A"},{"$error":"#N/A"},{"$f":"'Planilha 1'!AH10","v":0},{"$f":"'Planilha 1'!AI10","v":0},{"$f":"'Planilha 1'!AJ10","v":0},{"$f":"'Planilha 1'!AK10","v":0},{"$f":"'Planilha 1'!AL10","v":0}]
[null,null,null,null,null,null,null,null,null,null,null,4,"",null,"","",null,{"$error":"#VALUE!"},null,null,null,null,0,0,0,0,0,0,1,{"$error":"#N/A"},{"$error":"#N/A"},{"$error":"#N/A"},{"$error":"#N/A"},{"$f":"'Planilha 1'!AH11","v":0},{"$f":"'Planilha 1'!AI11","v":0},{"$f":"'Planilha 1'!AJ11","v":0},{"$f":"'Planilha 1'!AK11","v":0},{"$f":"'Planilha 1'!AL11","v":0}]
[null,null,null,null,null,null,null,null,null,null,null,5,"",null,"","",null,{"$error":"#VALUE!"},null,null,null,null,0,0,0,0,0,0,1,{"$error":"#N/A"},{"$error":"#N/A"},{"$error":"#N/A"},{"$error":"#N/A"},{"$f":"'Planilha 1'!AH12","v":0},{"$f":"'Planilha 1'!AI12","v":0},{"$f":"'Planilha 1'!AJ12","v":0},{"$f":"'Planilha 1'!AK12","v":0},{"$f":"'Planilha 1'!AL12","v":0},null,null,null,null,null,null,null,null,null,null,";"]
[null,null,null,null,null,null,null,null,null,null,null,6,"",null,"","",null,{"$error":"#VALUE!"},null,null,null,null,0,0,0,0,0,0,1,{"$error":"#N/A"},{"$error":"#N/A"},{"$error":"#N/A"},{"$error":"#N/A"},{"$f":"'Planilha 1'!AH13","v":0},{"$f":"'Planilha 1'!AI13","v":0},{"$f":"'Planilha 1'!AJ13","v":0},{"$f":"'Planilha 1'!AK13","v":0},{"$f":"'Planilha 1'!AL13","v":0}]
[null,null,null,null,null,null,null,null,null,null,null,7,"",null,"","",null,{"$error":"#VALUE!"},null,null,null,null,0,0,0,0,0,0,1,{"$error":"#N/A"},{"$error":"#N/A"},{"$error":"#N/A"},{"$error":"#N/A"}]
[null,null,null,null,null,null,null,null,null,null,null,8,"",null,"","",null,{"$error":"#VALUE!"},null,null,null,null,0,0,0,0,0,0,1,{"$error":"#N/A"},{"$error":"#N/A"},{"$error":"#N/A"},{"$error":"#N/A"}]
[null,null,null,null,null,null,null,null,null,{"$f":"(1+XIRR(PZO!$I$35:$I$131,PZO!$H$35:$H$131))^(30/365)-1","v":1.4065127144978096E-2},null,9,"",null,"","",null,{"$error":"#VALUE!"}]
[null,null,null,null,null,null,null,"Taxa de Juros",{"$f":"J17","v":1.4065127144978096E-2},{"$f":"(1+XIRR(PZO!$I$35:$I$131,PZO!$H$35:$H$131))^(360/365)^(30/360)-1","v":1.4065127144978096E-2},{"$f":"T17","v":""},10,"",null,"","",null,{"$error":"#VALUE!"},null,{"$f":"IF(J17<PZO!Y1,\"Taxa original inferior a mínima\",\"\")","v":""}]
[null,null,null,null,null,null,null,"Saldo Calculado pela Taxa",{"$f":"SUM(PZO!K36:K131)","v":9999.9999221262769},{"$f":"SUM(J36:J131)","v":9999.9999221262769},{"$f":"'Simulador Port'!F20","v":0},11,"",null,"","",null,null,null,null,null,null,null,null,null,{"$f":"IFERROR(VLOOKUP(M8,PZO!$AB$4:$AG$15,3,0),\"\")","v":""},null,null,null,null,null,null,null,null,null,null,null,null,null,null,null,null,null,null,null,null,null,null,null,null,null,null,null,null,null,null,null,null,null,null,null,null,"saldo",14510.8716191106]
[null,null,null,null,null,null,null,null,null,null,null,12,"",null,"",""]
[]
[null,null,null,null,null,null,null,null,null,null,null,null,null,null,null,null,null,null,null,null,null,null,null,null,null,null,null,null,null,null,null,null,null,null,null,null,null,null,null,null,null,null,null,null,null,null,null,null,null,null,null,null,null,null,null,null,null,null,null,null,null,null,null,{"$f":"BL32*1000","v":15.033092538494941}]
[null,null,null,null,null,null,null,"Taxa AP considerando base 365",{"$f":"J16","v":1.4065127144978096E-2},null,null,null,null,null,null,null,null,null,null,null,null,null,null,null,null,null,null,{"$f":"IFERROR(VLOOKUP(M8,PZO!$AB$4:$AG$15,3,0),\"\")","v":""},null,null,null,null,null,null,null,null,null,null,null,null,null,null,null,null,null,null,null,null,null,null,null,null,null,null,null,null,null,null,null,null,null,null,null,{"$f":"1.55%*1000","v":15.5},{"$f":"BL22-BL21","v":0.46690746150505902}]
[null,null,null,null,null,null,null,"Taxa CET da PORT",{"$f":"J17","v":1.4065127144978096E-2}]
[]
[null,null,null,null,null,null,null,null,null,null,";"]
[null,null,null,null,null,null,null,null,null,null,null,null,null,null,null,null,null,null,null,null,null,null,null,null,null,null,null,null,null,null,null,null,null,null,null,null,null,null,null,null,null,null,null,null,null,null,null,null,null,null,null,null,null,null,null,null,null,null,null,null,null,"SEM MUDA PRAZO","SOMAR 1 PARCELA","SOMAR 2 PARCELAS","TIRAR 1 PARCELA","TIRAR 2 PARCELAS"]
[null,null,null,null,null,null,null,null,null,null,null,null,null,null,null,null,null,null,null,null,null,null,null,null,null,null,null,null,null,null,null,null,null,null,null,null,null,null,null,null,null,null,null,null,null,{"$f":"XIRR(AU$35:AU$131,$H$35:$H$131)","v":1.9681409001350403E-2},1.9681409001350403E-2,1.9681409001350403E-2,1.9681409001350403E-2,1.9681409001350403E-2,1.9681409001350403E-2,{"$error":"#N/A"},{"$error":"#N/A"},{"$error":"#N/A"},{"$error":"#N/A"},{"$error":"#N/A"},{"$error":"#N/A"},null,null,null,null,{"$f":"IF(K17<>\"\",\"Taxa original inferior a mínima\",\"\")","v":""},{"$f":"IF(BK32<PZO!$Y$1,\"Taxa original inferior a mínima\",\"\")","v":""},{"$f":"IF(BL32<PZO!$Y$1,\"Taxa original inferior a mínima\",\"\")","v":""},{"$f":"IF(BM32<PZO!$Y$1,\"Taxa original inferior a mínima\",\"\")","v":""},{"$f":"IF(BN32<PZO!$Y$1,\"Taxa original inferior a mínima\",\"\")","v":"Taxa original inferior a mínima"}]
[null,null,null,null,null,null,null,null,null,null,null,null,null,null,null,null,null,null,null,null,null,null,null,null,null,null,null,null,null,null,null,null,null,{"$f":"U32-$J$8","v":2195.1643705902297},{"$f":"V32-$J$8","v":2195.1643705902297},2195.1643705902297,2195.1643705902297,2195.1643705902297,2195.1643705902297,{"$error":"#N/A"},{"$error":"#N/A"},{"$error":"#N/A"},{"$error":"#N/A"},{"$error":"#N/A"},{"$error":"#N/A"}]
[null,null,null,null,null,null,null,null,null,null,null,null,null,null,null,null,null,null,null,"Taxa REFIN",{"$f":"VLOOKUP(U34,$AA$4:$AC$15,3,0)","v":1.0005203285932471},{"$f":"VLOOKUP(V34,$AA$4:$AC$15,3,0)","v":1.0005203285932471},{"$f":"VLOOKUP(W34,$AA$4:$AC$15,3,0)","v":1.0005203285932471},{"$f":"VLOOKUP(X34,$AA$4:$AC$15,3,0)","v":1.0005203285932471},1.0005203285932471,1.0005203285932471,{"$error":"#N/A"},{"$error":"#N/A"},{"$error":"#N/A"},{"$error":"#N/A"},{"$error":"#N/A"},{"$error":"#N/A"},null,{"$f":"SUM(AH35:AH131)","v":86.840907176081586},{"$f":"SUM(AI35:AI131)","v":86.840907176081586},86.840907176081586,86.840907176081586,86.840907176081586,86.840907176081586,{"$error":"#N/A"},{"$error":"#N/A"},{"$error":"#N/A"},{"$error":"#N/A"},{"$error":"#N/A"},{"$error":"#N/A"},null,{"$f":"(1+AT27)^(30/365)-1","v":1.6032208597900333E-3},1.6032208597900333E-3,1.6032208597900333E-3,1.6032208597900333E-3,1.6032208597900333E-3,1.6032208597900333E-3,{"$error":"#N/A"},{"$error":"#N/A"},{"$error":"#N/A"},{"$error":"#N/A"},{"$error":"#N/A"},{"$error":"#N/A"}]
[null,null,null,null,null,null,null,"dt ini fx pmt",{"$f":"EDATE(J31,-1)","v":"2025-10-07"},{"$f":"NETWORKDAYS(EOMONTH(I7,-1)+1,I7,$A$34:$A$1297)","v":22},null,null,null,null,null,null,null,null,null,null,null,null,null,null,null,null,null,null,null,null,null,null,null,null,null,null,null,null,null,null,null,null,null,null,null,null,null,null,null,null,null,null,null,null,null,null,null,null,null,null,null,"dt ini fx pmt",{"$f":"I30","v":"2025-10-07"}]
[null,null,null,null,null,null,null,"Prox Vencimento",null,{"$f":"'Planilha 1'!J31","v":"2025-11-07"},null,null,null,null,null,null,null,null,null,null,{"$f":"U32-$I$8","v":2195.1642927165067},{"$f":"V32-$I$8","v":2195.1642927165067},2195.1642927165067,2195.1642927165067,2195.1642927165067,2195.1642927165067,{"$error":"#N/A"},{"$error":"#N/A"},{"$error":"#N/A"},{"$error":"#N/A"},{"$f":"AE32-$I$8","v":{"$error":"#N/A"}},{"$error":"#N/A"},null,null,null,null,null,null,null,null,null,null,null,null,null,null,null,null,null,null,null,null,null,null,null,null,null,null,null,null,null,"Prox Vencimento",null,{"$f":"J31","v":"2025-11-07"}]
[null,null,null,null,null,null,null,"Fator Dia",{"$f":"(1+I17)^(1/30)","v":1.0004656794303521},{"$f":"(1+J17)^(1/30)","v":1.0004656794303521},null,null,null,null,null,null,null,null,null,"Vlr Troco",{"$f":"SUM(U36:U131)","v":12195.164292716507},{"$f":"SUM(V36:V131)","v":12195.164292716507},{"$f":"SUM(W36:W131)","v":12195.164292716507},{"$f":"SUM(X36:X131)","v":12195.164292716507},12195.164292716507,12195.164292716507,{"$error":"#N/A"},{"$error":"#N/A"},{"$error":"#N/A"},{"$error":"#N/A"},{"$error":"#N/A"},{"$error":"#N/A"},null,null,null,null,null,null,null,null,null,null,null,null,null,null,null,null,null,null,null,null,null,null,null,null,null,null,null,null,null,"XITR",{"$f":"(1+XIRR(PZO!BK$35:BK$131,PZO!$BJ$35:$BJ$131))^(30/360)-1","v":1.4656441559752986E-2},{"$f":"(1+XIRR(PZO!BL$35:BL$131,PZO!$BJ$35:$BJ$131))^(30/360)-1","v":1.5033092538494941E-2},{"$f":"(1+XIRR(PZO!BM$35:BM$131,PZO!$BJ$35:$BJ$131))^(30/360)-1","v":1.3848076105671847E-2},{"$f":"(1+XIRR(PZO!BN$35:BN$131,PZO!$BJ$35:$BJ$131))^(30/360)-1","v":1.3414094797118858E-2}]
["Data","Dia da Semana","Feriado",null,null,null,null,"OPERAÇÃO ORIGINAL",null,null,null,null,null,null,null,null,null,null,null,"REFINANCIAMENTO",null,null,null,null,null,null,null,null,null,null,null,null,null,"IOF",null,null,null,null,null,null,null,null,null,null,null,null,"REFINANCIAMENTO",null,null,null,null,null,null,null,null,null,null,null,null,null,null,"OPERAÇÃO ORIGINAL"]
["2001-01-01","segunda-feira","Confraternização Universal",null,null,null,null,"DATA EV","FLUXO","Principal","Principal2","IOF",null,null,null,null,null,null,null,"FX Refin","Normal","Flex 1","Flex 2","Flex 3","Flex 4","Flex 5","Flex 6","Flex 7","Flex 8","Flex 9","Flex 10","Flex 11",null,"Normal","Flex 1","Flex 2","Flex 3","Flex 4","Flex 5","Flex 6","Flex 7","Flex 8","Flex 9","Flex 10","Flex 11",null,"Normal","Flex 1","Flex 2","Flex 3","Flex 4","Flex 5","Flex 6","Flex 7","Flex 8","Flex 9","Flex 10","Flex 11",null,null,null,"DATA EV","FLUXO1","FLUXO2","FLUXO3","FLUXO4"]
["2001-02-26","segunda-feira","Carnaval",null,null,null,0,{"$f":"I7","v":"2025-09-30"},{"$f":"-I8","v":-10000},null,null,{"$f":"I35*-0.38%","v":38},null,null,null,null,null,null,null,{"$f":"I35","v":-10000},null,null,null,null,null,null,null,null,null,null,null,null,null,{"$f":"(U31)*$B$2","v":8.3416243123227254},{"$f":"(V31)*$B$2","v":8.3416243123227254},8.3416243123227254,8.3416243123227254,8.3416243123227254,8.3416243123227254,{"$error":"#N/A"},{"$error":"#N/A"},{"$error":"#N/A"},{"$error":"#N/A"},{"$error":"#N/A"},{"$error":"#N/A"},null,{"$f":"-U32+$I$35","v":-22195.164292716508},{"$f":"-V32+$I$35","v":-22195.164292716508},-22195.164292716508,-22195.164292716508,-22195.164292716508,-22195.164292716508,{"$error":"#N/A"},{"$error":"#N/A"},{"$error":"#N/A"},{"$error":"#N/A"},{"$error":"#N/A"},{"$error":"#N/A"},null,null,0,{"$f":"H35","v":"2025-09-30"},{"$f":"I35","v":-10000},{"$f":"BK35","v":-10000},{"$f":"BL35","v":-10000},{"$f":"BM35","v":-10000}]
["2001-02-27","terça-feira","Carnaval",null,null,{"$f":"H36-$H$35","v":38},1,{"$f":"J31","v":"2025-11-07"},{"$f":"IF($G36>$I$10,0,$I$9)","v":250},{"$f":"I36/($J$32^(H36-$H$35))","v":245.61596998293012},{"$f":"I36/($I$32^(H36-$H$35))","v":245.61596998293012},{"$f":"J36*0.0082%*MIN(F36,365)","v":0.76533936246681022},null,null,null,null,null,null,1,{"$f":"IF($G36>$P$3,0,$J$9)","v":250},{"$f":"$T36/((U$29)^($H36-$H$35))","v":245.10668717808329},{"$f":"$T36/((V$29)^($H36-$H$35))","v":245.10668717808329},245.10668717808329,245.10668717808329,245.10668717808329,245.10668717808329,{"$error":"#N/A"},{"$error":"#N/A"},{"$error":"#N/A"},{"$error":"#N/A"},{"$error":"#N/A"},{"$error":"#N/A"},null,{"$f":"IF($I36<>0,0,U36*$B$1*MIN($F36,365))","v":0},{"$f":"IF($I36<>0,0,V36*$B$1*MIN($F36,365))","v":0},0,0,0,0,0,0,0,0,0,0,null,{"$f":"$T36","v":250},250,250,250,250,250,250,250,250,250,250,250,null,{"$f":"BJ36-$H$35","v":38},1,{"$f":"BL31","v":"2025-11-07"},{"$f":"I36","v":250},{"$f":"BK36","v":250},{"$f":"I37","v":250},{"$f":"BM37","v":250}]
["2001-04-13","sexta-feira","Paixão de Cristo",null,null,{"$f":"H37-$H$35","v":68},{"$f":"G36+1","v":2},{"$f":"EDATE(H36,1)","v":"2025-12-07"},{"$f":"IF($G37>$I$10,0,$I$9)","v":250},{"$f":"I37/($J$32^(H37-$H$35))","v":242.20926586287629},242.20926586287629,{"$f":"J37*0.0082%*MIN(F37,365)","v":1.3505588664513983},null,null,null,null,null,null,{"$f":"S36+1","v":2},250,241.31129380919162,241.31129380919162,241.31129380919162,241.31129380919162,241.31129380919162,241.31129380919162,{"$error":"#N/A"},{"$error":"#N/A"},{"$error":"#N/A"},{"$error":"#N/A"},{"$error":"#N/A"},{"$error":"#N/A"},null,0,0,0,0,0,0,0,0,0,0,0,0,null,250,250,250,250,250,250,250,250,250,250,250,250,null,{"$f":"BJ37-$H$35","v":68},{"$f":"BI36+1","v":2},{"$f":"EDATE(BJ36,1)","v":"2025-12-07"},{"$f":"I36","v":250},{"$f":"BK36","v":250},{"$f":"I38","v":250},{"$f":"BM38","v":250}]
["2001-04-21","sábado","Tiradentes",null,null,99,{"$f":"G37+1","v":3},{"$f":"EDATE(H37,1)","v":"2026-01-07"},{"$f":"IF($G38>$I$10,0,$I$9)","v":250},238.73863720364145,238.73863720364145,1.9380802568191613,null,null,null,null,null,null,3,250,237.45111820452877,237.45111820452877,237.45111820452877,237.45111820452877,237.45111820452877,237.45111820452877,{"$error":"#N/A"},{"$error":"#N/A"},{"$error":"#N/A"},{"$error":"#N/A"},{"$error":"#N/A"},{"$error":"#N/A"},null,0,0,0,0,0,0,0,0,0,0,0,0,null,250,250,250,250,250,250,250,250,250,250,250,250,null,99,{"$f":"BI37+1","v":3},{"$f":"EDATE(BJ37,1)","v":"2026-01-07"},{"$f":"I37","v":250},{"$f":"BK37","v":250},250,250]
["2001-05-01","terça-feira","Dia do Trabalho",null,null,130,4,"2026-02-07",{"$f":"IF($G39>$I$10,0,$I$9)","v":250},235.31773935568407,235.31773935568407,2.5084871015315922,null,null,null,null,null,null,4,250,233.65269253068604,233.65269253068604,233.65269253068604,233.65269253068604,233.65269253068604,233.65269253068604,{"$error":"#N/A"},{"$error":"#N/A"},{"$error":"#N/A"},{"$error":"#N/A"},{"$error":"#N/A"},{"$error":"#N/A"},null,0,0,0,0,0,0,0,0,0,0,0,0,null,250,250,250,250,250,250,250,250,250,250,250,250,null,130,4,"2026-02-07",250,250,250,250]
["2001-06-14","quinta-feira","Corpus Christi",null,null,158,5,"2026-03-07",250,232.27004789211759,232.27004789211759,3.0092907404902758,null,null,null,null,null,null,5,250,230.27410986084527,230.27410986084527,230.27410986084527,230.27410986084527,230.27410986084527,230.27410986084527,{"$error":"#N/A"},{"$error":"#N/A"},{"$error":"#N/A"},{"$error":"#N/A"},{"$error":"#N/A"},{"$error":"#N/A"},null,0,0,0,0,0,0,0,0,0,0,0,0,null,250,250,250,250,250,250,250,250,250,250,250,250,null,158,5,"2026-03-07",250,250,250,250]
["2001-09-07","sexta-feira","Independência do Brasil",null,null,189,6,"2026-04-07",250,228.94183878325293,228.94183878325293,3.5481406174628538,null,null,null,null,null,null,6,250,226.59049237556846,226.59049237556846,226.59049237556846,226.59049237556846,226.59049237556846,226.59049237556846,{"$error":"#N/A"},{"$error":"#N/A"},{"$error":"#N/A"},{"$error":"#N/A"},{"$error":"#N/A"},{"$error":"#N/A"},null,0,0,0,0,0,0,0,0,0,0,0,0,null,250,250,250,250,250,250,250,250,250,250,250,250,null,189,6,"2026-04-07",250,250,250,250]
["2001-10-12","sexta-feira","Nossa Sr.a Aparecida - Padroeira do Brasil",null,null,219,7,"2026-05-07",250,225.76640558365358,225.76640558365358,4.0543131114712514,null,null,null,null,null,null,7,250,223.08181596156564,223.08181596156564,223.08181596156564,223.08181596156564,223.08181596156564,223.08181596156564,{"$error":"#N/A"},{"$error":"#N/A"},{"$error":"#N/A"},{"$error":"#N/A"},{"$error":"#N/A"},{"$error":"#N/A"},null,0,0,0,0,0,0,0,0,0,0,0,0,null,250,250,250,250,250,250,250,250,250,250,250,250,null,219,7,"2026-05-07",250,250,250,250]
["2001-11-02","sexta-feira","Finados",null,null,250,8,"2026-06-07",250,222.53138749002423,222.53138749002423,4.5618934435454968,null,null,null,null,null,null,8,250,219.51325118274659,219.51325118274659,219.51325118274659,219.51325118274659,219.51325118274659,219.51325118274659,{"$error":"#N/A"},{"$error":"#N/A"},{"$error":"#N/A"},{"$error":"#N/A"},{"$error":"#N/A"},{"$error":"#N/A"},null,0,0,0,0,0,0,0,0,0,0,0,0,null,250,250,250,250,250,250,250,250,250,250,250,250,null,250,8,"2026-06-07",250,250,250,250]
["2001-11-15","quinta-feira","Proclamação da República",null,null,280,9,"2026-07-07",250,219.44486752694431,219.44486752694431,5.0384541584186406,null,null,null,null,null,null,9,250,216.11416343236814,216.11416343236814,216.11416343236814,216.11416343236814,216.11416343236814,216.11416343236814,{"$error":"#N/A"},{"$error":"#N/A"},{"$error":"#N/A"},{"$error":"#N/A"},{"$error":"#N/A"},{"$error":"#N/A"},null,0,0,0,0,0,0,0,0,0,0,0,0,null,250,250,250,250,250,250,250,250,250,250,250,250,null,280,9,"2026-07-07",250,250,250,250]
["2001-12-25","terça-feira","Natal",null,null,311,10,"2026-08-07",250,216.30043106763807,216.30043106763807,5.5160935930869064,null,null,null,null,null,null,10,250,212.65705784756531,212.65705784756531,212.65705784756531,212.65705784756531,212.65705784756531,212.65705784756531,{"$error":"#N/A"},{"$error":"#N/A"},{"$error":"#N/A"},{"$error":"#N/A"},{"$error":"#N/A"},{"$error":"#N/A"},null,0,0,0,0,0,0,0,0,0,0,0,0,null,250,250,250,250,250,250,250,250,250,250,250,250,null,311,10,"2026-08-07",250,250,250,250]
["2002-01-01","terça-feira","Confraternização Universal",null,null,342,11,"2026-09-07",250,213.20105139529633,213.20105139529633,5.9790102853296911,null,null,null,null,null,null,11,250,209.25525441804302,209.25525441804302,209.25525441804302,209.25525441804302,209.25525441804302,209.25525441804302,{"$error":"#N/A"},{"$error":"#N/A"},{"$error":"#N/A"},{"$error":"#N/A"},{"$error":"#N/A"},{"$error":"#N/A"},null,0,0,0,0,0,0,0,0,0,0,0,0,null,250,250,250,250,250,250,250,250,250,250,250,250,null,342,11,"2026-09-07",250,250,250,250]
["2002-02-11","segunda-feira","Carnaval",null,null,372,12,"2026-10-07",250,210.2439435971404,210.2439435971404,6.2926012318624123,null,null,null,null,null,null,12,250,206.01500824537561,206.01500824537561,206.01500824537561,206.01500824537561,206.01500824537561,206.01500824537561,{"$error":"#N/A"},{"$error":"#N/A"},{"$error":"#N/A"},{"$error":"#N/A"},{"$error":"#N/A"},{"$error":"#N/A"},null,0,0,0,0,0,0,0,0,0,0,0,0,null,250,250,250,250,250,250,250,250,250,250,250,250,null,372,12,"2026-10-07",250,250,250,250]
["2002-02-12","terça-feira","Carnaval",null,null,403,13,"2026-11-07",250,207.2313476360433,207.2313476360433,6.202434234746776,null,null,null,null,null,null,13,250,202.7194554493592,202.7194554493592,202.7194554493592,202.7194554493592,202.7194554493592,202.7194554493592,{"$error":"#N/A"},{"$error":"#N/A"},{"$error":"#N/A"},{"$error":"#N/A"},{"$error":"#N/A"},{"$error":"#N/A"},null,0,0,0,0,0,0,0,0,0,0,0,0,null,250,250,250,250,250,250,250,250,250,250,250,250,null,403,13,"2026-11-07",250,250,250,250]
["2002-03-29","sexta-feira","Paixão de Cristo",null,null,433,14,"2026-12-07",250,204.35703988705987,204.35703988705987,6.1164062038197011,null,null,null,null,null,null,14,250,199.58041389232969,199.58041389232969,199.58041389232969,199.58041389232969,199.58041389232969,199.58041389232969,{"$error":"#N/A"},{"$error":"#N/A"},{"$error":"#N/A"},{"$error":"#N/A"},{"$error":"#N/A"},{"$error":"#N/A"},null,0,0,0,0,0,0,0,0,0,0,0,0,null,250,250,250,250,250,250,250,250,250,250,250,250,null,433,14,"2026-12-07",250,250,250,250]
["2002-04-21","domingo","Tiradentes",null,null,464,15,"2027-01-07",250,201.4287976630404,201.4287976630404,6.0287639140547995,null,null,null,null,null,null,15,250,196.3877931379738,196.3877931379738,196.3877931379738,196.3877931379738,196.3877931379738,196.3877931379738,{"$error":"#N/A"},{"$error":"#N/A"},{"$error":"#N/A"},{"$error":"#N/A"},{"$error":"#N/A"},{"$error":"#N/A"},null,0,0,0,0,0,0,0,0,0,0,0,0,null,250,250,250,250,250,250,250,250,250,250,250,250,null,464,15,"2027-01-07",250,250,250,250]
["2002-05-01","quarta-feira","Dia do Trabalho",null,null,495,16,"2027-02-07",250,198.54251436799777,198.54251436799777,5.9423774550341735,null,null,null,null,null,null,16,250,193.24624366402247,193.24624366402247,193.24624366402247,193.24624366402247,193.24624366402247,193.24624366402247,{"$error":"#N/A"},{"$error":"#N/A"},{"$error":"#N/A"},{"$error":"#N/A"},{"$error":"#N/A"},{"$error":"#N/A"},null,0,0,0,0,0,0,0,0,0,0,0,0,null,250,250,250,250,250,250,250,250,250,250,250,250,null,495,16,"2027-02-07",250,250,250,250]
["2002-05-30","quinta-feira","Corpus Christi",null,null,523,17,"2027-03-07",250,195.97111313045747,195.97111313045747,5.8654154159945922,null,null,null,null,null,null,17,250,{"$f":"$T52/((U$29)^($H52-$H$35))","v":190.45193214642964},190.45193214642964,190.45193214642964,190.45193214642964,190.45193214642964,190.45193214642964,{"$error":"#N/A"},{"$error":"#N/A"},{"$error":"#N/A"},{"$error":"#N/A"},{"$error":"#N/A"},{"$error":"#N/A"},null,0,0,0,0,0,0,0,0,0,0,0,0,null,{"$f":"$T52","v":250},250,250,250,250,250,250,250,250,250,250,250,null,523,17,"2027-03-07",250,250,250,250]
["2002-09-07","sábado","Independência do Brasil",null,null,554,18,"2027-04-07",250,193.16303326947568,193.16303326947568,5.7813695857554075,null,null,null,null,null,null,18,250,187.40533664429836,187.40533664429836,187.40533664429836,187.40533664429836,187.40533664429836,187.40533664429836,{"$error":"#N/A"},{"$error":"#N/A"},{"$error":"#N/A"},{"$error":"#N/A"},{"$error":"#N/A"},{"$error":"#N/A"},null,0,0,0,0,0,0,0,0,0,0,0,0,null,250,250,250,250,250,250,250,250,250,250,250,250,null,554,18,"2027-04-07",250,250,250,250]
["2002-10-12","sábado","Nossa Sr.a Aparecida - Padroeira do Brasil",null,null,584,19,"2027-05-07",250,190.48385364883882,190.48385364883882,5.701181739709746,null,null,null,null,null,null,19,250,184.50342898856022,184.50342898856022,184.50342898856022,184.50342898856022,184.50342898856022,184.50342898856022,{"$error":"#N/A"},{"$error":"#N/A"},{"$error":"#N/A"},{"$error":"#N/A"},{"$error":"#N/A"},{"$error":"#N/A"},null,0,0,0,0,0,0,0,0,0,0,0,0,null,250,250,250,250,250,250,250,250,250,250,250,250,null,584,19,"2027-05-07",250,250,250,250]
["2002-11-02","sábado","Finados",null,null,615,20,"2027-06-07",250,187.75440100283876,187.75440100283876,5.6194892220149644,null,null,null,null,null,null,20,250,181.55198969073172,181.55198969073172,181.55198969073172,181.55198969073172,181.55198969073172,181.55198969073172,{"$error":"#N/A"},{"$error":"#N/A"},{"$error":"#N/A"},{"$error":"#N/A"},{"$error":"#N/A"},{"$error":"#N/A"},null,0,0,0,0,0,0,0,0,0,0,0,0,null,250,250,250,250,250,250,250,250,250,250,250,250,null,615,20,"2027-06-07",250,250,250,250]
["2002-11-15","sexta-feira","Proclamação da República",null,null,645,21,"2027-07-07",250,185.15023934552036,185.15023934552036,5.5415466636114248,null,null,null,null,null,null,21,250,178.74071911417391,178.74071911417391,178.74071911417391,178.74071911417391,178.74071911417391,178.74071911417391,{"$error":"#N/A"},{"$error":"#N/A"},{"$error":"#N/A"},{"$error":"#N/A"},{"$error":"#N/A"},{"$error":"#N/A"},null,0,0,0,0,0,0,0,0,0,0,0,0,null,250,250,250,250,250,250,250,250,250,250,250,250,null,645,21,"2027-07-07",250,250,250,250]
["2002-12-25","quarta-feira","Natal",null,null,676,22,"2027-08-07",250,182.49721232507369,182.49721232507369,5.4621415648894551,null,null,null,null,null,null,22,250,175.88146394798179,175.88146394798179,175.88146394798179,175.88146394798179,175.88146394798179,175.88146394798179,{"$error":"#N/A"},{"$error":"#N/A"},{"$error":"#N/A"},{"$error":"#N/A"},{"$error":"#N/A"},{"$error":"#N/A"},null,0,0,0,0,0,0,0,0,0,0,0,0,null,250,250,250,250,250,250,250,250,250,250,250,250,null,676,22,"2027-08-07",250,250,250,250]
["2003-01-01","quarta-feira","Confraternização Universal",null,null,707,23,"2027-09-07",250,179.88220066121582,179.88220066121582,5.3838742657901895,null,null,null,null,null,null,23,250,173.06794732500424,173.06794732500424,173.06794732500424,173.06794732500424,173.06794732500424,173.06794732500424,{"$error":"#N/A"},{"$error":"#N/A"},{"$error":"#N/A"},{"$error":"#N/A"},{"$error":"#N/A"},{"$error":"#N/A"},null,0,0,0,0,0,0,0,0,0,0,0,0,null,250,250,250,250,250,250,250,250,250,250,250,250,null,707,23,"2027-09-07",250,250,250,250]
["2003-03-03","segunda-feira","Carnaval",null,null,737,24,"2027-10-07",250,177.3872267629001,177.3872267629001,5.3091996970136002,null,null,null,null,null,null,24,250,170.38804924793632,170.38804924793632,170.38804924793632,170.38804924793632,170.38804924793632,170.38804924793632,{"$error":"#N/A"},{"$error":"#N/A"},{"$error":"#N/A"},{"$error":"#N/A"},{"$error":"#N/A"},{"$error":"#N/A"},null,0,0,0,{"$f":"IF($I59<>0,0,X59*$B$1*MIN($F59,365))","v":0},0,0,0,0,0,0,0,0,null,250,250,250,250,250,250,250,250,250,250,250,250,null,737,24,"2027-10-07",250,250,250,250]
["2003-03-04","terça-feira","Carnaval",null,null,768,25,"2027-11-07",250,174.84543633720236,174.84543633720236,5.2331239095724671,null,null,null,null,null,null,25,250,167.66240893226566,167.66240893226566,167.66240893226566,167.66240893226566,167.66240893226566,167.66240893226566,{"$error":"#N/A"},{"$error":"#N/A"},{"$error":"#N/A"},{"$error":"#N/A"},{"$error":"#N/A"},{"$error":"#N/A"},null,0,{"$f":"IF($I60<>0,0,V60*$B$1*MIN($F60,365))","v":0},{"$f":"IF($I60<>0,0,W60*$B$1*MIN($F60,365))","v":0},0,0,0,0,0,0,0,0,0,null,250,250,250,250,250,250,250,250,250,250,250,250,null,768,25,"2027-11-07",250,250,250,250]
["2003-04-18","sexta-feira","Paixão de Cristo",null,null,798,26,"2027-12-07",250,172.42032257776748,172.42032257776748,5.1605402547525809,null,null,null,null,null,null,26,250,165.06621377170035,165.06621377170035,165.06621377170035,165.06621377170035,165.06621377170035,165.06621377170035,{"$error":"#N/A"},{"$error":"#N/A"},{"$error":"#N/A"},{"$error":"#N/A"},{"$error":"#N/A"},{"$error":"#N/A"},null,0,0,0,0,0,0,0,0,0,0,0,0,null,250,250,250,250,250,250,250,250,250,250,250,250,null,798,26,"2027-12-07",250,250,250,250]
["2003-04-21","segunda-feira","Tiradentes",null,null,829,27,"2028-01-07",250,169.9497031700372,169.9497031700372,5.0865946158792132,null,null,null,null,null,null,27,250,162.42570506820215,162.42570506820215,162.42570506820215,162.42570506820215,162.42570506820215,162.42570506820215,{"$error":"#N/A"},{"$error":"#N/A"},{"$error":"#N/A"},{"$error":"#N/A"},{"$error":"#N/A"},{"$error":"#N/A"},null,0,0,0,0,0,0,0,0,0,0,0,0,null,250,250,250,250,250,250,250,250,250,250,250,250,null,829,27,"2028-01-07",250,250,250,250]
["2003-05-01","quinta-feira","Dia do Trabalho",null,null,860,28,"2028-02-07",250,167.51448539110908,167.51448539110908,5.0137085477558951,null,null,null,null,null,null,28,250,159.82743569432773,159.82743569432773,159.82743569432773,159.82743569432773,159.82743569432773,159.82743569432773,{"$error":"#N/A"},{"$error":"#N/A"},{"$error":"#N/A"},{"$error":"#N/A"},{"$error":"#N/A"},{"$error":"#N/A"},null,0,0,0,0,0,0,0,0,0,0,0,0,null,250,250,250,250,250,250,250,250,250,250,250,250,null,860,28,"2028-02-07",250,250,250,250]
["2003-06-19","quinta-feira","Corpus Christi",null,null,889,29,"2028-03-07",250,165.26797831327173,165.26797831327173,4.9464705909162232,null,null,null,null,null,null,29,250,157.43443745685519,157.43443745685519,157.43443745685519,157.43443745685519,157.43443745685519,157.43443745685519,{"$error":"#N/A"},{"$error":"#N/A"},{"$error":"#N/A"},{"$error":"#N/A"},{"$error":"#N/A"},{"$error":"#N/A"},null,0,0,0,0,0,0,0,0,0,0,0,0,null,250,250,250,250,250,250,250,250,250,250,250,250,null,889,29,"2028-03-07",250,250,250,250]
["2003-09-07","domingo","Independência do Brasil",null,null,920,30,"2028-04-07",250,162.89984520348153,162.89984520348153,4.8755923669402019,null,null,null,null,null,null,30,250,154.91601171220142,154.91601171220142,154.91601171220142,154.91601171220142,154.91601171220142,154.91601171220142,{"$error":"#N/A"},{"$error":"#N/A"},{"$error":"#N/A"},{"$error":"#N/A"},{"$error":"#N/A"},{"$error":"#N/A"},null,0,0,0,0,0,0,0,0,0,0,0,0,null,250,250,250,250,250,250,250,250,250,250,250,250,null,920,30,"2028-04-07",250,250,250,250]
["2003-10-12","domingo","Nossa Sr.a Aparecida - Padroeira do Brasil",null,null,950,31,"2028-05-07",250,160.64041730940201,160.64041730940201,4.8079676900704023,null,null,null,null,null,null,31,250,152.51719016083166,152.51719016083166,152.51719016083166,152.51719016083166,152.51719016083166,152.51719016083166,{"$error":"#N/A"},{"$error":"#N/A"},{"$error":"#N/A"},{"$error":"#N/A"},{"$error":"#N/A"},{"$error":"#N/A"},null,0,0,0,0,0,0,0,0,0,0,0,0,null,250,250,250,250,250,250,250,250,250,250,250,250,null,950,31,"2028-05-07",250,250,250,250]
["2003-11-02","domingo","Finados",null,null,981,32,"2028-06-07",250,158.33859275219817,158.33859275219817,4.7390740810732908,null,null,null,null,null,null,32,250,150.0774239673103,150.0774239673103,150.0774239673103,150.0774239673103,150.0774239673103,150.0774239673103,{"$error":"#N/A"},{"$error":"#N/A"},{"$error":"#N/A"},{"$error":"#N/A"},{"$error":"#N/A"},{"$error":"#N/A"},null,0,0,0,0,0,0,0,0,0,0,0,0,null,250,250,250,250,250,250,250,250,250,250,250,250,null,981,32,"2028-06-07",250,250,250,250]
["2003-11-15","sábado","Proclamação da República",null,null,1011,33,"2028-07-07",250,156.14242962677147,156.14242962677147,4.6733429187292703,null,null,null,null,null,null,33,250,{"$f":"$T68/((U$29)^($H68-$H$35))","v":147.75352629522425},147.75352629522425,147.75352629522425,147.75352629522425,147.75352629522425,147.75352629522425,{"$error":"#N/A"},{"$error":"#N/A"},{"$error":"#N/A"},{"$error":"#N/A"},{"$error":"#N/A"},{"$error":"#N/A"},null,{"$f":"IF($I68<>0,0,U68*$B$1*MIN($F68,365))","v":0},0,0,0,0,0,0,0,0,0,0,0,null,{"$f":"$T68","v":250},250,250,250,250,250,250,250,250,250,250,250,null,1011,33,"2028-07-07",250,250,250,250]
["2003-12-25","quinta-feira","Natal",null,null,1042,34,"2028-08-07",250,153.90505695956708,153.90505695956708,4.6063783547998423,null,null,null,null,null,null,34,250,145.38996283035496,145.38996283035496,145.38996283035496,145.38996283035496,145.38996283035496,145.38996283035496,{"$error":"#N/A"},{"$error":"#N/A"},{"$error":"#N/A"},{"$error":"#N/A"},{"$error":"#N/A"},{"$error":"#N/A"},null,0,0,0,0,0,0,0,0,0,0,0,0,null,250,250,250,250,250,250,250,250,250,250,250,250,null,1042,34,"2028-08-07",250,250,250,250]
["2004-01-01","quinta-feira","Confraternização Universal",null,null,1073,35,"2028-09-07",250,151.69974371697853,151.69974371697853,4.5403733294491673,null,null,null,null,null,null,35,250,143.06420849527458,143.06420849527458,143.06420849527458,143.06420849527458,143.06420849527458,143.06420849527458,{"$error":"#N/A"},{"$error":"#N/A"},{"$error":"#N/A"},{"$error":"#N/A"},{"$error":"#N/A"},{"$error":"#N/A"},null,0,0,0,0,0,0,0,0,0,0,0,0,null,250,250,250,250,250,250,250,250,250,250,250,250,null,1073,35,"2028-09-07",250,250,250,250]
["2004-02-23","segunda-feira","Carnaval",null,null,1103,36,"2028-10-07",250,149.59566171462481,149.59566171462481,4.4773981551187205,null,null,null,null,null,null,36,250,140.84890807038573,140.84890807038573,140.84890807038573,140.84890807038573,140.84890807038573,140.84890807038573,{"$error":"#N/A"},{"$error":"#N/A"},{"$error":"#N/A"},{"$error":"#N/A"},{"$error":"#N/A"},{"$error":"#N/A"},null,0,0,0,0,0,0,0,0,0,0,0,0,null,250,250,250,250,250,250,250,250,250,250,250,250,null,1103,36,"2028-10-07",250,250,250,250]
["2004-02-24","terça-feira","Carnaval",null,null,1134,37,"2028-11-07",250,147.45209801158327,147.45209801158327,4.4132412934866876,null,null,null,null,null,null,37,250,138.59579546096671,138.59579546096671,138.59579546096671,138.59579546096671,138.59579546096671,138.59579546096671,{"$error":"#N/A"},{"$error":"#N/A"},{"$error":"#N/A"},{"$error":"#N/A"},{"$error":"#N/A"},{"$error":"#N/A"},null,0,0,0,0,0,0,0,0,0,0,0,0,null,250,250,250,250,250,250,250,250,250,250,250,250,null,1134,37,"2028-11-07",250,250,250,250]
["2004-04-09","sexta-feira","Paixão de Cristo",null,null,1164,38,"2028-12-07",250,145.40693103876166,145.40693103876166,4.3520294459901363,null,null,null,null,null,null,38,250,136.44968688634984,136.44968688634984,136.44968688634984,136.44968688634984,136.44968688634984,136.44968688634984,{"$error":"#N/A"},{"$error":"#N/A"},{"$error":"#N/A"},{"$error":"#N/A"},{"$error":"#N/A"},{"$error":"#N/A"},null,0,0,0,0,0,0,0,0,0,0,0,0,null,250,250,250,250,250,250,250,250,250,250,250,250,null,1164,38,"2028-12-07",250,250,250,250]
["2004-04-21","quarta-feira","Tiradentes",null,null,1195,39,"2029-01-07",250,143.32338786663456,143.32338786663456,4.2896689988483727,null,null,null,null,null,null,39,250,134.26694713858217,134.26694713858217,134.26694713858217,134.26694713858217,134.26694713858217,134.26694713858217,{"$error":"#N/A"},{"$error":"#N/A"},{"$error":"#N/A"},{"$error":"#N/A"},{"$error":"#N/A"},{"$error":"#N/A"},null,0,0,0,0,0,0,0,0,0,0,0,0,null,250,250,250,250,250,250,250,250,250,250,250,250,null,1195,39,"2029-01-07",250,250,250,250]
["2004-05-01","sábado","Dia do Trabalho",null,null,1226,40,"2029-02-07",250,141.26969988861069,141.26969988861069,4.2282021176661182,null,null,null,null,null,null,40,250,132.11912394441893,132.11912394441893,132.11912394441893,132.11912394441893,132.11912394441893,132.11912394441893,{"$error":"#N/A"},{"$error":"#N/A"},{"$error":"#N/A"},{"$error":"#N/A"},{"$error":"#N/A"},{"$error":"#N/A"},null,0,0,0,0,0,0,0,0,0,0,0,0,null,250,250,250,250,250,250,250,250,250,250,250,250,null,1226,40,"2029-02-07",250,250,250,250]
["2004-06-10","quinta-feira","Corpus Christi",null,null,1254,41,"2029-03-07",250,139.44006112193722,139.44006112193722,4.1734410293795809,null,null,null,null,null,null,41,250,130.20870135232946,130.20870135232946,130.20870135232946,130.20870135232946,130.20870135232946,130.20870135232946,{"$error":"#N/A"},{"$error":"#N/A"},{"$error":"#N/A"},{"$error":"#N/A"},{"$error":"#N/A"},{"$error":"#N/A"},null,0,0,0,0,0,0,0,0,0,0,0,0,null,250,250,250,250,250,250,250,250,250,250,250,250,null,1254,41,"2029-03-07",250,250,250,250]
["2004-09-07","terça-feira","Independência do Brasil",null,null,1285,42,"2029-04-07",250,137.44201752665523,137.44201752665523,4.1136395845727911,null,null,null,null,null,null,42,250,128.12579655106254,128.12579655106254,128.12579655106254,128.12579655106254,128.12579655106254,128.12579655106254,{"$error":"#N/A"},{"$error":"#N/A"},{"$error":"#N/A"},{"$error":"#N/A"},{"$error":"#N/A"},{"$error":"#N/A"},null,0,0,0,0,0,0,0,0,0,0,0,0,null,250,250,250,250,250,250,250,250,250,250,250,250,null,1285,42,"2029-04-07",250,250,250,250]
["2004-10-12","terça-feira","Nossa Sr.a Aparecida - Padroeira do Brasil",null,null,1315,43,"2029-05-07",250,135.53569080283066,135.53569080283066,4.0565832257287218,null,null,null,null,null,null,43,250,126.14181233499521,126.14181233499521,126.14181233499521,126.14181233499521,126.14181233499521,126.14181233499521,{"$error":"#N/A"},{"$error":"#N/A"},{"$error":"#N/A"},{"$error":"#N/A"},{"$error":"#N/A"},{"$error":"#N/A"},null,0,0,0,0,0,0,0,0,0,0,0,0,null,250,250,250,250,250,250,250,250,250,250,250,250,null,1315,43,"2029-05-07",250,250,250,250]
["2004-11-02","terça-feira","Finados",null,null,1346,44,"2029-06-07",250,133.59359312471864,133.59359312471864,3.9984562422228289,null,null,null,null,null,null,44,250,124.12396418948514,124.12396418948514,124.12396418948514,124.12396418948514,124.12396418948514,124.12396418948514,{"$error":"#N/A"},{"$error":"#N/A"},{"$error":"#N/A"},{"$error":"#N/A"},{"$error":"#N/A"},{"$error":"#N/A"},null,0,0,0,0,0,0,0,0,0,0,0,0,null,250,250,250,250,250,250,250,250,250,250,250,250,null,1346,44,"2029-06-07",250,250,250,250]
["2004-11-15","segunda-feira","Proclamação da República",null,null,1376,45,"2029-07-07",250,131.74064421369138,131.74064421369138,3.9429974813157833,null,null,null,null,null,null,45,250,122.20194698126821,122.20194698126821,122.20194698126821,122.20194698126821,122.20194698126821,122.20194698126821,{"$error":"#N/A"},{"$error":"#N/A"},{"$error":"#N/A"},{"$error":"#N/A"},{"$error":"#N/A"},{"$error":"#N/A"},null,0,0,0,0,0,0,0,0,0,0,0,0,null,250,250,250,250,250,250,250,250,250,250,250,250,null,1376,45,"2029-07-07",250,250,250,250]
["2004-12-25","sábado","Natal",null,null,1407,46,"2029-08-07",250,129.85292594756629,129.85292594756629,3.8864980736106589,null,null,null,null,null,null,46,250,120.24712353669126,120.24712353669126,120.24712353669126,120.24712353669126,120.24712353669126,120.24712353669126,{"$error":"#N/A"},{"$error":"#N/A"},{"$error":"#N/A"},{"$error":"#N/A"},{"$error":"#N/A"},{"$error":"#N/A"},null,0,0,0,0,0,0,0,0,0,0,0,0,null,250,250,250,250,250,250,250,250,250,250,250,250,null,1407,46,"2029-08-07",250,250,250,250]
["2005-01-01","sábado","Confraternização Universal",null,null,1438,47,"2029-09-07",250,127.99225689069264,127.99225689069264,3.830808248738431,null,null,null,null,null,null,47,250,118.32357074527384,118.32357074527384,118.32357074527384,118.32357074527384,118.32357074527384,118.32357074527384,{"$error":"#N/A"},{"$error":"#N/A"},{"$error":"#N/A"},{"$error":"#N/A"},{"$error":"#N/A"},{"$error":"#N/A"},null,0,0,0,0,0,0,0,0,0,0,0,0,null,250,250,250,250,250,250,250,250,250,250,250,250,null,1438,47,"2029-09-07",250,250,250,250]
["2005-02-07","segunda-feira","Carnaval",null,null,1468,48,"2029-10-07",250,126.2169987553409,126.2169987553409,3.7776747727473534,null,null,null,null,null,null,48,250,116.49137064922374,116.49137064922374,116.49137064922374,116.49137064922374,116.49137064922374,116.49137064922374,{"$error":"#N/A"},{"$error":"#N/A"},{"$error":"#N/A"},{"$error":"#N/A"},{"$error":"#N/A"},{"$error":"#N/A"},null,0,0,0,0,0,0,0,0,0,0,0,0,null,250,250,250,250,250,250,250,250,250,250,250,250,null,1468,48,"2029-10-07",250,250,250,250]
["2005-02-08","terça-feira","Carnaval",null,null,1499,49,"2029-11-07",250,124.40842908067414,124.40842908067414,3.723544282384577,null,null,null,null,null,null,49,250,{"$f":"$T84/((U$29)^($H84-$H$35))","v":114.62789737354097},114.62789737354097,114.62789737354097,114.62789737354097,114.62789737354097,114.62789737354097,{"$error":"#N/A"},{"$error":"#N/A"},{"$error":"#N/A"},{"$error":"#N/A"},{"$error":"#N/A"},{"$error":"#N/A"},null,0,0,0,0,0,0,0,0,0,0,0,0,null,{"$f":"$T84","v":250},250,250,250,250,250,250,250,250,250,250,250,null,1499,49,"2029-11-07",250,250,250,250]
["2005-03-25","sexta-feira","Paixão de Cristo",null,null,1529,50,"2029-12-07",250,122.68287879195304,122.68287879195304,3.6718985622431548,null,null,null,null,null,null,50,250,112.8529235179095,112.8529235179095,112.8529235179095,112.8529235179095,112.8529235179095,112.8529235179095,{"$error":"#N/A"},{"$error":"#N/A"},{"$error":"#N/A"},{"$error":"#N/A"},{"$error":"#N/A"},{"$error":"#N/A"},null,0,0,0,0,0,0,0,0,0,0,0,0,null,250,250,250,250,250,250,250,250,250,250,250,250,null,1529,50,"2029-12-07",250,250,250,250]
["2005-04-21","quinta-feira","Tiradentes",null,null,1560,51,"2030-01-07",250,120.92494969862987,120.92494969862987,3.6192837444799921,null,null,null,null,null,null,51,250,111.04765325723456,111.04765325723456,111.04765325723456,111.04765325723456,111.04765325723456,111.04765325723456,{"$error":"#N/A"},{"$error":"#N/A"},{"$error":"#N/A"},{"$error":"#N/A"},{"$error":"#N/A"},{"$error":"#N/A"},null,0,0,0,0,0,0,0,0,0,0,0,0,null,250,250,250,250,250,250,250,250,250,250,250,250,null,1560,51,"2030-01-07",250,250,250,250]
["2005-05-01","domingo","Dia do Trabalho",null,null,1591,52,"2030-02-07",250,119.19221005902335,119.19221005902335,3.567422847066569,null,null,null,null,null,null,52,250,109.27126129773687,109.27126129773687,109.27126129773687,109.27126129773687,109.27126129773687,109.27126129773687,{"$error":"#N/A"},{"$error":"#N/A"},{"$error":"#N/A"},{"$error":"#N/A"},{"$error":"#N/A"},{"$error":"#N/A"},null,0,0,0,0,0,0,{"$f":"IF($I87<>0,0,AA87*$B$1*MIN($F87,365))","v":0},0,0,0,0,0,null,250,250,250,250,250,250,250,250,250,250,250,250,null,1591,52,"2030-02-07",250,250,250,250]
["2005-05-26","quinta-feira","Corpus Christi",null,null,1619,53,"2030-03-07",250,117.64850544025919,117.64850544025919,3.5212197678269574,null,null,null,null,null,null,53,250,107.69121535119302,107.69121535119302,107.69121535119302,107.69121535119302,107.69121535119302,107.69121535119302,{"$error":"#N/A"},{"$error":"#N/A"},{"$error":"#N/A"},{"$error":"#N/A"},{"$error":"#N/A"},{"$error":"#N/A"},null,0,0,0,{"$f":"IF($I88<>0,0,X88*$B$1*MIN($F88,365))","v":0},{"$f":"IF($I88<>0,0,Y88*$B$1*MIN($F88,365))","v":0},{"$f":"IF($I88<>0,0,Z88*$B$1*MIN($F88,365))","v":0},0,0,0,0,0,0,null,250,250,250,250,250,250,250,250,250,250,250,250,null,1619,53,"2030-03-07",250,250,250,250]
["2005-09-07","quarta-feira","Independência do Brasil",null,null,1650,54,"2030-04-07",250,115.96271413395846,115.96271413395846,3.4707640340293771,null,null,null,null,null,null,54,250,105.9685151999772,105.9685151999772,105.9685151999772,105.9685151999772,105.9685151999772,105.9685151999772,{"$error":"#N/A"},{"$error":"#N/A"},{"$error":"#N/A"},{"$error":"#N/A"},{"$error":"#N/A"},{"$error":"#N/A"},null,0,0,0,0,0,0,0,0,0,0,0,0,null,250,250,250,250,250,250,250,250,250,250,250,250,null,1650,54,"2030-04-07",250,250,250,250]
["2005-10-12","quarta-feira","Nossa Sr.a Aparecida - Padroeira do Brasil",null,null,1680,55,"2030-05-07",250,114.35430627660196,114.35430627660196,3.422624386858697,null,null,null,null,null,null,55,250,104.32762892089711,104.32762892089711,104.32762892089711,104.32762892089711,104.32762892089711,104.32762892089711,{"$error":"#N/A"},{"$error":"#N/A"},{"$error":"#N/A"},{"$error":"#N/A"},{"$error":"#N/A"},{"$error":"#N/A"},null,0,0,0,0,0,0,0,0,0,0,0,0,null,250,250,250,250,250,250,250,250,250,250,250,250,null,1680,55,"2030-05-07",250,250,250,250]
["2005-11-02","quarta-feira","Finados",null,null,1711,56,"2030-06-07",250,112.71571771453111,112.71571771453111,3.3735814311959165,null,null,null,null,null,null,56,250,102.65873493050141,102.65873493050141,102.65873493050141,102.65873493050141,102.65873493050141,102.65873493050141,{"$error":"#N/A"},{"$error":"#N/A"},{"$error":"#N/A"},{"$error":"#N/A"},{"$error":"#N/A"},{"$error":"#N/A"},null,0,0,0,0,0,0,0,0,0,0,0,0,null,250,250,250,250,250,250,250,250,250,250,250,250,null,1711,56,"2030-06-07",250,250,250,250]
["2005-11-15","terça-feira","Proclamação da República",null,null,1741,57,"2030-07-07",250,111.15234583785872,111.15234583785872,3.3267897109271116,null,null,null,null,null,null,57,250,101.06909946889957,101.06909946889957,101.06909946889957,101.06909946889957,101.06909946889957,101.06909946889957,{"$error":"#N/A"},{"$error":"#N/A"},{"$error":"#N/A"},{"$error":"#N/A"},{"$error":"#N/A"},{"$error":"#N/A"},null,0,0,0,0,0,0,0,0,0,0,0,0,null,250,250,250,250,250,250,250,250,250,250,250,250,null,1741,57,"2030-07-07",250,250,250,250]
["2005-12-25","domingo","Natal",null,null,1772,58,"2030-08-07",250,109.55963832672468,109.55963832672468,3.2791199751188693,null,null,null,null,null,null,58,250,99.452331078176911,99.452331078176911,99.452331078176911,99.452331078176911,99.452331078176911,99.452331078176911,{"$error":"#N/A"},{"$error":"#N/A"},{"$error":"#N/A"},{"$error":"#N/A"},{"$error":"#N/A"},{"$error":"#N/A"},null,0,0,0,0,0,0,0,0,0,0,0,0,null,250,250,250,250,250,250,250,250,250,250,250,250,null,1772,58,"2030-08-07",250,250,250,250]
["2006-01-01","domingo","Confraternização Universal",null,null,1803,59,"2030-09-07",250,107.98975280100986,107.98975280100986,3.2321333013342253,null,null,null,null,null,null,59,250,97.861425587618356,97.861425587618356,97.861425587618356,97.861425587618356,97.861425587618356,97.861425587618356,{"$error":"#N/A"},{"$error":"#N/A"},{"$error":"#N/A"},{"$error":"#N/A"},{"$error":"#N/A"},{"$error":"#N/A"},null,0,0,0,0,0,0,0,0,0,0,0,0,null,250,250,250,250,250,250,250,250,250,250,250,250,null,1803,59,"2030-09-07",250,250,250,0]
["2006-02-27","segunda-feira","Carnaval",null,null,1833,60,"2030-10-07",250,106.49193026196096,106.49193026196096,3.1873034727404912,null,null,null,null,null,null,60,250,96.346074823337958,96.346074823337958,96.346074823337958,96.346074823337958,96.346074823337958,96.346074823337958,{"$error":"#N/A"},{"$error":"#N/A"},{"$error":"#N/A"},{"$error":"#N/A"},{"$error":"#N/A"},{"$error":"#N/A"},null,0,0,0,0,0,0,0,0,0,0,0,0,null,250,250,250,250,250,250,250,250,250,250,250,250,null,1833,60,"2030-10-07",250,250,0,0]
["2006-02-28","terça-feira","Carnaval",null,null,1864,61,"2030-11-07",0,0,0,0,null,null,null,null,null,null,61,250,94.804859069332878,94.804859069332878,94.804859069332878,94.804859069332878,94.804859069332878,94.804859069332878,{"$error":"#N/A"},{"$error":"#N/A"},{"$error":"#N/A"},{"$error":"#N/A"},{"$error":"#N/A"},{"$error":"#N/A"},null,2.8375094319451328,2.8375094319451328,2.8375094319451328,2.8375094319451328,2.8375094319451328,2.8375094319451328,{"$error":"#N/A"},{"$error":"#N/A"},{"$error":"#N/A"},{"$error":"#N/A"},{"$error":"#N/A"},{"$error":"#N/A"},null,250,250,250,250,250,250,250,250,250,250,250,250,null,1864,61,"2030-11-07",250,250,0,0]
["2006-04-14","sexta-feira","Paixão de Cristo",null,null,1894,62,"2030-12-07",0,0,0,0,null,null,null,null,null,null,62,250,93.336838194043466,93.336838194043466,93.336838194043466,93.336838194043466,93.336838194043466,93.336838194043466,{"$error":"#N/A"},{"$error":"#N/A"},{"$error":"#N/A"},{"$error":"#N/A"},{"$error":"#N/A"},{"$error":"#N/A"},null,2.7935715671477208,2.7935715671477208,2.7935715671477208,2.7935715671477208,2.7935715671477208,2.7935715671477208,{"$error":"#N/A"},{"$error":"#N/A"},{"$error":"#N/A"},{"$error":"#N/A"},{"$error":"#N/A"},{"$error":"#N/A"},null,250,250,250,250,250,250,250,250,250,250,250,250,null,1894,62,"2030-12-07",0,250,0,0]
["2006-04-21","sexta-feira","Tiradentes",null,null,1925,63,"2031-01-07",0,0,0,0,null,null,null,null,null,null,63,250,91.843760186273528,91.843760186273528,91.843760186273528,91.843760186273528,91.843760186273528,91.843760186273528,{"$error":"#N/A"},{"$error":"#N/A"},{"$error":"#N/A"},{"$error":"#N/A"},{"$error":"#N/A"},{"$error":"#N/A"},null,2.7488837423751669,2.7488837423751669,2.7488837423751669,2.7488837423751669,2.7488837423751669,2.7488837423751669,{"$error":"#N/A"},{"$error":"#N/A"},{"$error":"#N/A"},{"$error":"#N/A"},{"$error":"#N/A"},{"$error":"#N/A"},null,250,250,250,250,250,250,250,250,250,250,250,250,null,1925,63,"2031-01-07",0,0,0,0]
["2006-05-01","segunda-feira","Dia do Trabalho",null,null,1956,64,"2031-02-07",0,0,0,0,null,null,null,null,null,null,64,250,90.374566445213503,90.374566445213503,90.374566445213503,90.374566445213503,90.374566445213503,90.374566445213503,{"$error":"#N/A"},{"$error":"#N/A"},{"$error":"#N/A"},{"$error":"#N/A"},{"$error":"#N/A"},{"$error":"#N/A"},null,2.7049107737052402,2.7049107737052402,2.7049107737052402,2.7049107737052402,2.7049107737052402,2.7049107737052402,{"$error":"#N/A"},{"$error":"#N/A"},{"$error":"#N/A"},{"$error":"#N/A"},{"$error":"#N/A"},{"$error":"#N/A"},null,250,250,250,250,250,250,250,250,250,250,250,250,null,1956,64,"2031-02-07",0,0,0,0]
["2006-06-15","quinta-feira","Corpus Christi",null,null,1984,65,"2031-03-07",0,{"$f":"I100/($J$32^(H100-$H$35))","v":0},{"$f":"I100/($I$32^(H100-$H$35))","v":0},0,null,null,null,null,null,null,65,{"$f":"IF($G100>$P$3,0,$J$9)","v":250},{"$f":"$T100/((U$29)^($H100-$H$35))","v":89.067763854243722},89.067763854243722,89.067763854243722,89.067763854243722,89.067763854243722,89.067763854243722,{"$error":"#N/A"},{"$error":"#N/A"},{"$error":"#N/A"},{"$error":"#N/A"},{"$error":"#N/A"},{"$error":"#N/A"},null,2.6657981721575146,2.6657981721575146,2.6657981721575146,2.6657981721575146,2.6657981721575146,2.6657981721575146,{"$error":"#N/A"},{"$error":"#N/A"},{"$error":"#N/A"},{"$error":"#N/A"},{"$error":"#N/A"},{"$error":"#N/A"},null,{"$f":"$T100","v":250},250,250,250,250,250,250,250,250,250,250,250,null,1984,65,"2031-03-07",0,0,0,0]
["2006-09-07","quinta-feira","Independência do Brasil",null,null,{"$f":"H101-$H$35","v":2015},66,"2031-04-07",0,0,0,{"$f":"J101*0.0082%*MIN(F101,365)","v":0},null,null,null,null,null,null,{"$f":"S100+1","v":66},250,87.642976792831305,87.642976792831305,87.642976792831305,87.642976792831305,87.642976792831305,87.642976792831305,{"$error":"#N/A"},{"$error":"#N/A"},{"$error":"#N/A"},{"$error":"#N/A"},{"$error":"#N/A"},{"$error":"#N/A"},null,{"$f":"IF($I101<>0,0,U101*$B$1*MIN($F101,365))","v":2.6231542954094409},2.6231542954094409,2.6231542954094409,2.6231542954094409,2.6231542954094409,2.6231542954094409,{"$error":"#N/A"},{"$error":"#N/A"},{"$error":"#N/A"},{"$error":"#N/A"},{"$error":"#N/A"},{"$error":"#N/A"},null,250,250,250,250,250,250,250,250,250,250,250,250,null,{"$f":"BJ101-$H$35","v":2015},66,"2031-04-07",0,0,{"$f":"I102","v":0},{"$f":"BM102","v":0}]
["2006-10-12","quinta-feira","Nossa Sr.a Aparecida - Padroeira do Brasil",null,null,2045,{"$f":"G101+1","v":67},{"$f":"EDATE(H101,1)","v":"2031-05-07"},{"$f":"IF($G102>$I$10,0,$I$9)","v":0},0,0,0,null,null,null,null,null,null,67,250,86.285855219449829,86.285855219449829,86.285855219449829,86.285855219449829,86.285855219449829,86.285855219449829,{"$error":"#N/A"},{"$error":"#N/A"},{"$error":"#N/A"},{"$error":"#N/A"},{"$error":"#N/A"},{"$error":"#N/A"},null,2.5825356467181333,2.5825356467181333,2.5825356467181333,2.5825356467181333,2.5825356467181333,2.5825356467181333,{"$error":"#N/A"},{"$error":"#N/A"},{"$error":"#N/A"},{"$error":"#N/A"},{"$error":"#N/A"},{"$error":"#N/A"},null,250,250,250,250,250,250,250,250,250,250,250,250,null,2045,{"$f":"BI101+1","v":67},{"$f":"EDATE(BJ101,1)","v":"2031-05-07"},{"$f":"I101","v":0},{"$f":"BK101","v":0},0,0]
["2006-11-02","quinta-feira","Finados",null,null,2076,68,"2031-06-07",0,0,0,0,null,null,null,null,null,null,68,250,84.905569414803807,84.905569414803807,84.905569414803807,84.905569414803807,84.905569414803807,84.905569414803807,{"$error":"#N/A"},{"$error":"#N/A"},{"$error":"#N/A"},{"$error":"#N/A"},{"$error":"#N/A"},{"$error":"#N/A"},null,2.5412236925850782,2.5412236925850782,2.5412236925850782,2.5412236925850782,2.5412236925850782,2.5412236925850782,{"$error":"#N/A"},{"$error":"#N/A"},{"$error":"#N/A"},{"$error":"#N/A"},{"$error":"#N/A"},{"$error":"#N/A"},null,250,250,250,250,250,250,250,250,250,250,250,250,null,2076,68,"2031-06-07",0,0,0,0]
["2006-11-15","quarta-feira","Proclamação da República",null,null,2106,69,"2031-07-07",0,0,0,0,null,null,null,null,null,null,69,250,83.590835660090761,83.590835660090761,83.590835660090761,83.590835660090761,83.590835660090761,83.590835660090761,{"$error":"#N/A"},{"$error":"#N/A"},{"$error":"#N/A"},{"$error":"#N/A"},{"$error":"#N/A"},{"$error":"#N/A"},null,2.5018737113065166,2.5018737113065166,2.5018737113065166,2.5018737113065166,2.5018737113065166,2.5018737113065166,{"$error":"#N/A"},{"$error":"#N/A"},{"$error":"#N/A"},{"$error":"#N/A"},{"$error":"#N/A"},{"$error":"#N/A"},null,250,250,250,250,250,250,250,250,250,250,250,250,null,2106,69,"2031-07-07",0,0,0,0]
["2006-12-25","segunda-feira","Natal",null,null,2137,70,"2031-08-07",0,0,0,0,null,null,null,null,null,null,70,250,82.253661176895562,82.253661176895562,82.253661176895562,82.253661176895562,82.253661176895562,82.253661176895562,{"$error":"#N/A"},{"$error":"#N/A"},{"$error":"#N/A"},{"$error":"#N/A"},{"$error":"#N/A"},{"$error":"#N/A"},null,2.4618520790244842,2.4618520790244842,2.4618520790244842,2.4618520790244842,2.4618520790244842,2.4618520790244842,{"$error":"#N/A"},{"$error":"#N/A"},{"$error":"#N/A"},{"$error":"#N/A"},{"$error":"#N/A"},{"$error":"#N/A"},null,250,250,250,250,250,250,250,250,250,250,250,250,null,2137,70,"2031-08-07",0,0,0,0]
["2007-01-01","segunda-feira","Confraternização Universal",null,null,2168,71,"2031-09-07",0,0,0,0,null,null,null,null,null,null,71,250,80.937877024164123,80.937877024164123,80.937877024164123,80.937877024164123,80.937877024164123,80.937877024164123,{"$error":"#N/A"},{"$error":"#N/A"},{"$error":"#N/A"},{"$error":"#N/A"},{"$error":"#N/A"},{"$error":"#N/A"},null,2.4224706593332321,2.4224706593332321,2.4224706593332321,2.4224706593332321,2.4224706593332321,2.4224706593332321,{"$error":"#N/A"},{"$error":"#N/A"},{"$error":"#N/A"},{"$error":"#N/A"},{"$error":"#N/A"},{"$error":"#N/A"},null,250,250,250,250,250,250,250,250,250,250,250,250,null,2168,71,"2031-09-07",0,0,0,0]
["2007-02-19","segunda-feira","Carnaval",null,null,2198,72,"2031-10-07",0,0,0,0,null,null,null,null,null,null,72,250,79.684581631507214,79.684581631507214,79.684581631507214,79.684581631507214,79.684581631507214,79.684581631507214,{"$error":"#N/A"},{"$error":"#N/A"},{"$error":"#N/A"},{"$error":"#N/A"},{"$error":"#N/A"},{"$error":"#N/A"},null,2.3849595282310108,2.3849595282310108,2.3849595282310108,2.3849595282310108,2.3849595282310108,2.3849595282310108,{"$error":"#N/A"},{"$error":"#N/A"},{"$error":"#N/A"},{"$error":"#N/A"},{"$error":"#N/A"},{"$error":"#N/A"},null,250,250,250,250,250,250,250,250,250,250,250,250,null,2198,72,"2031-10-07",0,0,0,0]
["2007-02-20","terça-feira","Carnaval",null,null,2229,73,"2031-11-07",0,0,0,0,null,null,null,null,null,null,73,250,78.409894180181666,78.409894180181666,78.409894180181666,78.409894180181666,78.409894180181666,78.409894180181666,{"$error":"#N/A"},{"$error":"#N/A"},{"$error":"#N/A"},{"$error":"#N/A"},{"$error":"#N/A"},{"$error":"#N/A"},null,2.3468081328128374,2.3468081328128374,2.3468081328128374,2.3468081328128374,2.3468081328128374,2.3468081328128374,{"$error":"#N/A"},{"$error":"#N/A"},{"$error":"#N/A"},{"$error":"#N/A"},{"$error":"#N/A"},{"$error":"#N/A"},null,250,250,250,250,250,250,250,250,250,250,250,250,null,2229,73,"2031-11-07",0,0,0,0]
["2007-04-06","sexta-feira","Paixão de Cristo",null,null,2259,74,"2031-12-07",0,0,0,0,null,null,null,null,null,null,74,250,77.195743738783307,77.195743738783307,77.195743738783307,77.195743738783307,77.195743738783307,77.195743738783307,{"$error":"#N/A"},{"$error":"#N/A"},{"$error":"#N/A"},{"$error":"#N/A"},{"$error":"#N/A"},{"$error":"#N/A"},null,2.3104686101017844,2.3104686101017844,2.3104686101017844,2.3104686101017844,2.3104686101017844,2.3104686101017844,{"$error":"#N/A"},{"$error":"#N/A"},{"$error":"#N/A"},{"$error":"#N/A"},{"$error":"#N/A"},{"$error":"#N/A"},null,250,250,250,250,250,250,250,250,250,250,250,250,null,2259,74,"2031-12-07",0,0,0,0]
["2007-04-21","sábado","Tiradentes",null,null,2290,75,"2032-01-07",0,0,0,0,null,null,null,null,null,null,75,250,75.960869390134363,75.960869390134363,75.960869390134363,75.960869390134363,75.960869390134363,75.960869390134363,{"$error":"#N/A"},{"$error":"#N/A"},{"$error":"#N/A"},{"$error":"#N/A"},{"$error":"#N/A"},{"$error":"#N/A"},null,2.2735088208467218,2.2735088208467218,2.2735088208467218,2.2735088208467218,2.2735088208467218,2.2735088208467218,{"$error":"#N/A"},{"$error":"#N/A"},{"$error":"#N/A"},{"$error":"#N/A"},{"$error":"#N/A"},{"$error":"#N/A"},null,250,250,250,250,250,250,250,250,250,250,250,250,null,2290,75,"2032-01-07",0,0,0,0]
["2007-05-01","terça-feira","Dia do Trabalho",null,null,2321,76,"2032-02-07",0,0,0,0,null,null,null,null,null,null,76,250,74.745748911104329,74.745748911104329,74.745748911104329,74.745748911104329,74.745748911104329,74.745748911104329,{"$error":"#N/A"},{"$error":"#N/A"},{"$error":"#N/A"},{"$error":"#N/A"},{"$error":"#N/A"},{"$error":"#N/A"},null,2.2371402649093528,2.2371402649093528,2.2371402649093528,2.2371402649093528,2.2371402649093528,2.2371402649093528,{"$error":"#N/A"},{"$error":"#N/A"},{"$error":"#N/A"},{"$error":"#N/A"},{"$error":"#N/A"},{"$error":"#N/A"},null,250,250,250,250,250,250,250,250,250,250,250,250,null,2321,76,"2032-02-07",0,0,0,0]
["2007-06-07","quinta-feira","Corpus Christi",null,null,2350,77,"2032-03-07",0,0,0,0,null,null,null,null,null,null,77,250,73.626626623833715,73.626626623833715,73.626626623833715,73.626626623833715,73.626626623833715,73.626626623833715,{"$error":"#N/A"},{"$error":"#N/A"},{"$error":"#N/A"},{"$error":"#N/A"},{"$error":"#N/A"},{"$error":"#N/A"},null,2.2036449348513432,2.2036449348513432,2.2036449348513432,2.2036449348513432,2.2036449348513432,2.2036449348513432,{"$error":"#N/A"},{"$error":"#N/A"},{"$error":"#N/A"},{"$error":"#N/A"},{"$error":"#N/A"},{"$error":"#N/A"},null,250,250,250,250,250,250,250,250,250,250,250,250,null,2350,77,"2032-03-07",0,0,0,0]
["2007-09-07","sexta-feira","Independência do Brasil",null,null,2381,78,"2032-04-07",0,0,0,0,null,null,null,null,null,null,78,250,72.448846241239281,72.448846241239281,72.448846241239281,72.448846241239281,72.448846241239281,72.448846241239281,{"$error":"#N/A"},{"$error":"#N/A"},{"$error":"#N/A"},{"$error":"#N/A"},{"$error":"#N/A"},{"$error":"#N/A"},null,2.1683939680002919,2.1683939680002919,2.1683939680002919,2.1683939680002919,2.1683939680002919,2.1683939680002919,{"$error":"#N/A"},{"$error":"#N/A"},{"$error":"#N/A"},{"$error":"#N/A"},{"$error":"#N/A"},{"$error":"#N/A"},null,250,250,250,250,250,250,250,250,250,250,250,250,null,2381,78,"2032-04-07",0,0,0,0]
["2007-10-12","sexta-feira","Nossa Sr.a Aparecida - Padroeira do Brasil",null,null,2411,79,"2032-05-07",0,0,0,0,null,null,null,null,null,null,79,250,71.32700059200954,71.32700059200954,71.32700059200954,71.32700059200954,71.32700059200954,71.32700059200954,{"$error":"#N/A"},{"$error":"#N/A"},{"$error":"#N/A"},{"$error":"#N/A"},{"$error":"#N/A"},{"$error":"#N/A"},null,2.1348171277188457,2.1348171277188457,2.1348171277188457,2.1348171277188457,2.1348171277188457,2.1348171277188457,{"$error":"#N/A"},{"$error":"#N/A"},{"$error":"#N/A"},{"$error":"#N/A"},{"$error":"#N/A"},{"$error":"#N/A"},null,250,250,250,250,250,250,250,250,250,250,250,250,null,2411,79,"2032-05-07",0,0,0,0]
["2007-11-02","sexta-feira","Finados",null,null,2442,80,"2032-06-07",0,0,0,0,null,null,null,null,null,null,80,250,70.186006553592236,70.186006553592236,70.186006553592236,70.186006553592236,70.186006553592236,70.186006553592236,{"$error":"#N/A"},{"$error":"#N/A"},{"$error":"#N/A"},{"$error":"#N/A"},{"$error":"#N/A"},{"$error":"#N/A"},null,2.1006671761490159,2.1006671761490159,2.1006671761490159,2.1006671761490159,2.1006671761490159,2.1006671761490159,{"$error":"#N/A"},{"$error":"#N/A"},{"$error":"#N/A"},{"$error":"#N/A"},{"$error":"#N/A"},{"$error":"#N/A"},null,250,250,250,250,250,250,250,250,250,250,250,250,null,2442,80,"2032-06-07",0,0,0,0]
["2007-11-15","quinta-feira","Proclamação da República",null,null,2472,81,"2032-07-07",0,0,0,0,null,null,null,null,null,null,81,250,{"$f":"$T116/((U$29)^($H116-$H$35))","v":69.099200204367847},69.099200204367847,69.099200204367847,69.099200204367847,69.099200204367847,69.099200204367847,{"$error":"#N/A"},{"$error":"#N/A"},{"$error":"#N/A"},{"$error":"#N/A"},{"$error":"#N/A"},{"$error":"#N/A"},null,2.0681390621167295,2.0681390621167295,2.0681390621167295,2.0681390621167295,2.0681390621167295,2.0681390621167295,{"$error":"#N/A"},{"$error":"#N/A"},{"$error":"#N/A"},{"$error":"#N/A"},{"$error":"#N/A"},{"$error":"#N/A"},null,{"$f":"$T116","v":250},250,250,250,250,250,250,250,250,250,250,250,null,2472,81,"2032-07-07",0,0,0,0]
["2007-12-25","terça-feira","Natal",null,null,2503,82,"2032-08-07",0,0,0,0,null,null,null,null,null,null,82,250,67.993843539455483,67.993843539455483,67.993843539455483,67.993843539455483,67.993843539455483,67.993843539455483,{"$error":"#N/A"},{"$error":"#N/A"},{"$error":"#N/A"},{"$error":"#N/A"},{"$error":"#N/A"},{"$error":"#N/A"},null,2.0350557371359028,2.0350557371359028,2.0350557371359028,2.0350557371359028,2.0350557371359028,2.0350557371359028,{"$error":"#N/A"},{"$error":"#N/A"},{"$error":"#N/A"},{"$error":"#N/A"},{"$error":"#N/A"},{"$error":"#N/A"},null,250,250,250,250,250,250,250,250,250,250,250,250,null,2503,82,"2032-08-07",0,0,0,0]
["2008-01-01","terça-feira","Confraternização Universal",null,null,2534,83,"2032-09-07",0,0,0,0,null,null,null,null,null,null,83,250,66.906168893337153,66.906168893337153,66.906168893337153,66.906168893337153,66.906168893337153,66.906168893337153,{"$error":"#N/A"},{"$error":"#N/A"},{"$error":"#N/A"},{"$error":"#N/A"},{"$error":"#N/A"},{"$error":"#N/A"},null,2.0025016349775813,2.0025016349775813,2.0025016349775813,2.0025016349775813,2.0025016349775813,2.0025016349775813,{"$error":"#N/A"},{"$error":"#N/A"},{"$error":"#N/A"},{"$error":"#N/A"},{"$error":"#N/A"},{"$error":"#N/A"},null,250,250,250,250,250,250,250,250,250,250,250,250,null,2534,83,"2032-09-07",0,0,0,0]
["2008-02-04","segunda-feira","Carnaval",null,null,2564,84,"2032-10-07",0,0,0,0,null,null,null,null,null,null,84,250,65.870149710509949,65.870149710509949,65.870149710509949,65.870149710509949,65.870149710509949,65.870149710509949,{"$error":"#N/A"},{"$error":"#N/A"},{"$error":"#N/A"},{"$error":"#N/A"},{"$error":"#N/A"},{"$error":"#N/A"},null,1.9714935808355629,1.9714935808355629,1.9714935808355629,1.9714935808355629,1.9714935808355629,1.9714935808355629,{"$error":"#N/A"},{"$error":"#N/A"},{"$error":"#N/A"},{"$error":"#N/A"},{"$error":"#N/A"},{"$error":"#N/A"},null,250,250,250,250,250,250,250,250,250,250,250,250,null,2564,84,"2032-10-07",0,0,0,0]
["2008-02-05","terça-feira","Carnaval",null,null,2595,85,"2032-11-07",0,0,0,0,null,null,null,null,null,null,85,250,64.816447080292164,64.816447080292164,64.816447080292164,64.816447080292164,64.816447080292164,64.816447080292164,{"$error":"#N/A"},{"$error":"#N/A"},{"$error":"#N/A"},{"$error":"#N/A"},{"$error":"#N/A"},{"$error":"#N/A"},null,1.9399562611131445,1.9399562611131445,1.9399562611131445,1.9399562611131445,1.9399562611131445,1.9399562611131445,{"$error":"#N/A"},{"$error":"#N/A"},{"$error":"#N/A"},{"$error":"#N/A"},{"$error":"#N/A"},{"$error":"#N/A"},null,250,250,250,250,250,250,250,250,250,250,250,250,null,2595,85,"2032-11-07",0,0,0,0]
["2008-03-21","sexta-feira","Paixão de Cristo",null,null,2625,86,"2032-12-07",0,0,0,0,null,null,null,null,null,null,86,250,63.812786526286445,63.812786526286445,63.812786526286445,63.812786526286445,63.812786526286445,63.812786526286445,{"$error":"#N/A"},{"$error":"#N/A"},{"$error":"#N/A"},{"$error":"#N/A"},{"$error":"#N/A"},{"$error":"#N/A"},null,1.9099167007317532,1.9099167007317532,1.9099167007317532,1.9099167007317532,1.9099167007317532,1.9099167007317532,{"$error":"#N/A"},{"$error":"#N/A"},{"$error":"#N/A"},{"$error":"#N/A"},{"$error":"#N/A"},{"$error":"#N/A"},null,250,250,250,250,250,250,250,250,250,250,250,250,null,2625,86,"2032-12-07",0,0,0,0]
["2008-04-21","segunda-feira","Tiradentes",null,null,2656,87,"2033-01-07",0,0,0,0,null,null,null,null,null,null,87,250,62.791994842955184,62.791994842955184,62.791994842955184,62.791994842955184,62.791994842955184,62.791994842955184,{"$error":"#N/A"},{"$error":"#N/A"},{"$error":"#N/A"},{"$error":"#N/A"},{"$error":"#N/A"},{"$error":"#N/A"},null,1.8793644056496488,1.8793644056496488,1.8793644056496488,1.8793644056496488,1.8793644056496488,1.8793644056496488,{"$error":"#N/A"},{"$error":"#N/A"},{"$error":"#N/A"},{"$error":"#N/A"},{"$error":"#N/A"},{"$error":"#N/A"},null,250,250,250,250,250,250,250,250,250,250,250,250,null,2656,87,"2033-01-07",0,0,0,0]
["2008-05-01","quinta-feira","Dia do Trabalho",null,null,2687,88,"2033-02-07",0,0,0,0,null,null,null,null,null,null,88,250,61.787532420850091,61.787532420850091,61.787532420850091,61.787532420850091,61.787532420850091,61.787532420850091,{"$error":"#N/A"},{"$error":"#N/A"},{"$error":"#N/A"},{"$error":"#N/A"},{"$error":"#N/A"},{"$error":"#N/A"},null,1.8493008453560433,1.8493008453560433,1.8493008453560433,1.8493008453560433,1.8493008453560433,1.8493008453560433,{"$error":"#N/A"},{"$error":"#N/A"},{"$error":"#N/A"},{"$error":"#N/A"},{"$error":"#N/A"},{"$error":"#N/A"},null,250,250,250,250,250,250,250,250,250,250,250,250,null,2687,88,"2033-02-07",0,0,0,0]
["2008-05-22","quinta-feira","Corpus Christi",null,null,2715,89,"2033-03-07",0,0,0,0,null,null,null,null,null,null,89,250,60.894094027359785,60.894094027359785,60.894094027359785,60.894094027359785,60.894094027359785,60.894094027359785,{"$error":"#N/A"},{"$error":"#N/A"},{"$error":"#N/A"},{"$error":"#N/A"},{"$error":"#N/A"},{"$error":"#N/A"},null,1.8225602342388785,1.8225602342388785,1.8225602342388785,1.8225602342388785,1.8225602342388785,1.8225602342388785,{"$error":"#N/A"},{"$error":"#N/A"},{"$error":"#N/A"},{"$error":"#N/A"},{"$error":"#N/A"},{"$error":"#N/A"},null,250,250,250,250,250,250,250,250,250,250,250,250,null,2715,89,"2033-03-07",0,0,0,0]
["2008-09-07","domingo","Independência do Brasil",null,null,2746,90,"2033-04-07",0,0,0,0,null,null,null,null,null,null,90,250,59.919991686263685,59.919991686263685,59.919991686263685,59.919991686263685,59.919991686263685,59.919991686263685,{"$error":"#N/A"},{"$error":"#N/A"},{"$error":"#N/A"},{"$error":"#N/A"},{"$error":"#N/A"},{"$error":"#N/A"},null,1.7934053511698722,1.7934053511698722,1.7934053511698722,1.7934053511698722,1.7934053511698722,1.7934053511698722,{"$error":"#N/A"},{"$error":"#N/A"},{"$error":"#N/A"},{"$error":"#N/A"},{"$error":"#N/A"},{"$error":"#N/A"},null,250,250,250,250,250,250,250,250,250,250,250,250,null,2746,90,"2033-04-07",0,0,0,0]
["2008-10-12","domingo","Nossa Sr.a Aparecida - Padroeira do Brasil",null,null,2776,91,"2033-05-07",0,0,0,0,null,null,null,null,null,null,91,250,58.992151072331914,58.992151072331914,58.992151072331914,58.992151072331914,58.992151072331914,58.992151072331914,{"$error":"#N/A"},{"$error":"#N/A"},{"$error":"#N/A"},{"$error":"#N/A"},{"$error":"#N/A"},{"$error":"#N/A"},null,1.765635081594894,1.765635081594894,1.765635081594894,1.765635081594894,1.765635081594894,1.765635081594894,{"$error":"#N/A"},{"$error":"#N/A"},{"$error":"#N/A"},{"$error":"#N/A"},{"$error":"#N/A"},{"$error":"#N/A"},null,250,250,250,250,250,250,250,250,250,250,250,250,null,2776,91,"2033-05-07",0,0,0,0]
["2008-11-02","domingo","Finados",null,null,2807,92,"2033-06-07",0,0,0,0,null,null,null,null,null,null,92,250,58.048473472989798,58.048473472989798,58.048473472989798,58.048473472989798,58.048473472989798,58.048473472989798,{"$error":"#N/A"},{"$error":"#N/A"},{"$error":"#N/A"},{"$error":"#N/A"},{"$error":"#N/A"},{"$error":"#N/A"},null,1.7373908110465845,1.7373908110465845,1.7373908110465845,1.7373908110465845,1.7373908110465845,1.7373908110465845,{"$error":"#N/A"},{"$error":"#N/A"},{"$error":"#N/A"},{"$error":"#N/A"},{"$error":"#N/A"},{"$error":"#N/A"},null,250,250,250,250,250,250,250,250,250,250,250,250,null,2807,92,"2033-06-07",0,0,0,0]
["2008-11-15","sábado","Proclamação da República",null,null,2837,93,"2033-07-07",0,0,0,0,null,null,null,null,null,null,93,250,57.14961267963411,57.14961267963411,57.14961267963411,57.14961267963411,57.14961267963411,57.14961267963411,{"$error":"#N/A"},{"$error":"#N/A"},{"$error":"#N/A"},{"$error":"#N/A"},{"$error":"#N/A"},{"$error":"#N/A"},null,1.7104879075014492,1.7104879075014492,1.7104879075014492,1.7104879075014492,1.7104879075014492,1.7104879075014492,{"$error":"#N/A"},{"$error":"#N/A"},{"$error":"#N/A"},{"$error":"#N/A"},{"$error":"#N/A"},{"$error":"#N/A"},null,250,250,250,250,250,250,250,250,250,250,250,250,null,2837,93,"2033-07-07",0,0,0,0]
["2008-12-25","quinta-feira","Natal",null,null,2868,94,"2033-08-07",0,0,0,0,null,null,null,null,null,null,94,250,56.235409547242405,56.235409547242405,56.235409547242405,56.235409547242405,56.235409547242405,56.235409547242405,{"$error":"#N/A"},{"$error":"#N/A"},{"$error":"#N/A"},{"$error":"#N/A"},{"$error":"#N/A"},{"$error":"#N/A"},null,1.6831258077489653,1.6831258077489653,1.6831258077489653,1.6831258077489653,1.6831258077489653,1.6831258077489653,{"$error":"#N/A"},{"$error":"#N/A"},{"$error":"#N/A"},{"$f":"IF($I129<>0,0,AD129*$B$1*MIN($F129,365))","v":{"$error":"#N/A"}},{"$error":"#N/A"},{"$error":"#N/A"},null,250,250,250,250,250,250,250,250,250,250,250,250,null,2868,94,"2033-08-07",0,0,0,0]
["2009-01-01","quinta-feira","Confraternização Universal",null,null,2899,95,"2033-09-07",0,0,0,0,null,null,null,null,null,null,95,250,55.335830614877409,55.335830614877409,55.335830614877409,55.335830614877409,55.335830614877409,55.335830614877409,{"$error":"#N/A"},{"$error":"#N/A"},{"$error":"#N/A"},{"$error":"#N/A"},{"$error":"#N/A"},{"$error":"#N/A"},null,1.6562014103032807,1.6562014103032807,1.6562014103032807,1.6562014103032807,1.6562014103032807,1.6562014103032807,{"$error":"#N/A"},{"$error":"#N/A"},{"$error":"#N/A"},{"$error":"#N/A"},{"$error":"#N/A"},{"$error":"#N/A"},null,250,250,250,250,250,250,250,250,250,250,250,250,null,2899,95,"2033-09-07",0,0,0,0]
["2009-02-23","segunda-feira","Carnaval",null,null,2929,96,"2033-10-07",0,0,0,0,null,null,null,null,null,null,{"$f":"S130+1","v":96},250,54.478974170054137,54.478974170054137,54.478974170054137,54.478974170054137,54.478974170054137,54.478974170054137,{"$error":"#N/A"},{"$error":"#N/A"},{"$error":"#N/A"},{"$error":"#N/A"},{"$error":"#N/A"},{"$error":"#N/A"},null,1.6305556969097204,1.6305556969097204,1.6305556969097204,1.6305556969097204,1.6305556969097204,1.6305556969097204,{"$error":"#N/A"},{"$error":"#N/A"},{"$error":"#N/A"},{"$error":"#N/A"},{"$error":"#N/A"},{"$error":"#N/A"},null,250,250,250,250,250,250,250,250,250,250,250,250,null,2929,96,"2033-10-07",0,0,0,0]
["2009-02-24","terça-feira","Carnaval"]
["2009-04-10","sexta-feira","Paixão de Cristo"]
["2009-04-21","terça-feira","Tiradentes"]
["2009-05-01","sexta-feira","Dia do Trabalho"]
["2009-06-11","quinta-feira","Corpus Christi"]
["2009-09-07","segunda-feira","Independência do Brasil"]
["2009-10-12","segunda-feira","Nossa Sr.a Aparecida - Padroeira do Brasil"]
["2009-11-02","segunda-feira","Finados"]
["2009-11-15","domingo","Proclamação da República"]
["2009-12-25","sexta-feira","Natal"]
["2010-01-01","sexta-feira","Confraternização Universal"]
["2010-02-15","segunda-feira","Carnaval"]
["2010-02-16","terça-feira","Carnaval"]
["2010-04-02","sexta-feira","Paixão de Cristo"]
["2010-04-21","quarta-feira","Tiradentes"]
["2010-05-01","sábado","Dia do Trabalho"]
["2010-06-03","quinta-feira","Corpus Christi"]
["2010-09-07","terça-feira","Independência do Brasil"]
["2010-10-12","terça-feira","Nossa Sr.a Aparecida - Padroeira do Brasil"]
["2010-11-02","terça-feira","Finados"]
["2010-11-15","segunda-feira","Proclamação da República"]
["2010-12-25","sábado","Natal"]
["2011-01-01","sábado","Confraternização Universal"]
["2011-03-07","segunda-feira","Carnaval"]
["2011-03-08","terça-feira","Carnaval"]
["2011-04-21","quinta-feira","Tiradentes"]
["2011-04-22","sexta-feira","Paixão de Cristo"]
["2011-05-01","domingo","Dia do Trabalho"]
["2011-06-23","quinta-feira","Corpus Christi"]
["2011-09-07","quarta-feira","Independência do Brasil"]
["2011-10-12","quarta-feira","Nossa Sr.a Aparecida - Padroeira do Brasil"]
["2011-11-02","quarta-feira","Finados"]
["2011-11-15","terça-feira","Proclamação da República"]
["2011-12-25","domingo","Natal"]
["2012-01-01","domingo","Confraternização Universal"]
["2012-02-20","segunda-feira","Carnaval"]
["2012-02-21","terça-feira","Carnaval"]
["2012-04-06","sexta-feira","Paixão de Cristo"]
["2012-04-21","sábado","Tiradentes"]
["2012-05-01","terça-feira","Dia do Trabalho"]
["2012-06-07","quinta-feira","Corpus Christi"]
["2012-09-07","sexta-feira","Independência do Brasil"]
["2012-10-12","sexta-feira","Nossa Sr.a Aparecida - Padroeira do Brasil"]
["2012-11-02","sexta-feira","Finados"]
["2012-11-15","quinta-feira","Proclamação da República"]
["2012-12-25","terça-feira","Natal"]
["2013-01-01","terça-feira","Confraternização Universal"]
["2013-02-11","segunda-feira","Carnaval"]
["2013-02-12","terça-feira","Carnaval"]
["2013-03-29","sexta-feira","Paixão de Cristo"]
["2013-04-21","domingo","Tiradentes"]
["2013-05-01","quarta-feira","Dia do Trabalho"]
["2013-05-30","quinta-feira","Corpus Christi"]
["2013-09-07","sábado","Independência do Brasil"]
["2013-10-12","sábado","Nossa Sr.a Aparecida - Padroeira do Brasil"]
["2013-11-02","sábado","Finados"]
["2013-11-15","sexta-feira","Proclamação da República"]
["2013-12-25","quarta-feira","Natal"]
["2014-01-01","quarta-feira","Confraternização Universal"]
["2014-03-03","segunda-feira","Carnaval"]
["2014-03-04","terça-feira","Carnaval"]
["2014-04-18","sexta-feira","Paixão de Cristo"]
["2014-04-21","segunda-feira","Tiradentes"]
["2014-05-01","quinta-feira","Dia do Trabalho"]
["2014-06-19","quinta-feira","Corpus Christi"]
["2014-09-07","domingo","Independência do Brasil"]
["2014-10-12","domingo","Nossa Sr.a Aparecida - Padroeira do Brasil"]
["2014-11-02","domingo","Finados"]
["2014-11-15","sábado","Proclamação da República"]
["2014-12-25","quinta-feira","Natal"]
["2015-01-01","quinta-feira","Confraternização Universal"]
["2015-02-16","segunda-feira","Carnaval"]
["2015-02-17","terça-feira","Carnaval"]
["2015-04-03","sexta-feira","Paixão de Cristo"]
["2015-04-21","terça-feira","Tiradentes"]
["2015-05-01","sexta-feira","Dia do Trabalho"]
["2015-06-04","quinta-feira","Corpus Christi"]
["2015-09-07","segunda-feira","Independência do Brasil"]
["2015-10-12","segunda-feira","Nossa Sr.a Aparecida - Padroeira do Brasil"]
["2015-11-02","segunda-feira","Finados"]
["2015-11-15","domingo","Proclamação da República"]
["2015-12-25","sexta-feira","Natal"]
["2016-01-01","sexta-feira","Confraternização Universal"]
["2016-02-08","segunda-feira","Carnaval"]
["2016-02-09","terça-feira","Carnaval"]
["2016-03-25","sexta-feira","Paixão de Cristo"]
["2016-04-21","quinta-feira","Tiradentes"]
["2016-05-01","domingo","Dia do Trabalho"]
["2016-05-26","quinta-feira","Corpus Christi"]
["2016-09-07","quarta-feira","Independência do Brasil"]
["2016-10-12","quarta-feira","Nossa Sr.a Aparecida - Padroeira do Brasil"]
["2016-11-02","quarta-feira","Finados"]
["2016-11-15","terça-feira","Proclamação da República"]
["2016-12-25","domingo","Natal"]
["2017-01-01","domingo","Confraternização Universal"]
["2017-02-27","segunda-feira","Carnaval"]
["2017-02-28","terça-feira","Carnaval"]
["2017-04-14","sexta-feira","Paixão de Cristo"]
["2017-04-21","sexta-feira","Tiradentes"]
["2017-05-01","segunda-feira","Dia do Trabalho"]
["2017-06-15","quinta-feira","Corpus Christi"]
["2017-09-07","quinta-feira","Independência do Brasil"]
["2017-10-12","quinta-feira","Nossa Sr.a Aparecida - Padroeira do Brasil"]
["2017-11-02","quinta-feira","Finados"]
["2017-11-15","quarta-feira","Proclamação da República"]
["2017-12-25","segunda-feira","Natal"]
["2018-01-01","segunda-feira","Confraternização Universal"]
["2018-02-12","segunda-feira","Carnaval"]
["2018-02-13","terça-feira","Carnaval"]
["2018-03-30","sexta-feira","Paixão de Cristo"]
["2018-04-21","sábado","Tiradentes"]
["2018-05-01","terça-feira","Dia do Trabalho"]
["2018-05-31","quinta-feira","Corpus Christi"]
["2018-09-07","sexta-feira","Independência do Brasil"]
["2018-10-12","sexta-feira","Nossa Sr.a Aparecida - Padroeira do Brasil"]
["2018-11-02","sexta-feira","Finados"]
["2018-11-15","quinta-feira","Proclamação da República"]
["2018-12-25","terça-feira","Natal"]
["2019-01-01","terça-feira","Confraternização Universal"]
["2019-03-04","segunda-feira","Carnaval"]
["2019-03-05","terça-feira","Carnaval"]
["2019-04-19","sexta-feira","Paixão de Cristo"]
["2019-04-21","domingo","Tiradentes"]
["2019-05-01","quarta-feira","Dia do Trabalho"]
["2019-06-20","quinta-feira","Corpus Christi"]
["2019-09-07","sábado","Independência do Brasil"]
["2019-10-12","sábado","Nossa Sr.a Aparecida - Padroeira do Brasil"]
["2019-11-02","sábado","Finados"]
["2019-11-15","sexta-feira","Proclamação da República"]
["2019-12-25","quarta-feira","Natal"]
["2020-01-01","quarta-feira","Confraternização Universal"]
["2020-02-24","segunda-feira","Carnaval"]
["2020-02-25","terça-feira","Carnaval"]
["2020-04-10","sexta-feira","Paixão de Cristo"]
["2020-04-21","terça-feira","Tiradentes"]
["2020-05-01","sexta-feira","Dia do Trabalho"]
["2020-06-11","quinta-feira","Corpus Christi"]
["2020-09-07","segunda-feira","Independência do Brasil"]
["2020-10-12","segunda-feira","Nossa Sr.a Aparecida - Padroeira do Brasil"]
["2020-11-02","segunda-feira","Finados"]
["2020-11-15","domingo","Proclamação da República"]
["2020-12-25","sexta-feira","Natal"]
["2021-01-01","sexta-feira","Confraternização Universal"]
["2021-02-15","segunda-feira","Carnaval"]
["2021-02-16","terça-feira","Carnaval"]
["2021-04-02","sexta-feira","Paixão de Cristo"]
["2021-04-21","quarta-feira","Tiradentes"]
["2021-05-01","sábado","Dia do Trabalho"]
["2021-06-03","quinta-feira","Corpus Christi"]
["2021-09-07","terça-feira","Independência do Brasil"]
["2021-10-12","terça-feira","Nossa Sr.a Aparecida - Padroeira do Brasil"]
["2021-11-02","terça-feira","Finados"]
["2021-11-15","segunda-feira","Proclamação da República"]
["2021-12-25","sábado","Natal"]
["2022-01-01","sábado","Confraternização Universal"]
["2022-02-28","segunda-feira","Carnaval"]
["2022-03-01","terça-feira","Carnaval"]
["2022-04-15","sexta-feira","Paixão de Cristo"]
["2022-04-21","quinta-feira","Tiradentes"]
["2022-05-01","domingo","Dia do Trabalho"]
["2022-06-16","quinta-feira","Corpus Christi"]
["2022-09-07","quarta-feira","Independência do Brasil"]
["2022-10-12","quarta-feira","Nossa Sr.a Aparecida - Padroeira do Brasil"]
["2022-11-02","quarta-feira","Finados"]
["2022-11-15","terça-feira","Proclamação da República"]
["2022-12-25","domingo","Natal"]
["2023-01-01","domingo","Confraternização Universal"]
["2023-02-20","segunda-feira","Carnaval"]
["2023-02-21","terça-feira","Carnaval"]
["2023-04-07","sexta-feira","Paixão de Cristo"]
["2023-04-21","sexta-feira","Tiradentes"]
["2023-05-01","segunda-feira","Dia do Trabalho"]
["2023-06-08","quinta-feira","Corpus Christi"]
["2023-09-07","quinta-feira","Independência do Brasil"]
["2023-10-12","quinta-feira","Nossa Sr.a Aparecida - Padroeira do Brasil"]
["2023-11-02","quinta-feira","Finados"]
["2023-11-15","quarta-feira","Proclamação da República"]
["2023-12-25","segunda-feira","Natal"]
["2024-01-01","segunda-feira","Confraternização Universal"]
["2024-02-12","segunda-feira","Carnaval"]
["2024-02-13","terça-feira","Carnaval"]
["2024-03-29","sexta-feira","Paixão de Cristo"]
["2024-04-21","domingo","Tiradentes"]
["2024-05-01","quarta-feira","Dia do Trabalho"]
["2024-05-30","quinta-feira","Corpus Christi"]
["2024-09-07","sábado","Independência do Brasil"]
["2024-10-12","sábado","Nossa Sr.a Aparecida - Padroeira do Brasil"]
["2024-11-02","sábado","Finados"]
["2024-11-15","sexta-feira","Proclamação da República"]
["2024-11-20","quarta-feira","Dia Nacional de Zumbi e da Consciência Negra"]
["2024-12-25","quarta-feira","Natal"]
["2025-01-01","quarta-feira","Confraternização Universal"]
["2025-03-03","segunda-feira","Carnaval"]
["2025-03-04","terça-feira","Carnaval"]
["2025-04-18","sexta-feira","Paixão de Cristo"]
["2025-04-21","segunda-feira","Tiradentes"]
["2025-05-01","quinta-feira","Dia do Trabalho"]
["2025-06-19","quinta-feira","Corpus Christi"]
["2025-09-07","domingo","Independência do Brasil"]
["2025-10-12","domingo","Nossa Sr.a Aparecida - Padroeira do Brasil"]
["2025-11-02","domingo","Finados"]
["2025-11-15","sábado","Proclamação da República"]
["2025-11-20","quinta-feira","Dia Nacional de Zumbi e da Consciência Negra"]
["2025-12-25","quinta-feira","Natal"]
["2026-01-01","quinta-feira","Confraternização Universal"]
["2026-02-16","segunda-feira","Carnaval"]
["2026-02-17","terça-feira","Carnaval"]
["2026-04-03","sexta-feira","Paixão de Cristo"]
["2026-04-21","terça-feira","Tiradentes"]
["2026-05-01","sexta-feira","Dia do Trabalho"]
["2026-06-04","quinta-feira","Corpus Christi"]
["2026-09-07","segunda-feira","Independência do Brasil"]
["2026-10-12","segunda-feira","Nossa Sr.a Aparecida - Padroeira do Brasil"]
["2026-11-02","segunda-feira","Finados"]
["2026-11-15","domingo","Proclamação da República"]
["2026-11-20","sexta-feira","Dia Nacional de Zumbi e da Consciência Negra"]
["2026-12-25","sexta-feira","Natal"]
["2027-01-01","sexta-feira","Confraternização Universal"]
["2027-02-08","segunda-feira","Carnaval"]
["2027-02-09","terça-feira","Carnaval"]
["2027-03-26","sexta-feira","Paixão de Cristo"]
["2027-04-21","quarta-feira","Tiradentes"]
["2027-05-01","sábado","Dia do Trabalho"]
["2027-05-27","quinta-feira","Corpus Christi"]
["2027-09-07","terça-feira","Independência do Brasil"]
["2027-10-12","terça-feira","Nossa Sr.a Aparecida - Padroeira do Brasil"]
["2027-11-02","terça-feira","Finados"]
["2027-11-15","segunda-feira","Proclamação da República"]
["2027-11-20","sábado","Dia Nacional de Zumbi e da Consciência Negra"]
["2027-12-25","sábado","Natal"]
["2028-01-01","sábado","Confraternização Universal"]
["2028-02-28","segunda-feira","Carnaval"]
["2028-02-29","terça-feira","Carnaval"]
["2028-04-14","sexta-feira","Paixão de Cristo"]
["2028-04-21","sexta-feira","Tiradentes"]
["2028-05-01","segunda-feira","Dia do Trabalho"]
["2028-06-15","quinta-feira","Corpus Christi"]
["2028-09-07","quinta-feira","Independência do Brasil"]
["2028-10-12","quinta-feira","Nossa Sr.a Aparecida - Padroeira do Brasil"]
["2028-11-02","quinta-feira","Finados"]
["2028-11-15","quarta-feira","Proclamação da República"]
["2028-11-20","segunda-feira","Dia Nacional de Zumbi e da Consciência Negra"]
["2028-12-25","segunda-feira","Natal"]
["2029-01-01","segunda-feira","Confraternização Universal"]
["2029-02-12","segunda-feira","Carnaval"]
["2029-02-13","terça-feira","Carnaval"]
["2029-03-30","sexta-feira","Paixão de Cristo"]
["2029-04-21","sábado","Tiradentes"]
["2029-05-01","terça-feira","Dia do Trabalho"]
["2029-05-31","quinta-feira","Corpus Christi"]
["2029-09-07","sexta-feira","Independência do Brasil"]
["2029-10-12","sexta-feira","Nossa Sr.a Aparecida - Padroeira do Brasil"]
["2029-11-02","sexta-feira","Finados"]
["2029-11-15","quinta-feira","Proclamação da República"]
["2029-11-20","terça-feira","Dia Nacional de Zumbi e da Consciência Negra"]
["2029-12-25","terça-feira","Natal"]
["2030-01-01","terça-feira","Confraternização Universal"]
["2030-03-04","segunda-feira","Carnaval"]
["2030-03-05","terça-feira","Carnaval"]
["2030-04-19","sexta-feira","Paixão de Cristo"]
["2030-04-21","domingo","Tiradentes"]
["2030-05-01","quarta-feira","Dia do Trabalho"]
["2030-06-20","quinta-feira","Corpus Christi"]
["2030-09-07","sábado","Independência do Brasil"]
["2030-10-12","sábado","Nossa Sr.a Aparecida - Padroeira do Brasil"]
["2030-11-02","sábado","Finados"]
["2030-11-15","sexta-feira","Proclamação da República"]
["2030-11-20","quarta-feira","Dia Nacional de Zumbi e da Consciência Negra"]
["2030-12-25","quarta-feira","Natal"]
["2031-01-01","quarta-feira","Confraternização Universal"]
["2031-02-24","segunda-feira","Carnaval"]
["2031-02-25","terça-feira","Carnaval"]
["2031-04-11","sexta-feira","Paixão de Cristo"]
["2031-04-21","segunda-feira","Tiradentes"]
["2031-05-01","quinta-feira","Dia do Trabalho"]
["2031-06-12","quinta-feira","Corpus Christi"]
["2031-09-07","domingo","Independência do Brasil"]
["2031-10-12","domingo","Nossa Sr.a Aparecida - Padroeira do Brasil"]
["2031-11-02","domingo","Finados"]
["2031-11-15","sábado","Proclamação da República"]
["2031-11-20","quinta-feira","Dia Nacional de Zumbi e da Consciência Negra"]
["2031-12-25","quinta-feira","Natal"]
["2032-01-01","quinta-feira","Confraternização Universal"]
["2032-02-09","segunda-feira","Carnaval"]
["2032-02-10","terça-feira","Carnaval"]
["2032-03-26","sexta-feira","Paixão de Cristo"]
["2032-04-21","quarta-feira","Tiradentes"]
["2032-05-01","sábado","Dia do Trabalho"]
["2032-05-27","quinta-feira","Corpus Christi"]
["2032-09-07","terça-feira","Independência do Brasil"]
["2032-10-12","terça-feira","Nossa Sr.a Aparecida - Padroeira do Brasil"]
["2032-11-02","terça-feira","Finados"]
["2032-11-15","segunda-feira","Proclamação da República"]
["2032-11-20","sábado","Dia Nacional de Zumbi e da Consciência Negra"]
["2032-12-25","sábado","Natal"]
["2033-01-01","sábado","Confraternização Universal"]
["2033-02-28","segunda-feira","Carnaval"]
["2033-03-01","terça-feira","Carnaval"]
["2033-04-15","sexta-feira","Paixão de Cristo"]
["2033-04-21","quinta-feira","Tiradentes"]
["2033-05-01","domingo","Dia do Trabalho"]
["2033-06-16","quinta-feira","Corpus Christi"]
["2033-09-07","quarta-feira","Independência do Brasil"]
["2033-10-12","quarta-feira","Nossa Sr.a Aparecida - Padroeira do Brasil"]
["2033-11-02","quarta-feira","Finados"]
["2033-11-15","terça-feira","Proclamação da República"]
["2033-11-20","domingo","Dia Nacional de Zumbi e da Consciência Negra"]
["2033-12-25","domingo","Natal"]
["2034-01-01","domingo","Confraternização Universal"]
["2034-02-20","segunda-feira","Carnaval"]
["2034-02-21","terça-feira","Carnaval"]
["2034-04-07","sexta-feira","Paixão de Cristo"]
["2034-04-21","sexta-feira","Tiradentes"]
["2034-05-01","segunda-feira","Dia do Trabalho"]
["2034-06-08","quinta-feira","Corpus Christi"]
["2034-09-07","quinta-feira","Independência do Brasil"]
["2034-10-12","quinta-feira","Nossa Sr.a Aparecida - Padroeira do Brasil"]
["2034-11-02","quinta-feira","Finados"]
["2034-11-15","quarta-feira","Proclamação da República"]
["2034-11-20","segunda-feira","Dia Nacional de Zumbi e da Consciência Negra"]
["2034-12-25","segunda-feira","Natal"]
["2035-01-01","segunda-feira","Confraternização Universal"]
["2035-02-05","segunda-feira","Carnaval"]
["2035-02-06","terça-feira","Carnaval"]
["2035-03-23","sexta-feira","Paixão de Cristo"]
["2035-04-21","sábado","Tiradentes"]
["2035-05-01","terça-feira","Dia do Trabalho"]
["2035-05-24","quinta-feira","Corpus Christi"]
["2035-09-07","sexta-feira","Independência do Brasil"]
["2035-10-12","sexta-feira","Nossa Sr.a Aparecida - Padroeira do Brasil"]
["2035-11-02","sexta-feira","Finados"]
["2035-11-15","quinta-feira","Proclamação da República"]
["2035-11-20","terça-feira","Dia Nacional de Zumbi e da Consciência Negra"]
["2035-12-25","terça-feira","Natal"]
["2036-01-01","terça-feira","Confraternização Universal"]
["2036-02-25","segunda-feira","Carnaval"]
["2036-02-26","terça-feira","Carnaval"]
["2036-04-11","sexta-feira","Paixão de Cristo"]
["2036-04-21","segunda-feira","Tiradentes"]
["2036-05-01","quinta-feira","Dia do Trabalho"]
["2036-06-12","quinta-feira","Corpus Christi"]
["2036-09-07","domingo","Independência do Brasil"]
["2036-10-12","domingo","Nossa Sr.a Aparecida - Padroeira do Brasil"]
["2036-11-02","domingo","Finados"]
["2036-11-15","sábado","Proclamação da República"]
["2036-11-20","quinta-feira","Dia Nacional de Zumbi e da Consciência Negra"]
["2036-12-25","quinta-feira","Natal"]
["2037-01-01","quinta-feira","Confraternização Universal"]
["2037-02-16","segunda-feira","Carnaval"]
["2037-02-17","terça-feira","Carnaval"]
["2037-04-03","sexta-feira","Paixão de Cristo"]
["2037-04-21","terça-feira","Tiradentes"]
["2037-05-01","sexta-feira","Dia do Trabalho"]
["2037-06-04","quinta-feira","Corpus Christi"]
["2037-09-07","segunda-feira","Independência do Brasil"]
["2037-10-12","segunda-feira","Nossa Sr.a Aparecida - Padroeira do Brasil"]
["2037-11-02","segunda-feira","Finados"]
["2037-11-15","domingo","Proclamação da República"]
["2037-11-20","sexta-feira","Dia Nacional de Zumbi e da Consciência Negra"]
["2037-12-25","sexta-feira","Natal"]
["2038-01-01","sexta-feira","Confraternização Universal"]
["2038-03-08","segunda-feira","Carnaval"]
["2038-03-09","terça-feira","Carnaval"]
["2038-04-21","quarta-feira","Tiradentes"]
["2038-04-23","sexta-feira","Paixão de Cristo"]
["2038-05-01","sábado","Dia do Trabalho"]
["2038-06-24","quinta-feira","Corpus Christi"]
["2038-09-07","terça-feira","Independência do Brasil"]
["2038-10-12","terça-feira","Nossa Sr.a Aparecida - Padroeira do Brasil"]
["2038-11-02","terça-feira","Finados"]
["2038-11-15","segunda-feira","Proclamação da República"]
["2038-11-20","sábado","Dia Nacional de Zumbi e da Consciência Negra"]
["2038-12-25","sábado","Natal"]
["2039-01-01","sábado","Confraternização Universal"]
["2039-02-21","segunda-feira","Carnaval"]
["2039-02-22","terça-feira","Carnaval"]
["2039-04-08","sexta-feira","Paixão de Cristo"]
["2039-04-21","quinta-feira","Tiradentes"]
["2039-05-01","domingo","Dia do Trabalho"]
["2039-06-09","quinta-feira","Corpus Christi"]
["2039-09-07","quarta-feira","Independência do Brasil"]
["2039-10-12","quarta-feira","Nossa Sr.a Aparecida - Padroeira do Brasil"]
["2039-11-02","quarta-feira","Finados"]
["2039-11-15","terça-feira","Proclamação da República"]
["2039-11-20","domingo","Dia Nacional de Zumbi e da Consciência Negra"]
["2039-12-25","domingo","Natal"]
["2040-01-01","domingo","Confraternização Universal"]
["2040-02-13","segunda-feira","Carnaval"]
["2040-02-14","terça-feira","Carnaval"]
["2040-03-30","sexta-feira","Paixão de Cristo"]
["2040-04-21","sábado","Tiradentes"]
["2040-05-01","terça-feira","Dia do Trabalho"]
["2040-05-31","quinta-feira","Corpus Christi"]
["2040-09-07","sexta-feira","Independência do Brasil"]
["2040-10-12","sexta-feira","Nossa Sr.a Aparecida - Padroeira do Brasil"]
["2040-11-02","sexta-feira","Finados"]
["2040-11-15","quinta-feira","Proclamação da República"]
["2040-11-20","terça-feira","Dia Nacional de Zumbi e da Consciência Negra"]
["2040-12-25","terça-feira","Natal"]
["2041-01-01","terça-feira","Confraternização Universal"]
["2041-03-04","segunda-feira","Carnaval"]
["2041-03-05","terça-feira","Carnaval"]
["2041-04-19","sexta-feira","Paixão de Cristo"]
["2041-04-21","domingo","Tiradentes"]
["2041-05-01","quarta-feira","Dia do Trabalho"]
["2041-06-20","quinta-feira","Corpus Christi"]
["2041-09-07","sábado","Independência do Brasil"]
["2041-10-12","sábado","Nossa Sr.a Aparecida - Padroeira do Brasil"]
["2041-11-02","sábado","Finados"]
["2041-11-15","sexta-feira","Proclamação da República"]
["2041-11-20","quarta-feira","Dia Nacional de Zumbi e da Consciência Negra"]
["2041-12-25","quarta-feira","Natal"]
["2042-01-01","quarta-feira","Confraternização Universal"]
["2042-02-17","segunda-feira","Carnaval"]
["2042-02-18","terça-feira","Carnaval"]
["2042-04-04","sexta-feira","Paixão de Cristo"]
["2042-04-21","segunda-feira","Tiradentes"]
["2042-05-01","quinta-feira","Dia do Trabalho"]
["2042-06-05","quinta-feira","Corpus Christi"]
["2042-09-07","domingo","Independência do Brasil"]
["2042-10-12","domingo","Nossa Sr.a Aparecida - Padroeira do Brasil"]
["2042-11-02","domingo","Finados"]
["2042-11-15","sábado","Proclamação da República"]
["2042-11-20","quinta-feira","Dia Nacional de Zumbi e da Consciência Negra"]
["2042-12-25","quinta-feira","Natal"]
["2043-01-01","quinta-feira","Confraternização Universal"]
["2043-02-09","segunda-feira","Carnaval"]
["2043-02-10","terça-feira","Carnaval"]
["2043-03-27","sexta-feira","Paixão de Cristo"]
["2043-04-21","terça-feira","Tiradentes"]
["2043-05-01","sexta-feira","Dia do Trabalho"]
["2043-05-28","quinta-feira","Corpus Christi"]
["2043-09-07","segunda-feira","Independência do Brasil"]
["2043-10-12","segunda-feira","Nossa Sr.a Aparecida - Padroeira do Brasil"]
["2043-11-02","segunda-feira","Finados"]
["2043-11-15","domingo","Proclamação da República"]
["2043-11-20","sexta-feira","Dia Nacional de Zumbi e da Consciência Negra"]
["2043-12-25","sexta-feira","Natal"]
["2044-01-01","sexta-feira","Confraternização Universal"]
["2044-02-29","segunda-feira","Carnaval"]
["2044-03-01","terça-feira","Carnaval"]
["2044-04-15","sexta-feira","Paixão de Cristo"]
["2044-04-21","quinta-feira","Tiradentes"]
["2044-05-01","domingo","Dia do Trabalho"]
["2044-06-16","quinta-feira","Corpus Christi"]
["2044-09-07","quarta-feira","Independência do Brasil"]
["2044-10-12","quarta-feira","Nossa Sr.a Aparecida - Padroeira do Brasil"]
["2044-11-02","quarta-feira","Finados"]
["2044-11-15","terça-feira","Proclamação da República"]
["2044-11-20","domingo","Dia Nacional de Zumbi e da Consciência Negra"]
["2044-12-25","domingo","Natal"]
["2045-01-01","domingo","Confraternização Universal"]
["2045-02-20","segunda-feira","Carnaval"]
["2045-02-21","terça-feira","Carnaval"]
["2045-04-07","sexta-feira","Paixão de Cristo"]
["2045-04-21","sexta-feira","Tiradentes"]
["2045-05-01","segunda-feira","Dia do Trabalho"]
["2045-06-08","quinta-feira","Corpus Christi"]
["2045-09-07","quinta-feira","Independência do Brasil"]
["2045-10-12","quinta-feira","Nossa Sr.a Aparecida - Padroeira do Brasil"]
["2045-11-02","quinta-feira","Finados"]
["2045-11-15","quarta-feira","Proclamação da República"]
["2045-11-20","segunda-feira","Dia Nacional de Zumbi e da Consciência Negra"]
["2045-12-25","segunda-feira","Natal"]
["2046-01-01","segunda-feira","Confraternização Universal"]
["2046-02-05","segunda-feira","Carnaval"]
["2046-02-06","terça-feira","Carnaval"]
["2046-03-23","sexta-feira","Paixão de Cristo"]
["2046-04-21","sábado","Tiradentes"]
["2046-05-01","terça-feira","Dia do Trabalho"]
["2046-05-24","quinta-feira","Corpus Christi"]
["2046-09-07","sexta-feira","Independência do Brasil"]
["2046-10-12","sexta-feira","Nossa Sr.a Aparecida - Padroeira do Brasil"]
["2046-11-02","sexta-feira","Finados"]
["2046-11-15","quinta-feira","Proclamação da República"]
["2046-11-20","terça-feira","Dia Nacional de Zumbi e da Consciência Negra"]
["2046-12-25","terça-feira","Natal"]
["2047-01-01","terça-feira","Confraternização Universal"]
["2047-02-25","segunda-feira","Carnaval"]
["2047-02-26","terça-feira","Carnaval"]
["2047-04-12","sexta-feira","Paixão de Cristo"]
["2047-04-21","domingo","Tiradentes"]
["2047-05-01","quarta-feira","Dia do Trabalho"]
["2047-06-13","quinta-feira","Corpus Christi"]
["2047-09-07","sábado","Independência do Brasil"]
["2047-10-12","sábado","Nossa Sr.a Aparecida - Padroeira do Brasil"]
["2047-11-02","sábado","Finados"]
["2047-11-15","sexta-feira","Proclamação da República"]
["2047-11-20","quarta-feira","Dia Nacional de Zumbi e da Consciência Negra"]
["2047-12-25","quarta-feira","Natal"]
["2048-01-01","quarta-feira","Confraternização Universal"]
["2048-02-17","segunda-feira","Carnaval"]
["2048-02-18","terça-feira","Carnaval"]
["2048-04-03","sexta-feira","Paixão de Cristo"]
["2048-04-21","terça-feira","Tiradentes"]
["2048-05-01","sexta-feira","Dia do Trabalho"]
["2048-06-04","quinta-feira","Corpus Christi"]
["2048-09-07","segunda-feira","Independência do Brasil"]
["2048-10-12","segunda-feira","Nossa Sr.a Aparecida - Padroeira do Brasil"]
["2048-11-02","segunda-feira","Finados"]
["2048-11-15","domingo","Proclamação da República"]
["2048-11-20","sexta-feira","Dia Nacional de Zumbi e da Consciência Negra"]
["2048-12-25","sexta-feira","Natal"]
["2049-01-01","sexta-feira","Confraternização Universal"]
["2049-03-01","segunda-feira","Carnaval"]
["2049-03-02","terça-feira","Carnaval"]
["2049-04-16","sexta-feira","Paixão de Cristo"]
["2049-04-21","quarta-feira","Tiradentes"]
["2049-05-01","sábado","Dia do Trabalho"]
["2049-06-17","quinta-feira","Corpus Christi"]
["2049-09-07","terça-feira","Independência do Brasil"]
["2049-10-12","terça-feira","Nossa Sr.a Aparecida - Padroeira do Brasil"]
["2049-11-02","terça-feira","Finados"]
["2049-11-15","segunda-feira","Proclamação da República"]
["2049-11-20","sábado","Dia Nacional de Zumbi e da Consciência Negra"]
["2049-12-25","sábado","Natal"]
["2050-01-01","sábado","Confraternização Universal"]
["2050-02-21","segunda-feira","Carnaval"]
["2050-02-22","terça-feira","Carnaval"]
["2050-04-08","sexta-feira","Paixão de Cristo"]
["2050-04-21","quinta-feira","Tiradentes"]
["2050-05-01","domingo","Dia do Trabalho"]
["2050-06-09","quinta-feira","Corpus Christi"]
["2050-09-07","quarta-feira","Independência do Brasil"]
["2050-10-12","quarta-feira","Nossa Sr.a Aparecida - Padroeira do Brasil"]
["2050-11-02","quarta-feira","Finados"]
["2050-11-15","terça-feira","Proclamação da República"]
["2050-11-20","domingo","Dia Nacional de Zumbi e da Consciência Negra"]
["2050-12-25","domingo","Natal"]
["2051-01-01","domingo","Confraternização Universal"]
["2051-02-13","segunda-feira","Carnaval"]
["2051-02-14","terça-feira","Carnaval"]
["2051-03-31","sexta-feira","Paixão de Cristo"]
["2051-04-21","sexta-feira","Tiradentes"]
["2051-05-01","segunda-feira","Dia do Trabalho"]
["2051-06-01","quinta-feira","Corpus Christi"]
["2051-09-07","quinta-feira","Independência do Brasil"]
["2051-10-12","quinta-feira","Nossa Sr.a Aparecida - Padroeira do Brasil"]
["2051-11-02","quinta-feira","Finados"]
["2051-11-15","quarta-feira","Proclamação da República"]
["2051-11-20","segunda-feira","Dia Nacional de Zumbi e da Consciência Negra"]
["2051-12-25","segunda-feira","Natal"]
["2052-01-01","segunda-feira","Confraternização Universal"]
["2052-03-04","segunda-feira","Carnaval"]
["2052-03-05","terça-feira","Carnaval"]
["2052-04-19","sexta-feira","Paixão de Cristo"]
["2052-04-21","domingo","Tiradentes"]
["2052-05-01","quarta-feira","Dia do Trabalho"]
["2052-06-20","quinta-feira","Corpus Christi"]
["2052-09-07","sábado","Independência do Brasil"]
["2052-10-12","sábado","Nossa Sr.a Aparecida - Padroeira do Brasil"]
["2052-11-02","sábado","Finados"]
["2052-11-15","sexta-feira","Proclamação da República"]
["2052-11-20","quarta-feira","Dia Nacional de Zumbi e da Consciência Negra"]
["2052-12-25","quarta-feira","Natal"]
["2053-01-01","quarta-feira","Confraternização Universal"]
["2053-02-17","segunda-feira","Carnaval"]
["2053-02-18","terça-feira","Carnaval"]
["2053-04-04","sexta-feira","Paixão de Cristo"]
["2053-04-21","segunda-feira","Tiradentes"]
["2053-05-01","quinta-feira","Dia do Trabalho"]
["2053-06-05","quinta-feira","Corpus Christi"]
["2053-09-07","domingo","Independência do Brasil"]
["2053-10-12","domingo","Nossa Sr.a Aparecida - Padroeira do Brasil"]
["2053-11-02","domingo","Finados"]
["2053-11-15","sábado","Proclamação da República"]
["2053-11-20","quinta-feira","Dia Nacional de Zumbi e da Consciência Negra"]
["2053-12-25","quinta-feira","Natal"]
["2054-01-01","quinta-feira","Confraternização Universal"]
["2054-02-09","segunda-feira","Carnaval"]
["2054-02-10","terça-feira","Carnaval"]
["2054-03-27","sexta-feira","Paixão de Cristo"]
["2054-04-21","terça-feira","Tiradentes"]
["2054-05-01","sexta-feira","Dia do Trabalho"]
["2054-05-28","quinta-feira","Corpus Christi"]
["2054-09-07","segunda-feira","Independência do Brasil"]
["2054-10-12","segunda-feira","Nossa Sr.a Aparecida - Padroeira do Brasil"]
["2054-11-02","segunda-feira","Finados"]
["2054-11-15","domingo","Proclamação da República"]
["2054-11-20","sexta-feira","Dia Nacional de Zumbi e da Consciência Negra"]
["2054-12-25","sexta-feira","Natal"]
["2055-01-01","sexta-feira","Confraternização Universal"]
["2055-03-01","segunda-feira","Carnaval"]
["2055-03-02","terça-feira","Carnaval"]
["2055-04-16","sexta-feira","Paixão de Cristo"]
["2055-04-21","quarta-feira","Tiradentes"]
["2055-05-01","sábado","Dia do Trabalho"]
["2055-06-17","quinta-feira","Corpus Christi"]
["2055-09-07","terça-feira","Independência do Brasil"]
["2055-10-12","terça-feira","Nossa Sr.a Aparecida - Padroeira do Brasil"]
["2055-11-02","terça-feira","Finados"]
["2055-11-15","segunda-feira","Proclamação da República"]
["2055-11-20","sábado","Dia Nacional de Zumbi e da Consciência Negra"]
["2055-12-25","sábado","Natal"]
["2056-01-01","sábado","Confraternização Universal"]
["2056-02-14","segunda-feira","Carnaval"]
["2056-02-15","terça-feira","Carnaval"]
["2056-03-31","sexta-feira","Paixão de Cristo"]
["2056-04-21","sexta-feira","Tiradentes"]
["2056-05-01","segunda-feira","Dia do Trabalho"]
["2056-06-01","quinta-feira","Corpus Christi"]
["2056-09-07","quinta-feira","Independência do Brasil"]
["2056-10-12","quinta-feira","Nossa Sr.a Aparecida - Padroeira do Brasil"]
["2056-11-02","quinta-feira","Finados"]
["2056-11-15","quarta-feira","Proclamação da República"]
["2056-11-20","segunda-feira","Dia Nacional de Zumbi e da Consciência Negra"]
["2056-12-25","segunda-feira","Natal"]
["2057-01-01","segunda-feira","Confraternização Universal"]
["2057-03-05","segunda-feira","Carnaval"]
["2057-03-06","terça-feira","Carnaval"]
["2057-04-20","sexta-feira","Paixão de Cristo"]
["2057-04-21","sábado","Tiradentes"]
["2057-05-01","terça-feira","Dia do Trabalho"]
["2057-06-21","quinta-feira","Corpus Christi"]
["2057-09-07","sexta-feira","Independência do Brasil"]
["2057-10-12","sexta-feira","Nossa Sr.a Aparecida - Padroeira do Brasil"]
["2057-11-02","sexta-feira","Finados"]
["2057-11-15","quinta-feira","Proclamação da República"]
["2057-11-20","terça-feira","Dia Nacional de Zumbi e da Consciência Negra"]
["2057-12-25","terça-feira","Natal"]
["2058-01-01","terça-feira","Confraternização Universal"]
["2058-02-25","segunda-feira","Carnaval"]
["2058-02-26","terça-feira","Carnaval"]
["2058-04-12","sexta-feira","Paixão de Cristo"]
["2058-04-21","domingo","Tiradentes"]
["2058-05-01","quarta-feira","Dia do Trabalho"]
["2058-06-13","quinta-feira","Corpus Christi"]
["2058-09-07","sábado","Independência do Brasil"]
["2058-10-12","sábado","Nossa Sr.a Aparecida - Padroeira do Brasil"]
["2058-11-02","sábado","Finados"]
["2058-11-15","sexta-feira","Proclamação da República"]
["2058-11-20","quarta-feira","Dia Nacional de Zumbi e da Consciência Negra"]
["2058-12-25","quarta-feira","Natal"]
["2059-01-01","quarta-feira","Confraternização Universal"]
["2059-02-10","segunda-feira","Carnaval"]
["2059-02-11","terça-feira","Carnaval"]
["2059-03-28","sexta-feira","Paixão de Cristo"]
["2059-04-21","segunda-feira","Tiradentes"]
["2059-05-01","quinta-feira","Dia do Trabalho"]
["2059-05-29","quinta-feira","Corpus Christi"]
["2059-09-07","domingo","Independência do Brasil"]
["2059-10-12","domingo","Nossa Sr.a Aparecida - Padroeira do Brasil"]
["2059-11-02","domingo","Finados"]
["2059-11-15","sábado","Proclamação da República"]
["2059-11-20","quinta-feira","Dia Nacional de Zumbi e da Consciência Negra"]
["2059-12-25","quinta-feira","Natal"]
["2060-01-01","quinta-feira","Confraternização Universal"]
["2060-03-01","segunda-feira","Carnaval"]
["2060-03-02","terça-feira","Carnaval"]
["2060-04-16","sexta-feira","Paixão de Cristo"]
["2060-04-21","quarta-feira","Tiradentes"]
["2060-05-01","sábado","Dia do Trabalho"]
["2060-06-17","quinta-feira","Corpus Christi"]
["2060-09-07","terça-feira","Independência do Brasil"]
["2060-10-12","terça-feira","Nossa Sr.a Aparecida - Padroeira do Brasil"]
["2060-11-02","terça-feira","Finados"]
["2060-11-15","segunda-feira","Proclamação da República"]
["2060-11-20","sábado","Dia Nacional de Zumbi e da Consciência Negra"]
["2060-12-25","sábado","Natal"]
["2061-01-01","sábado","Confraternização Universal"]
["2061-02-21","segunda-feira","Carnaval"]
["2061-02-22","terça-feira","Carnaval"]
["2061-04-08","sexta-feira","Paixão de Cristo"]
["2061-04-21","quinta-feira","Tiradentes"]
["2061-05-01","domingo","Dia do Trabalho"]
["2061-06-09","quinta-feira","Corpus Christi"]
["2061-09-07","quarta-feira","Independência do Brasil"]
["2061-10-12","quarta-feira","Nossa Sr.a Aparecida - Padroeira do Brasil"]
["2061-11-02","quarta-feira","Finados"]
["2061-11-15","terça-feira","Proclamação da República"]
["2061-11-20","domingo","Dia Nacional de Zumbi e da Consciência Negra"]
["2061-12-25","domingo","Natal"]
["2062-01-01","domingo","Confraternização Universal"]
["2062-02-06","segunda-feira","Carnaval"]
["2062-02-07","terça-feira","Carnaval"]
["2062-03-24","sexta-feira","Paixão de Cristo"]
["2062-04-21","sexta-feira","Tiradentes"]
["2062-05-01","segunda-feira","Dia do Trabalho"]
["2062-05-25","quinta-feira","Corpus Christi"]
["2062-09-07","quinta-feira","Independência do Brasil"]
["2062-10-12","quinta-feira","Nossa Sr.a Aparecida - Padroeira do Brasil"]
["2062-11-02","quinta-feira","Finados"]
["2062-11-15","quarta-feira","Proclamação da República"]
["2062-11-20","segunda-feira","Dia Nacional de Zumbi e da Consciência Negra"]
["2062-12-25","segunda-feira","Natal"]
["2063-01-01","segunda-feira","Confraternização Universal"]
["2063-02-26","segunda-feira","Carnaval"]
["2063-02-27","terça-feira","Carnaval"]
["2063-04-13","sexta-feira","Paixão de Cristo"]
["2063-04-21","sábado","Tiradentes"]
["2063-05-01","terça-feira","Dia do Trabalho"]
["2063-06-14","quinta-feira","Corpus Christi"]
["2063-09-07","sexta-feira","Independência do Brasil"]
["2063-10-12","sexta-feira","Nossa Sr.a Aparecida - Padroeira do Brasil"]
["2063-11-02","sexta-feira","Finados"]
["2063-11-15","quinta-feira","Proclamação da República"]
["2063-11-20","terça-feira","Dia Nacional de Zumbi e da Consciência Negra"]
["2063-12-25","terça-feira","Natal"]
["2064-01-01","terça-feira","Confraternização Universal"]
["2064-02-18","segunda-feira","Carnaval"]
["2064-02-19","terça-feira","Carnaval"]
["2064-04-04","sexta-feira","Paixão de Cristo"]
["2064-04-21","segunda-feira","Tiradentes"]
["2064-05-01","quinta-feira","Dia do Trabalho"]
["2064-06-05","quinta-feira","Corpus Christi"]
["2064-09-07","domingo","Independência do Brasil"]
["2064-10-12","domingo","Nossa Sr.a Aparecida - Padroeira do Brasil"]
["2064-11-02","domingo","Finados"]
["2064-11-15","sábado","Proclamação da República"]
["2064-11-20","quinta-feira","Dia Nacional de Zumbi e da Consciência Negra"]
["2064-12-25","quinta-feira","Natal"]
["2065-01-01","quinta-feira","Confraternização Universal"]
["2065-02-09","segunda-feira","Carnaval"]
["2065-02-10","terça-feira","Carnaval"]
["2065-03-27","sexta-feira","Paixão de Cristo"]
["2065-04-21","terça-feira","Tiradentes"]
["2065-05-01","sexta-feira","Dia do Trabalho"]
["2065-05-28","quinta-feira","Corpus Christi"]
["2065-09-07","segunda-feira","Independência do Brasil"]
["2065-10-12","segunda-feira","Nossa Sr.a Aparecida - Padroeira do Brasil"]
["2065-11-02","segunda-feira","Finados"]
["2065-11-15","domingo","Proclamação da República"]
["2065-11-20","sexta-feira","Dia Nacional de Zumbi e da Consciência Negra"]
["2065-12-25","sexta-feira","Natal"]
["2066-01-01","sexta-feira","Confraternização Universal"]
["2066-02-22","segunda-feira","Carnaval"]
["2066-02-23","terça-feira","Carnaval"]
["2066-04-09","sexta-feira","Paixão de Cristo"]
["2066-04-21","quarta-feira","Tiradentes"]
["2066-05-01","sábado","Dia do Trabalho"]
["2066-06-10","quinta-feira","Corpus Christi"]
["2066-09-07","terça-feira","Independência do Brasil"]
["2066-10-12","terça-feira","Nossa Sr.a Aparecida - Padroeira do Brasil"]
["2066-11-02","terça-feira","Finados"]
["2066-11-15","segunda-feira","Proclamação da República"]
["2066-11-20","sábado","Dia Nacional de Zumbi e da Consciência Negra"]
["2066-12-25","sábado","Natal"]
["2067-01-01","sábado","Confraternização Universal"]
["2067-02-14","segunda-feira","Carnaval"]
["2067-02-15","terça-feira","Carnaval"]
["2067-04-01","sexta-feira","Paixão de Cristo"]
["2067-04-21","quinta-feira","Tiradentes"]
["2067-05-01","domingo","Dia do Trabalho"]
["2067-06-02","quinta-feira","Corpus Christi"]
["2067-09-07","quarta-feira","Independência do Brasil"]
["2067-10-12","quarta-feira","Nossa Sr.a Aparecida - Padroeira do Brasil"]
["2067-11-02","quarta-feira","Finados"]
["2067-11-15","terça-feira","Proclamação da República"]
["2067-11-20","domingo","Dia Nacional de Zumbi e da Consciência Negra"]
["2067-12-25","domingo","Natal"]
["2068-01-01","domingo","Confraternização Universal"]
["2068-03-05","segunda-feira","Carnaval"]
["2068-03-06","terça-feira","Carnaval"]
["2068-04-20","sexta-feira","Paixão de Cristo"]
["2068-04-21","sábado","Tiradentes"]
["2068-05-01","terça-feira","Dia do Trabalho"]
["2068-06-21","quinta-feira","Corpus Christi"]
["2068-09-07","sexta-feira","Independência do Brasil"]
["2068-10-12","sexta-feira","Nossa Sr.a Aparecida - Padroeira do Brasil"]
["2068-11-02","sexta-feira","Finados"]
["2068-11-15","quinta-feira","Proclamação da República"]
["2068-11-20","terça-feira","Dia Nacional de Zumbi e da Consciência Negra"]
["2068-12-25","terça-feira","Natal"]
["2069-01-01","terça-feira","Confraternização Universal"]
["2069-02-25","segunda-feira","Carnaval"]
["2069-02-26","terça-feira","Carnaval"]
["2069-04-12","sexta-feira","Paixão de Cristo"]
["2069-04-21","domingo","Tiradentes"]
["2069-05-01","quarta-feira","Dia do Trabalho"]
["2069-06-13","quinta-feira","Corpus Christi"]
["2069-09-07","sábado","Independência do Brasil"]
["2069-10-12","sábado","Nossa Sr.a Aparecida - Padroeira do Brasil"]
["2069-11-02","sábado","Finados"]
["2069-11-15","sexta-feira","Proclamação da República"]
["2069-11-20","quarta-feira","Dia Nacional de Zumbi e da Consciência Negra"]
["2069-12-25","quarta-feira","Natal"]
["2070-01-01","quarta-feira","Confraternização Universal"]
["2070-02-10","segunda-feira","Carnaval"]
["2070-02-11","terça-feira","Carnaval"]
["2070-03-28","sexta-feira","Paixão de Cristo"]
["2070-04-21","segunda-feira","Tiradentes"]
["2070-05-01","quinta-feira","Dia do Trabalho"]
["2070-05-29","quinta-feira","Corpus Christi"]
["2070-09-07","domingo","Independência do Brasil"]
["2070-10-12","domingo","Nossa Sr.a Aparecida - Padroeira do Brasil"]
["2070-11-02","domingo","Finados"]
["2070-11-15","sábado","Proclamação da República"]
["2070-11-20","quinta-feira","Dia Nacional de Zumbi e da Consciência Negra"]
["2070-12-25","quinta-feira","Natal"]
["2071-01-01","quinta-feira","Confraternização Universal"]
["2071-03-02","segunda-feira","Carnaval"]
["2071-03-03","terça-feira","Carnaval"]
["2071-04-17","sexta-feira","Paixão de Cristo"]
["2071-04-21","terça-feira","Tiradentes"]
["2071-05-01","sexta-feira","Dia do Trabalho"]
["2071-06-18","quinta-feira","Corpus Christi"]
["2071-09-07","segunda-feira","Independência do Brasil"]
["2071-10-12","segunda-feira","Nossa Sr.a Aparecida - Padroeira do Brasil"]
["2071-11-02","segunda-feira","Finados"]
["2071-11-15","domingo","Proclamação da República"]
["2071-11-20","sexta-feira","Dia Nacional de Zumbi e da Consciência Negra"]
["2071-12-25","sexta-feira","Natal"]
["2072-01-01","sexta-feira","Confraternização Universal"]
["2072-02-22","segunda-feira","Carnaval"]
["2072-02-23","terça-feira","Carnaval"]
["2072-04-08","sexta-feira","Paixão de Cristo"]
["2072-04-21","quinta-feira","Tiradentes"]
["2072-05-01","domingo","Dia do Trabalho"]
["2072-06-09","quinta-feira","Corpus Christi"]
["2072-09-07","quarta-feira","Independência do Brasil"]
["2072-10-12","quarta-feira","Nossa Sr.a Aparecida - Padroeira do Brasil"]
["2072-11-02","quarta-feira","Finados"]
["2072-11-15","terça-feira","Proclamação da República"]
["2072-11-20","domingo","Dia Nacional de Zumbi e da Consciência Negra"]
["2072-12-25","domingo","Natal"]
["2073-01-01","domingo","Confraternização Universal"]
["2073-02-06","segunda-feira","Carnaval"]
["2073-02-07","terça-feira","Carnaval"]
["2073-03-24","sexta-feira","Paixão de Cristo"]
["2073-04-21","sexta-feira","Tiradentes"]
["2073-05-01","segunda-feira","Dia do Trabalho"]
["2073-05-25","quinta-feira","Corpus Christi"]
["2073-09-07","quinta-feira","Independência do Brasil"]
["2073-10-12","quinta-feira","Nossa Sr.a Aparecida - Padroeira do Brasil"]
["2073-11-02","quinta-feira","Finados"]
["2073-11-15","quarta-feira","Proclamação da República"]
["2073-11-20","segunda-feira","Dia Nacional de Zumbi e da Consciência Negra"]
["2073-12-25","segunda-feira","Natal"]
["2074-01-01","segunda-feira","Confraternização Universal"]
["2074-02-26","segunda-feira","Carnaval"]
["2074-02-27","terça-feira","Carnaval"]
["2074-04-13","sexta-feira","Paixão de Cristo"]
["2074-04-21","sábado","Tiradentes"]
["2074-05-01","terça-feira","Dia do Trabalho"]
["2074-06-14","quinta-feira","Corpus Christi"]
["2074-09-07","sexta-feira","Independência do Brasil"]
["2074-10-12","sexta-feira","Nossa Sr.a Aparecida - Padroeira do Brasil"]
["2074-11-02","sexta-feira","Finados"]
["2074-11-15","quinta-feira","Proclamação da República"]
["2074-11-20","terça-feira","Dia Nacional de Zumbi e da Consciência Negra"]
["2074-12-25","terça-feira","Natal"]
["2075-01-01","terça-feira","Confraternização Universal"]
["2075-02-18","segunda-feira","Carnaval"]
["2075-02-19","terça-feira","Carnaval"]
["2075-04-05","sexta-feira","Paixão de Cristo"]
["2075-04-21","domingo","Tiradentes"]
["2075-05-01","quarta-feira","Dia do Trabalho"]
["2075-06-06","quinta-feira","Corpus Christi"]
["2075-09-07","sábado","Independência do Brasil"]
["2075-10-12","sábado","Nossa Sr.a Aparecida - Padroeira do Brasil"]
["2075-11-02","sábado","Finados"]
["2075-11-15","sexta-feira","Proclamação da República"]
["2075-11-20","quarta-feira","Dia Nacional de Zumbi e da Consciência Negra"]
["2075-12-25","quarta-feira","Natal"]
["2076-01-01","quarta-feira","Confraternização Universal"]
["2076-03-02","segunda-feira","Carnaval"]
["2076-03-03","terça-feira","Carnaval"]
["2076-04-17","sexta-feira","Paixão de Cristo"]
["2076-04-21","terça-feira","Tiradentes"]
["2076-05-01","sexta-feira","Dia do Trabalho"]
["2076-06-18","quinta-feira","Corpus Christi"]
["2076-09-07","segunda-feira","Independência do Brasil"]
["2076-10-12","segunda-feira","Nossa Sr.a Aparecida - Padroeira do Brasil"]
["2076-11-02","segunda-feira","Finados"]
["2076-11-15","domingo","Proclamação da República"]
["2076-11-20","sexta-feira","Dia Nacional de Zumbi e da Consciência Negra"]
["2076-12-25","sexta-feira","Natal"]
["2077-01-01","sexta-feira","Confraternização Universal"]
["2077-02-22","segunda-feira","Carnaval"]
["2077-02-23","terça-feira","Carnaval"]
["2077-04-09","sexta-feira","Paixão de Cristo"]
["2077-04-21","quarta-feira","Tiradentes"]
["2077-05-01","sábado","Dia do Trabalho"]
["2077-06-10","quinta-feira","Corpus Christi"]
["2077-09-07","terça-feira","Independência do Brasil"]
["2077-10-12","terça-feira","Nossa Sr.a Aparecida - Padroeira do Brasil"]
["2077-11-02","terça-feira","Finados"]
["2077-11-15","segunda-feira","Proclamação da República"]
["2077-11-20","sábado","Dia Nacional de Zumbi e da Consciência Negra"]
["2077-12-25","sábado","Natal"]
["2078-01-01","sábado","Confraternização Universal"]
["2078-02-14","segunda-feira","Carnaval"]
["2078-02-15","terça-feira","Carnaval"]
["2078-04-01","sexta-feira","Paixão de Cristo"]
["2078-04-21","quinta-feira","Tiradentes"]
["2078-05-01","domingo","Dia do Trabalho"]
["2078-06-02","quinta-feira","Corpus Christi"]
["2078-09-07","quarta-feira","Independência do Brasil"]
["2078-10-12","quarta-feira","Nossa Sr.a Aparecida - Padroeira do Brasil"]
["2078-11-02","quarta-feira","Finados"]
["2078-11-15","terça-feira","Proclamação da República"]
["2078-11-20","domingo","Dia Nacional de Zumbi e da Consciência Negra"]
["2078-12-25","domingo","Natal"]
["2079-01-01","domingo","Confraternização Universal"]
["2079-03-06","segunda-feira","Carnaval"]
["2079-03-07","terça-feira","Carnaval"]
["2079-04-21","sexta-feira","Paixão de Cristo"]
["2079-04-21","sexta-feira","Tiradentes"]
["2079-05-01","segunda-feira","Dia do Trabalho"]
["2079-06-22","quinta-feira","Corpus Christi"]
["2079-09-07","quinta-feira","Independência do Brasil"]
["2079-10-12","quinta-feira","Nossa Sr.a Aparecida - Padroeira do Brasil"]
["2079-11-02","quinta-feira","Finados"]
["2079-11-15","quarta-feira","Proclamação da República"]
["2079-11-20","segunda-feira","Dia Nacional de Zumbi e da Consciência Negra"]
["2079-12-25","segunda-feira","Natal"]
["2080-01-01","segunda-feira","Confraternização Universal"]
["2080-02-19","segunda-feira","Carnaval"]
["2080-02-20","terça-feira","Carnaval"]
["2080-04-05","sexta-feira","Paixão de Cristo"]
["2080-04-21","domingo","Tiradentes"]
["2080-05-01","quarta-feira","Dia do Trabalho"]
["2080-06-06","quinta-feira","Corpus Christi"]
["2080-09-07","sábado","Independência do Brasil"]
["2080-10-12","sábado","Nossa Sr.a Aparecida - Padroeira do Brasil"]
["2080-11-02","sábado","Finados"]
["2080-11-15","sexta-feira","Proclamação da República"]
["2080-11-20","quarta-feira","Dia Nacional de Zumbi e da Consciência Negra"]
["2080-12-25","quarta-feira","Natal"]
["2081-01-01","quarta-feira","Confraternização Universal"]
["2081-02-10","segunda-feira","Carnaval"]
["2081-02-11","terça-feira","Carnaval"]
["2081-03-28","sexta-feira","Paixão de Cristo"]
["2081-04-21","segunda-feira","Tiradentes"]
["2081-05-01","quinta-feira","Dia do Trabalho"]
["2081-05-29","quinta-feira","Corpus Christi"]
["2081-09-07","domingo","Independência do Brasil"]
["2081-10-12","domingo","Nossa Sr.a Aparecida - Padroeira do Brasil"]
["2081-11-02","domingo","Finados"]
["2081-11-15","sábado","Proclamação da República"]
["2081-11-20","quinta-feira","Dia Nacional de Zumbi e da Consciência Negra"]
["2081-12-25","quinta-feira","Natal"]
["2082-01-01","quinta-feira","Confraternização Universal"]
["2082-03-02","segunda-feira","Carnaval"]
["2082-03-03","terça-feira","Carnaval"]
["2082-04-17","sexta-feira","Paixão de Cristo"]
["2082-04-21","terça-feira","Tiradentes"]
["2082-05-01","sexta-feira","Dia do Trabalho"]
["2082-06-18","quinta-feira","Corpus Christi"]
["2082-09-07","segunda-feira","Independência do Brasil"]
["2082-10-12","segunda-feira","Nossa Sr.a Aparecida - Padroeira do Brasil"]
["2082-11-02","segunda-feira","Finados"]
["2082-11-15","domingo","Proclamação da República"]
["2082-11-20","sexta-feira","Dia Nacional de Zumbi e da Consciência Negra"]
["2082-12-25","sexta-feira","Natal"]
["2083-01-01","sexta-feira","Confraternização Universal"]
["2083-02-15","segunda-feira","Carnaval"]
["2083-02-16","terça-feira","Carnaval"]
["2083-04-02","sexta-feira","Paixão de Cristo"]
["2083-04-21","quarta-feira","Tiradentes"]
["2083-05-01","sábado","Dia do Trabalho"]
["2083-06-03","quinta-feira","Corpus Christi"]
["2083-09-07","terça-feira","Independência do Brasil"]
["2083-10-12","terça-feira","Nossa Sr.a Aparecida - Padroeira do Brasil"]
["2083-11-02","terça-feira","Finados"]
["2083-11-15","segunda-feira","Proclamação da República"]
["2083-11-20","sábado","Dia Nacional de Zumbi e da Consciência Negra"]
["2083-12-25","sábado","Natal"]
["2084-01-01","sábado","Confraternização Universal"]
["2084-02-07","segunda-feira","Carnaval"]
["2084-02-08","terça-feira","Carnaval"]
["2084-03-24","sexta-feira","Paixão de Cristo"]
["2084-04-21","sexta-feira","Tiradentes"]
["2084-05-01","segunda-feira","Dia do Trabalho"]
["2084-05-25","quinta-feira","Corpus Christi"]
["2084-09-07","quinta-feira","Independência do Brasil"]
["2084-10-12","quinta-feira","Nossa Sr.a Aparecida - Padroeira do Brasil"]
["2084-11-02","quinta-feira","Finados"]
["2084-11-15","quarta-feira","Proclamação da República"]
["2084-11-20","segunda-feira","Dia Nacional de Zumbi e da Consciência Negra"]
["2084-12-25","segunda-feira","Natal"]
["2085-01-01","segunda-feira","Confraternização Universal"]
["2085-02-26","segunda-feira","Carnaval"]
["2085-02-27","terça-feira","Carnaval"]
["2085-04-13","sexta-feira","Paixão de Cristo"]
["2085-04-21","sábado","Tiradentes"]
["2085-05-01","terça-feira","Dia do Trabalho"]
["2085-06-14","quinta-feira","Corpus Christi"]
["2085-09-07","sexta-feira","Independência do Brasil"]
["2085-10-12","sexta-feira","Nossa Sr.a Aparecida - Padroeira do Brasil"]
["2085-11-02","sexta-feira","Finados"]
["2085-11-15","quinta-feira","Proclamação da República"]
["2085-11-20","terça-feira","Dia Nacional de Zumbi e da Consciência Negra"]
["2085-12-25","terça-feira","Natal"]
["2086-01-01","terça-feira","Confraternização Universal"]
["2086-02-11","segunda-feira","Carnaval"]
["2086-02-12","terça-feira","Carnaval"]
["2086-03-29","sexta-feira","Paixão de Cristo"]
["2086-04-21","domingo","Tiradentes"]
["2086-05-01","quarta-feira","Dia do Trabalho"]
["2086-05-30","quinta-feira","Corpus Christi"]
["2086-09-07","sábado","Independência do Brasil"]
["2086-10-12","sábado","Nossa Sr.a Aparecida - Padroeira do Brasil"]
["2086-11-02","sábado","Finados"]
["2086-11-15","sexta-feira","Proclamação da República"]
["2086-11-20","quarta-feira","Dia Nacional de Zumbi e da Consciência Negra"]
["2086-12-25","quarta-feira","Natal"]
["2087-01-01","quarta-feira","Confraternização Universal"]
["2087-03-03","segunda-feira","Carnaval"]
["2087-03-04","terça-feira","Carnaval"]
["2087-04-18","sexta-feira","Paixão de Cristo"]
["2087-04-21","segunda-feira","Tiradentes"]
["2087-05-01","quinta-feira","Dia do Trabalho"]
["2087-06-19","quinta-feira","Corpus Christi"]
["2087-09-07","domingo","Independência do Brasil"]
["2087-10-12","domingo","Nossa Sr.a Aparecida - Padroeira do Brasil"]
["2087-11-02","domingo","Finados"]
["2087-11-15","sábado","Proclamação da República"]
["2087-11-20","quinta-feira","Dia Nacional de Zumbi e da Consciência Negra"]
["2087-12-25","quinta-feira","Natal"]
["2088-01-01","quinta-feira","Confraternização Universal"]
["2088-02-23","segunda-feira","Carnaval"]
["2088-02-24","terça-feira","Carnaval"]
["2088-04-09","sexta-feira","Paixão de Cristo"]
["2088-04-21","quarta-feira","Tiradentes"]
["2088-05-01","sábado","Dia do Trabalho"]
["2088-06-10","quinta-feira","Corpus Christi"]
["2088-09-07","terça-feira","Independência do Brasil"]
["2088-10-12","terça-feira","Nossa Sr.a Aparecida - Padroeira do Brasil"]
["2088-11-02","terça-feira","Finados"]
["2088-11-15","segunda-feira","Proclamação da República"]
["2088-11-20","sábado","Dia Nacional de Zumbi e da Consciência Negra"]
["2088-12-25","sábado","Natal"]
["2089-01-01","sábado","Confraternização Universal"]
["2089-02-14","segunda-feira","Carnaval"]
["2089-02-15","terça-feira","Carnaval"]
["2089-04-01","sexta-feira","Paixão de Cristo"]
["2089-04-21","quinta-feira","Tiradentes"]
["2089-05-01","domingo","Dia do Trabalho"]
["2089-06-02","quinta-feira","Corpus Christi"]
["2089-09-07","quarta-feira","Independência do Brasil"]
["2089-10-12","quarta-feira","Nossa Sr.a Aparecida - Padroeira do Brasil"]
["2089-11-02","quarta-feira","Finados"]
["2089-11-15","terça-feira","Proclamação da República"]
["2089-11-20","domingo","Dia Nacional de Zumbi e da Consciência Negra"]
["2089-12-25","domingo","Natal"]
["2090-01-01","domingo","Confraternização Universal"]
["2090-02-27","segunda-feira","Carnaval"]
["2090-02-28","terça-feira","Carnaval"]
["2090-04-14","sexta-feira","Paixão de Cristo"]
["2090-04-21","sexta-feira","Tiradentes"]
["2090-05-01","segunda-feira","Dia do Trabalho"]
["2090-06-15","quinta-feira","Corpus Christi"]
["2090-09-07","quinta-feira","Independência do Brasil"]
["2090-10-12","quinta-feira","Nossa Sr.a Aparecida - Padroeira do Brasil"]
["2090-11-02","quinta-feira","Finados"]
["2090-11-15","quarta-feira","Proclamação da República"]
["2090-11-20","segunda-feira","Dia Nacional de Zumbi e da Consciência Negra"]
["2090-12-25","segunda-feira","Natal"]
["2091-01-01","segunda-feira","Confraternização Universal"]
["2091-02-19","segunda-feira","Carnaval"]
["2091-02-20","terça-feira","Carnaval"]
["2091-04-06","sexta-feira","Paixão de Cristo"]
["2091-04-21","sábado","Tiradentes"]
["2091-05-01","terça-feira","Dia do Trabalho"]
["2091-06-07","quinta-feira","Corpus Christi"]
["2091-09-07","sexta-feira","Independência do Brasil"]
["2091-10-12","sexta-feira","Nossa Sr.a Aparecida - Padroeira do Brasil"]
["2091-11-02","sexta-feira","Finados"]
["2091-11-15","quinta-feira","Proclamação da República"]
["2091-11-20","terça-feira","Dia Nacional de Zumbi e da Consciência Negra"]
["2091-12-25","terça-feira","Natal"]
["2092-01-01","terça-feira","Confraternização Universal"]
["2092-02-11","segunda-feira","Carnaval"]
["2092-02-12","terça-feira","Carnaval"]
["2092-03-28","sexta-feira","Paixão de Cristo"]
["2092-04-21","segunda-feira","Tiradentes"]
["2092-05-01","quinta-feira","Dia do Trabalho"]
["2092-05-29","quinta-feira","Corpus Christi"]
["2092-09-07","domingo","Independência do Brasil"]
["2092-10-12","domingo","Nossa Sr.a Aparecida - Padroeira do Brasil"]
["2092-11-02","domingo","Finados"]
["2092-11-15","sábado","Proclamação da República"]
["2092-11-20","quinta-feira","Dia Nacional de Zumbi e da Consciência Negra"]
["2092-12-25","quinta-feira","Natal"]
["2093-01-01","quinta-feira","Confraternização Universal"]
["2093-02-23","segunda-feira","Carnaval"]
["2093-02-24","terça-feira","Carnaval"]
["2093-04-10","sexta-feira","Paixão de Cristo"]
["2093-04-21","terça-feira","Tiradentes"]
["2093-05-01","sexta-feira","Dia do Trabalho"]
["2093-06-11","quinta-feira","Corpus Christi"]
["2093-09-07","segunda-feira","Independência do Brasil"]
["2093-10-12","segunda-feira","Nossa Sr.a Aparecida - Padroeira do Brasil"]
["2093-11-02","segunda-feira","Finados"]
["2093-11-15","domingo","Proclamação da República"]
["2093-11-20","sexta-feira","Dia Nacional de Zumbi e da Consciência Negra"]
["2093-12-25","sexta-feira","Natal"]
["2094-01-01","sexta-feira","Confraternização Universal"]
["2094-02-15","segunda-feira","Carnaval"]
["2094-02-16","terça-feira","Carnaval"]
["2094-04-02","sexta-feira","Paixão de Cristo"]
["2094-04-21","quarta-feira","Tiradentes"]
["2094-05-01","sábado","Dia do Trabalho"]
["2094-06-03","quinta-feira","Corpus Christi"]
["2094-09-07","terça-feira","Independência do Brasil"]
["2094-10-12","terça-feira","Nossa Sr.a Aparecida - Padroeira do Brasil"]
["2094-11-02","terça-feira","Finados"]
["2094-11-15","segunda-feira","Proclamação da República"]
["2094-11-20","sábado","Dia Nacional de Zumbi e da Consciência Negra"]
["2094-12-25","sábado","Natal"]
["2095-01-01","sábado","Confraternização Universal"]
["2095-03-07","segunda-feira","Carnaval"]
["2095-03-08","terça-feira","Carnaval"]
["2095-04-21","quinta-feira","Tiradentes"]
["2095-04-22","sexta-feira","Paixão de Cristo"]
["2095-05-01","domingo","Dia do Trabalho"]
["2095-06-23","quinta-feira","Corpus Christi"]
["2095-09-07","quarta-feira","Independência do Brasil"]
["2095-10-12","quarta-feira","Nossa Sr.a Aparecida - Padroeira do Brasil"]
["2095-11-02","quarta-feira","Finados"]
["2095-11-15","terça-feira","Proclamação da República"]
["2095-11-20","domingo","Dia Nacional de Zumbi e da Consciência Negra"]
["2095-12-25","domingo","Natal"]
["2096-01-01","domingo","Confraternização Universal"]
["2096-02-27","segunda-feira","Carnaval"]
["2096-02-28","terça-feira","Carnaval"]
["2096-04-13","sexta-feira","Paixão de Cristo"]
["2096-04-21","sábado","Tiradentes"]
["2096-05-01","terça-feira","Dia do Trabalho"]
["2096-06-14","quinta-feira","Corpus Christi"]
["2096-09-07","sexta-feira","Independência do Brasil"]
["2096-10-12","sexta-feira","Nossa Sr.a Aparecida - Padroeira do Brasil"]
["2096-11-02","sexta-feira","Finados"]
["2096-11-15","quinta-feira","Proclamação da República"]
["2096-11-20","terça-feira","Dia Nacional de Zumbi e da Consciência Negra"]
["2096-12-25","terça-feira","Natal"]
["2097-01-01","terça-feira","Confraternização Universal"]
["2097-02-11","segunda-feira","Carnaval"]
["2097-02-12","terça-feira","Carnaval"]
["2097-03-29","sexta-feira","Paixão de Cristo"]
["2097-04-21","domingo","Tiradentes"]
["2097-05-01","quarta-feira","Dia do Trabalho"]
["2097-05-30","quinta-feira","Corpus Christi"]
["2097-09-07","sábado","Independência do Brasil"]
["2097-10-12","sábado","Nossa Sr.a Aparecida - Padroeira do Brasil"]
["2097-11-02","sábado","Finados"]
["2097-11-15","sexta-feira","Proclamação da República"]
["2097-11-20","quarta-feira","Dia Nacional de Zumbi e da Consciência Negra"]
["2097-12-25","quarta-feira","Natal"]
["2098-01-01","quarta-feira","Confraternização Universal"]
["2098-03-03","segunda-feira","Carnaval"]
["2098-03-04","terça-feira","Carnaval"]
["2098-04-18","sexta-feira","Paixão de Cristo"]
["2098-04-21","segunda-feira","Tiradentes"]
["2098-05-01","quinta-feira","Dia do Trabalho"]
["2098-06-19","quinta-feira","Corpus Christi"]
["2098-09-07","domingo","Independência do Brasil"]
["2098-10-12","domingo","Nossa Sr.a Aparecida - Padroeira do Brasil"]
["2098-11-02","domingo","Finados"]
["2098-11-15","sábado","Proclamação da República"]
["2098-11-20","quinta-feira","Dia Nacional de Zumbi e da Consciência Negra"]
["2098-12-25","quinta-feira","Natal"]
["2099-01-01","quinta-feira","Confraternização Universal "]
["2099-02-23","segunda-feira","Carnaval"]
["2099-02-24","terça-feira","Carnaval"]
["2099-04-10","sexta-feira","Paixão de Cristo"]
["2099-04-21","terça-feira","Tiradentes"]
["2099-05-01","sexta-feira","Dia do Trabalho"]
["2099-06-11","quinta-feira","Corpus Christi"]
["2099-09-07","segunda-feira","Independência do Brasil"]
["2099-10-12","segunda-feira","Nossa Sr.a Aparecida - Padroeira do Brasil"]
["2099-11-02","segunda-feira","Finados"]
["2099-11-15","domingo","Proclamação da República"]
["2099-11-20","sexta-feira","Dia Nacional de Zumbi e da Consciência Negra"]
["2099-12-25","sexta-feira","Natal"]

{"sheet":"VL_PARC","index":3,"n_rows":1297,"n_cols":153,"rows_kept":1297,"cut":false,"hidden":true,"merged":[]}
["IOF ad",{"$f":"ROUND(3%/365,6)","v":8.2000000000000001E-5},null,null,null,null,null,null,null,null,null,null,null,null,null,null,null,null,null,null,"TETO",null,{"$f":"J16","v":1.4065127144978096E-2},{"$f":"IF($P$2=$AH$4,AH1,AP1)","v":"INSS"},{"$f":"IF($P$2=$AH$4,AI1,AQ1)","v":1.35E-2},{"$f":"IF($P$2=$AH$4,AJ1,AR1)","v":1.8499999999999999E-2},{"$f":"IF($P$2=$AH$4,AK1,AS1)","v":"Port"},{"$f":"'Simulador Port'!E18","v":"FLEX 1"},null,null,null,null,null,"INSS",{"$f":"'Planilha 1'!AI1","v":1.35E-2},{"$f":"'Planilha 1'!AJ1","v":1.8499999999999999E-2},"Port",null,null,null,null,"SIAPE",{"$f":"'Planilha 1'!AQ1","v":1.6E-2},{"$f":"'Planilha 1'!AR1","v":1.7999999999999999E-2},"Port"]
["IOF adic.",3.8E-3,null,null,null,null,null,"CONVÊNIO",null,null,null,null,null,null,null,{"$f":"'Planilha 1'!P2","v":"INSS"},null,null,null,null,"TAXA TETO PONDERADO",{"$f":"((W1*W2)+(Z1*(Z2-W2)))/P3","v":1.5728204465611309E-2},{"$f":"J10","v":60},null,null,{"$f":"P3","v":96},null,null,null,null,null,null,null,null,null,null,null,null,null,null,null,null,96]
[null,null,null,null,null,null,null,null,null,null,null,null,null,null,"Prazo simulado (meses)",{"$f":"'Planilha 1'!P3","v":96},null,null,null,null,null,null,null,"Convenio","TxMax","TxMin","Nome",null,"Fator um jr","Novo Saldo","IOF","TROCO","VLR FIN","Convenio","TxMax","TxMin","Nome","Nome",null,null,null,"Convenio","TxMax","TxMin","Nome","Nome"]
[null,null,null,null,null,null,null,null,null,null,null,null,null,null,null,null,null,null,null,null,"Torco min %",0,{"$f":"IF(AND(X4=\"INSS\",$AB$1=\"NORMAL\",OR(AA4=$AK$8,AA4=$AK$9)),0,IF($I$17<$Y$1,0,IFERROR(IF(AG4<$V$6,0,IF(AND(Z4>$V$2,Y4>$V$2),0,IF(OR(AF4/AD4>$V$4,$AF4>=$V$5),W3+1,0))),0)))","v":0},{"$f":"IF($P$2=$AH$4,AH4,AP4)","v":"INSS"},{"$f":"IF($P$2=$AH$4,AI4,AQ4)","v":1.8499999999999999E-2},{"$f":"IF($P$2=$AH$4,AJ4,AR4)","v":1.78E-2},"Normal",{"$f":"IF($P$2=$AH$4,AL4,AT4)","v":"INSS RfnPort Tx1,850%~1,780% Normal"},{"$f":"(1+MIN(Y4,$V$2))^(1/30)","v":1.0005203285932471},{"$f":"OFFSET($U$32,,ROW()-ROW($AD$4))","v":12195.164292716507},{"$f":"OFFSET($AH$29,,ROW()-ROW($AE$4))","v":86.840907176081586},{"$f":"AD4-AE4-$J$8","v":2108.3234634141481},{"$f":"SUM(AD4,AF4)","v":14303.487756130655},{"$f":"'Planilha 1'!AH4","v":"INSS"},{"$f":"'Planilha 1'!AI4","v":1.8499999999999999E-2},{"$f":"'Planilha 1'!AJ4","v":1.78E-2},{"$f":"'Planilha 1'!AK4","v":"Normal"},{"$f":"'Planilha 1'!AL4","v":"INSS RfnPort Tx1,850%~1,780% Normal"},null,null,null,{"$f":"'Planilha 1'!AP4","v":"SIAPE"},{"$f":"'Planilha 1'!AQ4","v":1.7989999999999999E-2},{"$f":"'Planilha 1'!AR4","v":1.7989999999999999E-2},{"$f":"'Planilha 1'!AS4","v":"Normal"},{"$f":"'Planilha 1'!AT4","v":"SIAPE RfnPort Tx1.799 Normal Web"},null,null,null,{"$f":"AJ4<AI4","v":true}]
[null,null,null,null,null,null,null,null,null,null,null,null,null,null,null,null,null,null,null,null,"Torco min R$",50,{"$f":"IF(AND(X5=\"INSS\",$AB$1=\"NORMAL\",OR(AA5=$AK$8,AA5=$AK$9)),0,IF($I$17<$Y$1,0,IFERROR(IF(AG5<$V$6,0,IF(AND(Z5>$V$2,Y5>$V$2),0,IF(OR(AF5/AD5>$V$4,$AF5>=$V$5),W4+1,0))),0)))","v":0},"INSS",{"$f":"IF($P$2=$AH$4,AI5,AQ5)","v":1.779E-2},{"$f":"IF($P$2=$AH$4,AJ5,AR5)","v":1.7399999999999999E-2},"Flex 1","INSS RfnPort Tx1,779%~1,740% Flex1",{"$f":"(1+MIN(Y5,$V$2))^(1/30)","v":1.0005203285932471},{"$f":"OFFSET($U$32,,ROW()-ROW($AD$4))","v":12195.164292716507},{"$f":"OFFSET($AH$29,,ROW()-ROW($AE$4))","v":86.840907176081586},{"$f":"AD5-AE5-$J$8","v":2108.3234634141481},{"$f":"SUM(AD5,AF5)","v":14303.487756130655},{"$f":"'Planilha 1'!AH5","v":"INSS"},{"$f":"'Planilha 1'!AI5","v":1.779E-2},{"$f":"'Planilha 1'!AJ5","v":1.7399999999999999E-2},{"$f":"'Planilha 1'!AK5","v":"Flex 1"},{"$f":"'Planilha 1'!AL5","v":"INSS RfnPort Tx1,779%~1,740% Flex1"},null,null,null,{"$f":"'Planilha 1'!AP5","v":"SIAPE"},{"$f":"'Planilha 1'!AQ5","v":1.7979999999999999E-2},{"$f":"'Planilha 1'!AR5","v":1.7499999999999998E-2},{"$f":"'Planilha 1'!AS5","v":"Flex 1"},{"$f":"'Planilha 1'!AT5","v":"SIAPE RfnPort Tx1.798 ~ 1.75 Flex 1 Web"}]
[null,null,null,null,null,null,null,null,null,null,"Observação",null,"Tabela",null,"Val Fin Novo","Troco",null,null,null,null,"Ticket Min",2000,0,"INSS",1.7389999999999999E-2,1.7000000000000001E-2,"Flex 2","INSS RfnPort Tx1,739%~1,700% Flex2",1.0005203285932471,12195.164292716507,86.840907176081586,2108.3234634141481,14303.487756130655,{"$f":"'Planilha 1'!AH6","v":"INSS"},{"$f":"'Planilha 1'!AI6","v":1.7389999999999999E-2},{"$f":"'Planilha 1'!AJ6","v":1.7000000000000001E-2},{"$f":"'Planilha 1'!AK6","v":"Flex 2"},{"$f":"'Planilha 1'!AL6","v":"INSS RfnPort Tx1,739%~1,700% Flex2"},null,null,null,{"$f":"'Planilha 1'!AP6","v":"SIAPE"},{"$f":"'Planilha 1'!AQ6","v":1.7489999999999999E-2},{"$f":"'Planilha 1'!AR6","v":1.6999999999999998E-2},{"$f":"'Planilha 1'!AS6","v":"Flex 2"},{"$f":"'Planilha 1'!AT6","v":"SIAPE RfnPort Tx1.749 ~ 1.70 Flex 2 Web"}]
[null,null,null,null,null,null,null,"Data Saldo",{"$f":"'Simulador Port'!C7","v":"2025-09-30"},{"$f":"TODAY()","v":"2025-09-30"},{"$f":"'Simulador Port'!D7","v":0},null,null,null,null,null,null,null,null,null,null,null,0,"INSS",1.6990000000000002E-2,1.6500000000000001E-2,"Flex 3","INSS RfnPort Tx1,699%~1,650% Flex3",{"$f":"(1+MIN(Y7,$V$2))^(1/30)","v":1.0005203285932471},12195.164292716507,86.840907176081586,{"$f":"AD7-AE7-$J$8","v":2108.3234634141481},14303.487756130655,{"$f":"'Planilha 1'!AH7","v":"INSS"},{"$f":"'Planilha 1'!AI7","v":1.6990000000000002E-2},{"$f":"'Planilha 1'!AJ7","v":1.6500000000000001E-2},{"$f":"'Planilha 1'!AK7","v":"Flex 3"},{"$f":"'Planilha 1'!AL7","v":"INSS RfnPort Tx1,699%~1,650% Flex3"},null,null,null,{"$f":"'Planilha 1'!AP7","v":"SIAPE"},{"$f":"'Planilha 1'!AQ7","v":1.6990000000000002E-2},{"$f":"'Planilha 1'!AR7","v":1.6500000000000001E-2},{"$f":"'Planilha 1'!AS7","v":"Flex 3"},{"$f":"'Planilha 1'!AT7","v":"SIAPE RfnPort Tx1.699 ~ 1.65 Flex 3 Web"}]
[null,null,null,null,null,null,null,"Saldo Portado",{"$f":"'Simulador Port'!C8","v":10000},{"$f":"SUM(VL_PARC!J35:J131)","v":9999.9999221262769},{"$f":"T8","v":""},1,{"$f":"IFERROR(VLOOKUP(L8,$W$4:$AF$15,6,0),\"\")","v":"INSS RfnPort Tx1,599%~1,550% Flex5"},null,{"$f":"IFERROR(VLOOKUP(L8,$W$4:$AF$15,8,0),\"\")","v":12195.164292716507},{"$f":"IFERROR(VLOOKUP(L8,$W$4:$AF$15,10,0),\"\")","v":2108.3234634141481},null,{"$f":"O8-$I$8","v":2195.1642927165067},null,{"$f":"IF(OR((J17-I17)/I17>2%,(J17-I17)/I17<-2%),\"Saldo e Parcela não correspondem à taxa informada\",\"\")","v":""},"TAXA TROCO",null,0,"INSS",1.6490000000000001E-2,1.6E-2,"Flex 4","INSS RfnPort Tx1,649%~1,600% Flex4",{"$f":"(1+MIN(Y8,$V$2))^(1/30)","v":1.0005203285932471},{"$f":"OFFSET($U$32,,ROW()-ROW($AD$4))","v":12195.164292716507},86.840907176081586,{"$f":"AD8-AE8-$J$8","v":2108.3234634141481},14303.487756130655,{"$f":"'Planilha 1'!AH8","v":"INSS"},{"$f":"'Planilha 1'!AI8","v":1.6490000000000001E-2},{"$f":"'Planilha 1'!AJ8","v":1.6E-2},{"$f":"'Planilha 1'!AK8","v":"Flex 4"},{"$f":"'Planilha 1'!AL8","v":"INSS RfnPort Tx1,649%~1,600% Flex4"}]
[null,null,null,null,null,null,null,"Valor Parcela",{"$f":"'Simulador Port'!E22","v":250},{"$f":"I9","v":250},{"$f":"'Simulador Port'!D9","v":0},{"$f":"L8+1","v":2},{"$f":"IFERROR(VLOOKUP(L9,$W$4:$AF$15,6,0),\"\")","v":""},null,{"$f":"IFERROR(VLOOKUP(L9,$W$4:$AF$15,8,0),\"\")","v":""},{"$f":"IFERROR(VLOOKUP(L9,$W$4:$AF$15,10,0),\"\")","v":""},null,{"$f":"O9-$I$8","v":{"$error":"#VALUE!"}},null,null,null,null,1,"INSS",1.5990000000000001E-2,1.55E-2,"Flex 5","INSS RfnPort Tx1,599%~1,550% Flex5",1.0005203285932471,12195.164292716507,86.840907176081586,2108.3234634141481,14303.487756130655,{"$f":"'Planilha 1'!AH9","v":"INSS"},{"$f":"'Planilha 1'!AI9","v":1.5990000000000001E-2},{"$f":"'Planilha 1'!AJ9","v":1.55E-2},{"$f":"'Planilha 1'!AK9","v":"Flex 5"},{"$f":"'Planilha 1'!AL9","v":"INSS RfnPort Tx1,599%~1,550% Flex5"}]
[null,null,null,null,null,null,null,"Nº de Parcelas Restantes",{"$f":"'Simulador Port'!C10","v":60},{"$f":"I10","v":60},{"$f":"T10","v":""},{"$f":"L9+1","v":3},"",null,"","",null,{"$error":"#VALUE!"},null,{"$f":"IF(P3-J10<12,\"Contrato com menos de 12 parcelas pagas\",\"\")","v":""},null,null,0,0,0,0,0,0,1,{"$error":"#N/A"},{"$error":"#N/A"},{"$error":"#N/A"},{"$error":"#N/A"},{"$f":"'Planilha 1'!AH10","v":0},{"$f":"'Planilha 1'!AI10","v":0},{"$f":"'Planilha 1'!AJ10","v":0},{"$f":"'Planilha 1'!AK10","v":0},{"$f":"'Planilha 1'!AL10","v":0}]
[null,null,null,null,null,null,null,null,null,null,null,4,"",null,"","",null,{"$error":"#VALUE!"},null,null,null,null,0,0,0,0,0,0,1,{"$error":"#N/A"},{"$error":"#N/A"},{"$error":"#N/A"},{"$error":"#N/A"},{"$f":"'Planilha 1'!AH11","v":0},{"$f":"'Planilha 1'!AI11","v":0},{"$f":"'Planilha 1'!AJ11","v":0},{"$f":"'Planilha 1'!AK11","v":0},{"$f":"'Planilha 1'!AL11","v":0}]
[null,null,null,null,null,null,null,null,null,null,null,5,"",null,"","",null,{"$error":"#VALUE!"},null,null,null,null,0,0,0,0,0,0,1,{"$error":"#N/A"},{"$error":"#N/A"},{"$error":"#N/A"},{"$error":"#N/A"},{"$f":"'Planilha 1'!AH12","v":0},{"$f":"'Planilha 1'!AI12","v":0},{"$f":"'Planilha 1'!AJ12","v":0},{"$f":"'Planilha 1'!AK12","v":0},{"$f":"'Planilha 1'!AL12","v":0},null,null,null,null,null,null,null,null,null,null,";"]
[null,null,null,null,null,null,null,null,null,null,null,6,"",null,"","",null,{"$error":"#VALUE!"},null,null,null,null,0,0,0,0,0,0,1,{"$error":"#N/A"},{"$error":"#N/A"},{"$error":"#N/A"},{"$error":"#N/A"},{"$f":"'Planilha 1'!AH13","v":0},{"$f":"'Planilha 1'!AI13","v":0},{"$f":"'Planilha 1'!AJ13","v":0},{"$f":"'Planilha 1'!AK13","v":0},{"$f":"'Planilha 1'!AL13","v":0}]
[null,null,null,null,null,null,null,null,null,null,null,7,"",null,"","",null,{"$error":"#VALUE!"},null,null,null,null,0,0,0,0,0,0,1,{"$error":"#N/A"},{"$error":"#N/A"},{"$error":"#N/A"},{"$error":"#N/A"},{"$f":"'Planilha 1'!AH14","v":0},{"$f":"'Planilha 1'!AI14","v":0},{"$f":"'Planilha 1'!AJ14","v":0},{"$f":"'Planilha 1'!AK14","v":0},{"$f":"'Planilha 1'!AL14","v":0},null,null,null,null,null,null,null,null,null,null,null,null,null,null,null,null,null,null,null,null,null,null,null,null,null,null,null,null,null,null,null,null,null,null,null,null,null,"Maior Parcela"]
[null,null,null,null,null,null,null,null,null,null,null,8,"",null,"","",null,{"$error":"#VALUE!"},null,null,null,null,0,0,0,0,0,0,1,{"$error":"#N/A"},{"$error":"#N/A"},{"$error":"#N/A"},{"$error":"#N/A"},{"$f":"'Planilha 1'!AH15","v":0},{"$f":"'Planilha 1'!AI15","v":0},{"$f":"'Planilha 1'!AJ15","v":0},{"$f":"'Planilha 1'!AK15","v":0},{"$f":"'Planilha 1'!AL15","v":0},null,null,null,null,null,null,null,null,null,null,null,null,null,null,null,null,null,null,null,null,null,null,null,null,null,null,null,null,null,null,null,null,null,null,null,null,null,"Pzo",{"$f":"I10","v":60}]
[null,null,null,null,null,null,null,null,null,{"$f":"(1+XIRR(VL_PARC!$I$35:$I$131,VL_PARC!$H$35:$H$131))^(360/365)^(30/360)-1","v":1.4065127144978096E-2},null,9,"",null,"","",null,{"$error":"#VALUE!"},null,null,null,null,null,null,null,null,null,null,null,null,null,null,null,null,null,null,null,null,null,null,null,null,null,null,null,null,null,null,null,null,null,null,null,null,null,null,null,null,null,null,null,null,null,null,null,null,null,null,null,null,null,null,null,null,null,"Parcela",{"$f":"BS36","v":250}]
[null,null,null,null,null,null,null,"Taxa de Juros",{"$f":"J17","v":1.4065127144978096E-2},{"$f":"(1+XIRR(VL_PARC!$I$35:$I$131,VL_PARC!$H$35:$H$131))^(360/365)^(30/360)-1","v":1.4065127144978096E-2},{"$f":"T17","v":""},10,"",null,"","",null,{"$error":"#VALUE!"},null,{"$f":"IF(J17<VL_PARC!Y1,\"Taxa original inferior a mínima\",\"\")","v":""}]
[null,null,null,null,null,null,null,"Saldo Calculado pela Taxa",{"$f":"SUM(VL_PARC!K36:K131)","v":9999.9999221262769},{"$f":"SUM(J36:J131)","v":9999.9999221262769},{"$f":"'Simulador Port'!F20","v":0},11,"",null,"","",null,null,null,null,null,null,null,null,null,null,null,null,null,null,null,null,null,null,null,null,null,null,null,null,null,null,null,null,null,null,null,null,null,null,null,null,null,null,null,null,null,null,null,null,null,null,"saldo",14510.8716191106,null,null,null,null,null,null,null,null,null,null,null,"Maior Prazo"]
[null,null,null,null,null,null,null,null,null,null,null,12,"",null,"","",null,null,null,null,null,null,null,null,null,null,null,null,null,null,null,null,null,null,null,null,null,null,null,null,null,null,null,null,null,null,null,null,null,null,null,null,null,null,null,null,null,null,null,null,null,null,null,null,null,null,null,null,null,null,null,null,null,null,null,null,null,1,null,"Maior Prazo",{"$f":"MAX(BX29:EW29)-1","v":2}]
[]
[null,null,null,null,null,null,null,null,null,null,null,null,null,null,null,null,null,null,null,null,null,null,null,null,null,null,null,null,null,null,null,null,null,null,null,null,null,null,null,null,null,null,null,null,null,null,null,null,null,null,null,null,null,null,null,null,null,null,null,null,null,null,null,{"$f":"BL32*1000","v":15.033092538494941}]
[null,null,null,null,null,null,null,"Taxa AP considerando base 365",{"$f":"J16","v":1.4065127144978096E-2},null,null,null,null,null,null,null,null,null,null,null,null,null,null,null,null,null,null,null,null,null,null,null,null,null,null,null,null,null,null,null,null,null,null,null,null,null,null,null,null,null,null,null,null,null,null,null,null,null,null,null,null,null,null,{"$f":"1.55%*1000","v":15.5},{"$f":"BL22-BL21","v":0.46690746150505902}]
[null,null,null,null,null,null,null,"Taxa CET da PORT",{"$f":"J17","v":1.4065127144978096E-2},null,null,null,null,null,null,null,null,null,null,null,null,null,null,null,null,null,null,null,null,null,null,null,null,null,null,null,null,null,null,null,null,null,null,null,null,null,null,null,null,null,null,null,null,null,null,null,null,null,null,null,null,null,null,null,null,null,null,null,null,null,null,null,null,"Teto Conv",{"$f":"Z1","v":1.8499999999999999E-2}]
[null,null,null,null,null,null,null,null,null,null,null,null,null,null,null,null,null,null,null,null,null,null,null,null,null,null,null,null,null,null,null,null,null,null,null,null,null,null,null,null,null,null,null,null,null,null,null,null,null,null,null,null,null,null,null,null,null,null,null,null,null,null,null,null,null,null,null,null,null,null,null,null,null,"Pzo Conv",{"$f":"Z2","v":96},{"$f":"SUM(BX25:EW25)","v":7.2221410324404753E-4}]
[null,null,null,null,null,null,null,null,null,null,";",null,null,null,null,null,null,null,null,null,null,null,null,null,null,null,null,null,null,null,null,null,null,null,null,null,null,null,null,null,null,null,null,null,null,null,null,null,null,null,null,null,null,null,null,null,null,null,null,null,null,null,null,null,null,null,null,null,null,null,null,null,null,null,null,{"$f":"PRODUCT(BX26:BX28)","v":0},{"$f":"PRODUCT(BY26:BY28)","v":0},0,0,0,0,0,0,0,0,0,0,0,0,0,0,0,0,0,0,0,0,0,0,0,0,0,0,0,0,0,0,0,0,0,0,5.6512714497809584E-4,1.5708695826595169E-4,0,0,0,0,0,0,0,0,0,0,0,0,0,0,0,0,0,0,0,0,0,0,0,0,0,0,0,{"$f":"PRODUCT(EK26:EK28)","v":0},0,0,0,0,0,0,0,0,0,0,0,0]
[null,null,null,null,null,null,null,null,null,null,null,null,null,null,null,null,null,null,null,null,null,null,null,null,null,null,null,null,null,null,null,null,null,null,null,null,null,null,null,null,null,null,null,null,null,null,null,null,null,null,null,null,null,null,null,null,null,null,null,null,null,"SEM MUDA PRAZO","SOMAR 1 PARCELA","SOMAR 2 PARCELAS","TIRAR 1 PARCELA","TIRAR 2 PARCELAS",null,null,null,null,null,null,null,"Tx Alvo","Teto Pond",{"$f":"IF(((BX32*BX31)+($BW$23*($BW$24-BX31)))/$BW$24<$BW$23,1,0)","v":0},{"$f":"IF(((BY32*BY31)+($BW$23*($BW$24-BY31)))/$BW$24<$BW$23,1,0)","v":0},0,0,0,0,0,0,0,0,0,0,0,0,0,0,0,0,0,0,0,1,1,1,1,1,1,1,1,1,1,1,1,1,1,1,1,1,1,1,1,1,1,1,1,1,1,1,1,1,1,1,1,1,1,1,1,1,1,1,1,1,1,1,1,{"$f":"IF(((EK32*EK31)+($BW$23*($BW$24-EK31)))/$BW$24<$BW$23,1,0)","v":1},1,1,1,1,1,1,1,1,1,1,1,1]
[null,null,null,null,null,null,null,null,null,null,null,null,null,null,null,null,null,null,null,null,null,null,null,null,null,null,null,null,null,null,null,null,null,null,null,null,null,null,null,null,null,null,null,null,null,{"$f":"XIRR(AU$35:AU$131,$H$35:$H$131)","v":1.9681409001350403E-2},1.9681409001350403E-2,1.9681409001350403E-2,1.9681409001350403E-2,1.9681409001350403E-2,1.9681409001350403E-2,{"$error":"#N/A"},{"$error":"#N/A"},{"$error":"#N/A"},{"$error":"#N/A"},{"$error":"#N/A"},{"$error":"#N/A"},null,null,null,null,{"$f":"IF(K17<>\"\",\"Taxa original inferior a mínima\",\"\")","v":""},{"$f":"IF(BK32<VL_PARC!$Y$1,\"Taxa original inferior a mínima\",\"\")","v":""},{"$f":"IF(BL32<VL_PARC!$Y$1,\"Taxa original inferior a mínima\",\"\")","v":""},{"$f":"IF(BM32<VL_PARC!$Y$1,\"Taxa original inferior a mínima\",\"\")","v":""},{"$f":"IF(BN32<VL_PARC!$Y$1,\"Taxa original inferior a mínima\",\"\")","v":"Taxa original inferior a mínima"},null,null,null,null,null,null,null,null,"VAlid1",{"$f":"IF(BX31>$P$3-12,0,IF(BX31>$I$10,0,1))","v":0},{"$f":"IF(BY31>$P$3-12,0,IF(BY31>$I$10,0,1))","v":0},0,0,0,0,0,0,0,0,0,0,0,0,0,0,0,0,0,0,0,0,0,0,0,0,0,0,0,0,0,0,0,0,0,0,1,1,1,1,1,1,1,1,1,1,1,1,1,1,1,1,1,1,1,1,1,1,1,1,1,1,1,1,1,{"$f":"IF(EK31>$P$3-12,0,IF(EK31>$I$10,0,1))","v":1},1,1,1,1,1,1,1,1,1,1,1,1]
[null,null,null,null,null,null,null,null,null,null,null,null,null,null,null,null,null,null,null,null,null,null,null,null,null,null,null,null,null,null,null,null,null,{"$f":"U32-$J$8","v":2195.1643705902297},{"$f":"V32-$J$8","v":2195.1643705902297},2195.1643705902297,2195.1643705902297,2195.1643705902297,2195.1643705902297,{"$error":"#N/A"},{"$error":"#N/A"},{"$error":"#N/A"},{"$error":"#N/A"},{"$error":"#N/A"},{"$error":"#N/A"},null,null,null,null,null,null,null,null,null,null,null,null,null,null,null,null,null,null,null,null,null,null,null,null,null,null,null,null,"Tx Alvo",{"$f":"Y1","v":1.35E-2},{"$f":"MAX((BX32-$BW$28)*BX27*BX26,0)","v":0},0,0,0,0,0,0,0,0,0,0,0,0,0,0,0,0,0,0,0,0,0,0,0,{"$f":"MAX((CV32-$BW$28)*CV27*CV26,0)","v":0},{"$f":"MAX((CW32-$BW$28)*CW27*CW26,0)","v":0},0,0,0,0,0,0,0,0,0,0,5.6512714497809584E-4,1.5708695826595169E-4,0,0,0,0,0,0,0,0,0,0,0,0,0,0,0,0,0,0,0,0,0,0,0,0,0,0,0,0,0,0,0,0,0,0,0,0,0,0,0,0]
[null,null,null,null,null,null,null,null,null,null,null,null,null,null,null,null,null,null,null,"Taxa REFIN",{"$f":"VLOOKUP(U34,$AA$4:$AC$15,3,0)","v":1.0005203285932471},{"$f":"VLOOKUP(V34,$AA$4:$AC$15,3,0)","v":1.0005203285932471},{"$f":"VLOOKUP(W34,$AA$4:$AC$15,3,0)","v":1.0005203285932471},{"$f":"VLOOKUP(X34,$AA$4:$AC$15,3,0)","v":1.0005203285932471},1.0005203285932471,1.0005203285932471,{"$error":"#N/A"},{"$error":"#N/A"},{"$error":"#N/A"},{"$error":"#N/A"},{"$error":"#N/A"},{"$error":"#N/A"},null,{"$f":"SUM(AH35:AH131)","v":86.840907176081586},{"$f":"SUM(AI35:AI131)","v":86.840907176081586},86.840907176081586,86.840907176081586,86.840907176081586,86.840907176081586,{"$error":"#N/A"},{"$error":"#N/A"},{"$error":"#N/A"},{"$error":"#N/A"},{"$error":"#N/A"},{"$error":"#N/A"},null,{"$f":"(1+AT27)^(30/365)-1","v":1.6032208597900333E-3},1.6032208597900333E-3,1.6032208597900333E-3,1.6032208597900333E-3,1.6032208597900333E-3,1.6032208597900333E-3,{"$error":"#N/A"},{"$error":"#N/A"},{"$error":"#N/A"},{"$error":"#N/A"},{"$error":"#N/A"},{"$error":"#N/A"},null,null,null,null,null,null,null,null,null,null,null,null,null,null,null,null,null,{"$f":"RANK(BX28,$BX$28:$EW$28,0)","v":3},3,3,3,3,3,3,3,3,3,3,3,3,3,3,3,3,3,3,3,3,3,3,3,3,3,3,3,3,3,3,3,3,3,3,3,1,2,3,3,3,3,3,3,3,3,3,3,3,3,3,3,3,3,3,3,3,3,3,3,3,3,3,3,3,{"$f":"RANK(EK28,$BX$28:$EW$28,0)","v":3},3,3,3,3,3,3,3,3,3,3,3,3]
[null,null,null,null,null,null,null,"dt ini fx pmt",{"$f":"EDATE(J31,-1)","v":"2025-10-07"},{"$f":"NETWORKDAYS(EOMONTH(I7,-1)+1,I7,$A$34:$A$1297)","v":22},null,null,null,null,null,null,null,null,null,null,null,null,null,null,null,null,null,null,null,null,null,null,null,null,null,null,null,null,null,null,null,null,null,null,null,null,null,null,null,null,null,null,null,null,null,null,null,null,null,null,null,"dt ini fx pmt",{"$f":"I30","v":"2025-10-07"}]
[null,null,null,null,null,null,null,"Prox Vencimento",null,{"$f":"'Planilha 1'!J31","v":"2025-11-07"},null,null,null,null,null,null,null,null,null,null,{"$f":"U32-$I$8","v":2195.1642927165067},{"$f":"V32-$I$8","v":2195.1642927165067},2195.1642927165067,2195.1642927165067,2195.1642927165067,2195.1642927165067,{"$error":"#N/A"},{"$error":"#N/A"},{"$error":"#N/A"},{"$error":"#N/A"},{"$f":"AE32-$I$8","v":{"$error":"#N/A"}},{"$error":"#N/A"},null,null,null,null,null,null,null,null,null,null,null,null,null,null,null,null,null,null,null,null,null,null,null,null,null,null,null,null,null,"Prox Vencimento",null,{"$f":"J31","v":"2025-11-07"},null,null,null,null,null,{"$f":"(1+BR32)^((365/12)/30)-1","v":1.875933967020349E-2},null,null,null,null,"Pzo",{"$f":"COUNTIFS(BX36:BX131,\">\"&0)","v":96},{"$f":"COUNTIFS(BY36:BY131,\">\"&0)","v":95},{"$f":"COUNTIFS(BZ36:BZ131,\">\"&0)","v":94},93,92,91,90,89,88,87,86,85,84,83,82,81,80,79,78,77,76,75,74,73,72,71,70,69,68,67,66,65,64,63,62,61,60,59,58,57,56,55,54,53,52,51,50,49,48,47,46,45,44,43,42,41,40,39,38,37,36,35,34,33,32,31,{"$f":"COUNTIFS(EL36:EL131,\">\"&0)","v":30},29,28,27,26,25,24,23,22,21,20,19]
[null,null,null,null,null,null,null,"Fator Dia",{"$f":"(1+I17)^(1/30)","v":1.0004656794303521},{"$f":"(1+J17)^(1/30)","v":1.0004656794303521},null,null,null,null,null,null,null,null,null,"Vlr Troco",{"$f":"SUM(U36:U131)","v":12195.164292716507},{"$f":"SUM(V36:V131)","v":12195.164292716507},{"$f":"SUM(W36:W131)","v":12195.164292716507},{"$f":"SUM(X36:X131)","v":12195.164292716507},12195.164292716507,12195.164292716507,{"$error":"#N/A"},{"$error":"#N/A"},{"$error":"#N/A"},{"$error":"#N/A"},{"$error":"#N/A"},{"$error":"#N/A"},null,null,null,null,null,null,null,null,null,null,null,null,null,null,null,null,null,null,null,null,null,null,null,null,null,null,null,null,null,"XITR",{"$f":"(1+XIRR(VL_PARC!BK$35:BK$131,VL_PARC!$BJ$35:$BJ$131))^(30/360)-1","v":1.4656441559752986E-2},{"$f":"(1+XIRR(VL_PARC!BL$35:BL$131,VL_PARC!$BJ$35:$BJ$131))^(30/360)-1","v":1.5033092538494941E-2},{"$f":"(1+XIRR(VL_PARC!BM$35:BM$131,VL_PARC!$BJ$35:$BJ$131))^(30/360)-1","v":1.3848076105671847E-2},{"$f":"(1+XIRR(VL_PARC!BN$35:BN$131,VL_PARC!$BJ$35:$BJ$131))^(30/360)-1","v":1.3414094797118858E-2},null,null,null,{"$f":"BW23","v":1.8499999999999999E-2},{"$f":"(1+XIRR(VL_PARC!BS$35:BS$131,VL_PARC!$BJ$35:$BJ$131))^(30/365)-1","v":1.4065127144978096E-2},null,null,null,"Tx",{"$f":"(1+XIRR(BX35:BX131,VL_PARC!$H$35:$H$131))^(30/365)-1","v":2.1400749672586317E-2},{"$f":"(1+XIRR(BY35:BY131,VL_PARC!$H$35:$H$131))^(30/365)-1","v":2.1304459794159847E-2},{"$f":"(1+XIRR(BZ35:BZ131,VL_PARC!$H$35:$H$131))^(30/365)-1","v":2.1204782687654466E-2},{"$f":"(1+XIRR(CA35:CA131,VL_PARC!$H$35:$H$131))^(30/365)-1","v":2.1101503276363065E-2},{"$f":"(1+XIRR(CB35:CB131,VL_PARC!$H$35:$H$131))^(30/365)-1","v":2.0994468831440516E-2},{"$f":"(1+XIRR(CC35:CC131,VL_PARC!$H$35:$H$131))^(30/365)-1","v":2.0883593935107303E-2},{"$f":"(1+XIRR(CD35:CD131,VL_PARC!$H$35:$H$131))^(30/365)-1","v":2.0768634979767109E-2},{"$f":"(1+XIRR(CE35:CE131,VL_PARC!$H$35:$H$131))^(30/365)-1","v":2.0649494809253044E-2},{"$f":"(1+XIRR(CF35:CF131,VL_PARC!$H$35:$H$131))^(30/365)-1","v":2.0525906553143569E-2},{"$f":"(1+XIRR(CG35:CG131,VL_PARC!$H$35:$H$131))^(30/365)-1","v":2.0397932882921799E-2},{"$f":"(1+XIRR(CH35:CH131,VL_PARC!$H$35:$H$131))^(30/365)-1","v":2.0265115437367198E-2},{"$f":"(1+XIRR(CI35:CI131,VL_PARC!$H$35:$H$131))^(30/365)-1","v":2.0127234084064805E-2},{"$f":"(1+XIRR(CJ35:CJ131,VL_PARC!$H$35:$H$131))^(30/365)-1","v":1.9984152223723628E-2},{"$f":"(1+XIRR(CK35:CK131,VL_PARC!$H$35:$H$131))^(30/365)-1","v":1.9835534093991303E-2},{"$f":"(1+XIRR(CL35:CL131,VL_PARC!$H$35:$H$131))^(30/365)-1","v":1.9681222913937368E-2},{"$f":"(1+XIRR(CM35:CM131,VL_PARC!$H$35:$H$131))^(30/365)-1","v":1.9520849065164159E-2},{"$f":"(1+XIRR(CN35:CN131,VL_PARC!$H$35:$H$131))^(30/365)-1","v":1.935412468540143E-2},{"$f":"(1+XIRR(CO35:CO131,VL_PARC!$H$35:$H$131))^(30/365)-1","v":1.9180856099978216E-2},{"$f":"(1+XIRR(CP35:CP131,VL_PARC!$H$35:$H$131))^(30/365)-1","v":1.9000613441091829E-2},{"$f":"(1+XIRR(CQ35:CQ131,VL_PARC!$H$35:$H$131))^(30/365)-1","v":1.8813175281195971E-2},{"$f":"(1+XIRR(CR35:CR131,VL_PARC!$H$35:$H$131))^(30/365)-1","v":1.861806487133344E-2},{"$f":"(1+XIRR(CS35:CS131,VL_PARC!$H$35:$H$131))^(30/365)-1","v":1.8415150525493029E-2},{"$f":"(1+XIRR(CT35:CT131,VL_PARC!$H$35:$H$131))^(30/365)-1","v":1.8203784933322975E-2},{"$f":"(1+XIRR(CU35:CU131,VL_PARC!$H$35:$H$131))^(30/365)-1","v":1.7983536778451326E-2},{"$f":"(1+XIRR(CV35:CV131,VL_PARC!$H$35:$H$131))^(30/365)-1","v":1.7754084221500266E-2},{"$f":"(1+XIRR(CW35:CW131,VL_PARC!$H$35:$H$131))^(30/365)-1","v":1.7514808366843715E-2},{"$f":"(1+XIRR(CX35:CX131,VL_PARC!$H$35:$H$131))^(30/365)-1","v":1.7265336823399924E-2},{"$f":"(1+XIRR(CY35:CY131,VL_PARC!$H$35:$H$131))^(30/365)-1","v":1.700497684704505E-2},{"$f":"(1+XIRR(CZ35:CZ131,VL_PARC!$H$35:$H$131))^(30/365)-1","v":1.6733141653928252E-2},{"$f":"(1+XIRR(DA35:DA131,VL_PARC!$H$35:$H$131))^(30/365)-1","v":1.6449360302431604E-2},{"$f":"(1+XIRR(DB35:DB131,VL_PARC!$H$35:$H$131))^(30/365)-1","v":1.6152811940893796E-2},{"$f":"(1+XIRR(DC35:DC131,VL_PARC!$H$35:$H$131))^(30/365)-1","v":1.5842948199800144E-2},{"$f":"(1+XIRR(DD35:DD131,VL_PARC!$H$35:$H$131))^(30/365)-1","v":1.5518844441868573E-2},{"$f":"(1+XIRR(DE35:DE131,VL_PARC!$H$35:$H$131))^(30/365)-1","v":1.518020067019954E-2},{"$f":"(1+XIRR(DF35:DF131,VL_PARC!$H$35:$H$131))^(30/365)-1","v":1.4825640761891634E-2},{"$f":"(1+XIRR(DG35:DG131,VL_PARC!$H$35:$H$131))^(30/365)-1","v":1.4454224366648782E-2},{"$f":"(1+XIRR(DH35:DH131,VL_PARC!$H$35:$H$131))^(30/365)-1","v":1.4065127144978096E-2},{"$f":"(1+XIRR(DI35:DI131,VL_PARC!$H$35:$H$131))^(30/365)-1","v":1.3657086958265952E-2},{"$f":"(1+XIRR(DJ35:DJ131,VL_PARC!$H$35:$H$131))^(30/365)-1","v":1.3229129977929244E-2},{"$f":"(1+XIRR(DK35:DK131,VL_PARC!$H$35:$H$131))^(30/365)-1","v":1.2779815438953346E-2},{"$f":"(1+XIRR(DL35:DL131,VL_PARC!$H$35:$H$131))^(30/365)-1","v":1.2307792674061346E-2},{"$f":"(1+XIRR(DM35:DM131,VL_PARC!$H$35:$H$131))^(30/365)-1","v":1.1811799851259686E-2},{"$f":"(1+XIRR(DN35:DN131,VL_PARC!$H$35:$H$131))^(30/365)-1","v":1.1290067352313971E-2},{"$f":"(1+XIRR(DO35:DO131,VL_PARC!$H$35:$H$131))^(30/365)-1","v":1.0741090171941137E-2},{"$f":"(1+XIRR(DP35:DP131,VL_PARC!$H$35:$H$131))^(30/365)-1","v":1.0162824453470165E-2},{"$f":"(1+XIRR(DQ35:DQ131,VL_PARC!$H$35:$H$131))^(30/365)-1","v":9.5538605309466451E-3},{"$f":"(1+XIRR(DR35:DR131,VL_PARC!$H$35:$H$131))^(30/365)-1","v":8.9114151871438896E-3},{"$f":"(1+XIRR(DS35:DS131,VL_PARC!$H$35:$H$131))^(30/365)-1","v":8.2331174372960447E-3},{"$f":"(1+XIRR(DT35:DT131,VL_PARC!$H$35:$H$131))^(30/365)-1","v":7.5165716087448597E-3},{"$f":"(1+XIRR(DU35:DU131,VL_PARC!$H$35:$H$131))^(30/365)-1","v":6.7587647437818976E-3},{"$f":"(1+XIRR(DV35:DV131,VL_PARC!$H$35:$H$131))^(30/365)-1","v":5.956783854109915E-3},{"$f":"(1+XIRR(DW35:DW131,VL_PARC!$H$35:$H$131))^(30/365)-1","v":5.1070743651238093E-3},{"$f":"(1+XIRR(DX35:DX131,VL_PARC!$H$35:$H$131))^(30/365)-1","v":4.2059447241360459E-3},{"$f":"(1+XIRR(DY35:DY131,VL_PARC!$H$35:$H$131))^(30/365)-1","v":3.2494531680764549E-3},{"$f":"(1+XIRR(DZ35:DZ131,VL_PARC!$H$35:$H$131))^(30/365)-1","v":2.2329886409426791E-3},{"$f":"(1+XIRR(EA35:EA131,VL_PARC!$H$35:$H$131))^(30/365)-1","v":1.1516846103796219E-3},{"$f":"(1+XIRR(EB35:EB131,VL_PARC!$H$35:$H$131))^(30/365)-1","v":2.4495050432449261E-10},{"$f":"(1+XIRR(EC35:EC131,VL_PARC!$H$35:$H$131))^(30/365)-1","v":-1.2282237684002606E-3},{"$f":"(1+XIRR(ED35:ED131,VL_PARC!$H$35:$H$131))^(30/365)-1","v":-2.5398509272310799E-3},{"$f":"(1+XIRR(EE35:EE131,VL_PARC!$H$35:$H$131))^(30/365)-1","v":-3.9423646350108532E-3},{"$f":"(1+XIRR(EF35:EF131,VL_PARC!$H$35:$H$131))^(30/365)-1","v":-5.444375539504942E-3},{"$f":"(1+XIRR(EG35:EG131,VL_PARC!$H$35:$H$131))^(30/365)-1","v":-7.0551133575628144E-3},{"$f":"(1+XIRR(EH35:EH131,VL_PARC!$H$35:$H$131))^(30/365)-1","v":-8.7855586285421339E-3},{"$f":"(1+XIRR(EI35:EI131,VL_PARC!$H$35:$H$131))^(30/365)-1","v":-1.0647226151824341E-2},{"$f":"(1+XIRR(EJ35:EJ131,VL_PARC!$H$35:$H$131))^(30/365)-1","v":-1.2653384901472609E-2},{"$f":"(1+XIRR(EK35:EK131,VL_PARC!$H$35:$H$131))^(30/365)-1","v":-1.4820115939601863E-2},{"$f":"(1+XIRR(EL35:EL131,VL_PARC!$H$35:$H$131))^(30/365)-1","v":-1.7163780978780463E-2},{"$f":"(1+XIRR(EM35:EM131,VL_PARC!$H$35:$H$131))^(30/365)-1","v":-1.970548085948387E-2},{"$f":"(1+XIRR(EN35:EN131,VL_PARC!$H$35:$H$131))^(30/365)-1","v":-2.2466314068474991E-2},{"$f":"(1+XIRR(EO35:EO131,VL_PARC!$H$35:$H$131))^(30/365)-1","v":-2.5477093028120623E-2},{"$f":"(1+XIRR(EP35:EP131,VL_PARC!$H$35:$H$131))^(30/365)-1","v":-2.8764125078544089E-2},{"$f":"(1+XIRR(EQ35:EQ131,VL_PARC!$H$35:$H$131))^(30/365)-1","v":-3.2361743743584248E-2},{"$f":"(1+XIRR(ER35:ER131,VL_PARC!$H$35:$H$131))^(30/365)-1","v":-3.6314839327069581E-2},{"$f":"(1+XIRR(ES35:ES131,VL_PARC!$H$35:$H$131))^(30/365)-1","v":-4.0666962209351731E-2},{"$f":"(1+XIRR(ET35:ET131,VL_PARC!$H$35:$H$131))^(30/365)-1","v":-4.5480785634891885E-2},{"$f":"(1+XIRR(EU35:EU131,VL_PARC!$H$35:$H$131))^(30/365)-1","v":-5.0816648283283694E-2},{"$f":"(1+XIRR(EV35:EV131,VL_PARC!$H$35:$H$131))^(30/365)-1","v":-5.6751542056637461E-2},{"$f":"(1+XIRR(EW35:EW131,VL_PARC!$H$35:$H$131))^(30/365)-1","v":-6.3392153573673893E-2}]
["Data","Dia da Semana","Feriado",null,null,null,null,"OPERAÇÃO ORIGINAL",null,null,null,null,"Portabilidade",null,null,null,null,null,null,"REFINANCIAMENTO",null,null,null,null,null,null,null,null,null,null,null,null,null,"IOF",null,null,null,null,null,null,null,null,null,null,null,null,"REFINANCIAMENTO",null,null,null,null,null,null,null,null,null,null,null,null,null,null,"OPERAÇÃO ORIGINAL",null,null,null,null,null,null,null,{"$f":"(1+BR32)^(1/30)","v":1.000611218607504},{"$f":"(1+XIRR(VL_PARC!BR$35:BR$131,VL_PARC!$BP$35:$BP$131))^(30/365)-1","v":1.849093399044488E-2},null,null,null,null,96,{"$f":"BX33-1","v":95},{"$f":"BY33-1","v":94},93,92,91,90,89,88,87,86,85,84,83,82,81,80,79,78,77,76,75,74,73,72,71,70,69,68,67,66,65,64,63,62,61,60,59,58,57,56,55,54,53,52,51,50,49,48,47,46,45,44,43,42,41,40,39,38,37,36,35,34,33,32,31,{"$f":"EK33-1","v":30},29,28,27,26,25,24,23,22,21,20,19]
["2001-01-01","segunda-feira","Confraternização Universal",null,null,null,null,"DATA EV","FLUXO","Principal","Principal2","IOF","FX PARC N","VP Tx Mín","IOF","FX PARC Min","VP Tx Mín",null,null,"FX Refin","Normal","Flex 1","Flex 2","Flex 3","Flex 4","Flex 5","Flex 6","Flex 7","Flex 8","Flex 9","Flex 10","Flex 11",null,"Normal","Flex 1","Flex 2","Flex 3","Flex 4","Flex 5","Flex 6","Flex 7","Flex 8","Flex 9","Flex 10","Flex 11",null,"Normal","Flex 1","Flex 2","Flex 3","Flex 4","Flex 5","Flex 6","Flex 7","Flex 8","Flex 9","Flex 10","Flex 11",null,null,null,"DATA EV","FLUXO1","FLUXO2","FLUXO3","FLUXO4",null,null,null,"FLUX06",null,null,null,null,null,"FLUXO","FLUXO","FLUXO","FLUXO","FLUXO","FLUXO","FLUXO","FLUXO","FLUXO","FLUXO","FLUXO","FLUXO","FLUXO","FLUXO","FLUXO","FLUXO","FLUXO","FLUXO","FLUXO","FLUXO","FLUXO","FLUXO","FLUXO","FLUXO","FLUXO","FLUXO","FLUXO","FLUXO","FLUXO","FLUXO","FLUXO","FLUXO","FLUXO","FLUXO","FLUXO","FLUXO","FLUXO","FLUXO","FLUXO","FLUXO","FLUXO","FLUXO","FLUXO","FLUXO","FLUXO","FLUXO","FLUXO","FLUXO","FLUXO","FLUXO","FLUXO","FLUXO","FLUXO","FLUXO","FLUXO","FLUXO","FLUXO","FLUXO","FLUXO","FLUXO","FLUXO","FLUXO","FLUXO","FLUXO","FLUXO","FLUXO","FLUXO","FLUXO","FLUXO","FLUXO","FLUXO","FLUXO","FLUXO","FLUXO","FLUXO","FLUXO","FLUXO","FLUXO"]
["2001-02-26","segunda-feira","Carnaval",null,null,null,0,{"$f":"I7","v":"2025-09-30"},{"$f":"-I8","v":-10000},null,null,{"$f":"I35*-0.38%","v":38},{"$f":"I35-N26","v":-10000},null,{"$f":"N26*$B$2","v":0},{"$f":"I35","v":-10000},null,{"$f":"N27*$B$2","v":0},null,{"$f":"I35","v":-10000},null,null,null,null,null,null,null,null,null,null,null,null,null,{"$f":"(U31)*$B$2","v":8.3416243123227254},{"$f":"(V31)*$B$2","v":8.3416243123227254},8.3416243123227254,8.3416243123227254,8.3416243123227254,8.3416243123227254,{"$error":"#N/A"},{"$error":"#N/A"},{"$error":"#N/A"},{"$error":"#N/A"},{"$error":"#N/A"},{"$error":"#N/A"},null,{"$f":"-U32+$I$35","v":-22195.164292716508},{"$f":"-V32+$I$35","v":-22195.164292716508},-22195.164292716508,-22195.164292716508,-22195.164292716508,-22195.164292716508,{"$error":"#N/A"},{"$error":"#N/A"},{"$error":"#N/A"},{"$error":"#N/A"},{"$error":"#N/A"},{"$error":"#N/A"},null,null,0,{"$f":"H35","v":"2025-09-30"},{"$f":"I35","v":-10000},{"$f":"BK35","v":-10000},{"$f":"BL35","v":-10000},{"$f":"BM35","v":-10000},null,{"$f":"EDATE(BJ36,-1)","v":"2025-10-07"},{"$f":"-BJ35+BP35","v":7},{"$f":"-((-BN35)*BR33^BQ35)","v":-10042.863836013657},{"$f":"BN35","v":-10000},null,null,null,null,{"$f":"BN35","v":-10000},{"$f":"BX35","v":-10000},{"$f":"BY35","v":-10000},-10000,-10000,-10000,-10000,-10000,-10000,-10000,-10000,-10000,-10000,-10000,-10000,-10000,-10000,-10000,-10000,-10000,-10000,-10000,-10000,-10000,-10000,-10000,-10000,-10000,-10000,-10000,-10000,-10000,-10000,-10000,-10000,-10000,-10000,-10000,-10000,-10000,-10000,-10000,-10000,-10000,-10000,-10000,-10000,-10000,-10000,-10000,-10000,-10000,-10000,-10000,-10000,-10000,-10000,-10000,-10000,-10000,-10000,-10000,-10000,-10000,-10000,-10000,{"$f":"EK35","v":-10000},-10000,-10000,-10000,-10000,-10000,-10000,-10000,-10000,-10000,-10000,-10000]
["2001-02-27","terça-feira","Carnaval",null,null,{"$f":"H36-$H$35","v":38},1,{"$f":"J31","v":"2025-11-07"},{"$f":"IF($G36>$I$10,0,$I$9)","v":250},{"$f":"I36/($J$32^(H36-$H$35))","v":245.61596998293012},{"$f":"I36/($I$32^(H36-$H$35))","v":245.61596998293012},{"$f":"J36*0.0082%*MIN(F36,365)","v":0.76533936246681022},{"$f":"IF($G36>$I$10,0,$I$9)","v":250},{"$f":"M36/($J$32^($H36-$H$35))","v":245.61596998293012},{"$f":"($N$26/($J$8+$N$26))*$N36*$B$1*MIN($F36,365)","v":0},{"$f":"IF($G36>$I$10,0,$M$27)","v":0},{"$f":"P36/($J$32^($H36-$H$35))","v":0},{"$f":"($N$27/($J$8+$N$27))*$Q36*$B$1*MIN($F36,365)","v":0},1,{"$f":"IF($G36>$P$3,0,$J$9)","v":250},{"$f":"$T36/((U$29)^($H36-$H$35))","v":245.10668717808329},{"$f":"$T36/((V$29)^($H36-$H$35))","v":245.10668717808329},245.10668717808329,245.10668717808329,245.10668717808329,245.10668717808329,{"$error":"#N/A"},{"$error":"#N/A"},{"$error":"#N/A"},{"$error":"#N/A"},{"$f":"IF($I36<>0,$J36,$T36/((AE$29)^($H36-$H$35)))","v":245.61596998293012},245.61596998293012,null,{"$f":"IF($I36<>0,0,U36*$B$1*MIN($F36,365))","v":0},{"$f":"IF($I36<>0,0,V36*$B$1*MIN($F36,365))","v":0},0,0,0,0,0,0,0,0,0,0,null,{"$f":"$T36","v":250},250,250,250,250,250,250,250,250,250,250,250,null,{"$f":"BJ36-$H$35","v":38},1,{"$f":"BL31","v":"2025-11-07"},{"$f":"I36","v":250},{"$f":"BK36","v":250},{"$f":"I37","v":250},{"$f":"BM37","v":250},null,{"$f":"BJ36","v":"2025-11-07"},null,{"$f":"IF(I36=0,0,PMT($BR$31,$I$10,$BR$35))","v":280.29985802546787},{"$f":"MIN(BR36,$I$9)","v":250},null,null,null,null,{"$f":"IF($G36>BX$33,0,$I$9)","v":250},250,250,250,250,250,250,250,250,250,250,250,250,250,250,250,{"$f":"IF($G36>CN$33,0,$I$9)","v":250},250,250,250,250,250,250,250,250,250,250,250,250,250,250,250,{"$f":"IF($G36>DD$33,0,$I$9)","v":250},250,250,250,250,250,250,250,250,250,250,250,250,250,250,250,{"$f":"IF($G36>DT$33,0,$I$9)","v":250},250,250,250,250,250,250,250,250,250,250,250,250,250,250,250,250,250,250,250,250,250,250,250,250,250,250,250,250,250]
["2001-04-13","sexta-feira","Paixão de Cristo",null,null,{"$f":"H37-$H$35","v":68},{"$f":"G36+1","v":2},{"$f":"EDATE(H36,1)","v":"2025-12-07"},{"$f":"IF($G37>$I$10,0,$I$9)","v":250},{"$f":"I37/($J$32^(H37-$H$35))","v":242.20926586287629},242.20926586287629,{"$f":"J37*0.0082%*MIN(F37,365)","v":1.3505588664513983},250,242.20926586287629,{"$f":"$N$26/($J$8+$N$26)*$N37*$B$1*MIN($F37,365)","v":0},0,0,0,{"$f":"S36+1","v":2},250,241.31129380919162,241.31129380919162,241.31129380919162,241.31129380919162,241.31129380919162,241.31129380919162,{"$error":"#N/A"},{"$error":"#N/A"},{"$error":"#N/A"},{"$error":"#N/A"},242.20926586287629,{"$f":"IF($I37<>0,$J37,$T37/((AF$29)^($H37-$H$35)))","v":242.20926586287629},null,0,0,0,0,0,0,0,0,0,0,0,0,null,250,250,250,250,250,250,250,250,250,250,250,250,null,{"$f":"BJ37-$H$35","v":68},{"$f":"BI36+1","v":2},{"$f":"EDATE(BJ36,1)","v":"2025-12-07"},{"$f":"I36","v":250},{"$f":"BK36","v":250},{"$f":"I38","v":250},{"$f":"BM38","v":250},null,{"$f":"BJ37","v":"2025-12-07"},null,{"$f":"IF(I37=0,0,PMT($BR$31,$I$10,$BR$35))","v":280.29985802546787},{"$f":"MIN(BR37,$I$9)","v":250},null,null,null,null,250,250,250,250,250,250,250,250,250,250,250,250,250,250,250,250,250,250,250,250,250,250,250,250,250,250,250,250,250,250,250,250,250,250,250,250,250,250,250,250,250,250,250,250,250,250,250,250,250,250,250,250,250,250,250,250,250,250,250,250,250,250,250,250,250,250,250,250,250,250,250,250,250,250,250,250,250,250]
["2001-04-21","sábado","Tiradentes",null,null,99,{"$f":"G37+1","v":3},{"$f":"EDATE(H37,1)","v":"2026-01-07"},{"$f":"IF($G38>$I$10,0,$I$9)","v":250},238.73863720364145,238.73863720364145,1.9380802568191613,250,238.73863720364145,0,0,0,0,3,250,237.45111820452877,237.45111820452877,237.45111820452877,237.45111820452877,237.45111820452877,237.45111820452877,{"$error":"#N/A"},{"$error":"#N/A"},{"$error":"#N/A"},{"$error":"#N/A"},238.73863720364145,238.73863720364145,null,0,0,0,0,0,0,0,0,0,0,0,0,null,250,250,250,250,250,250,250,250,250,250,250,250,null,99,{"$f":"BI37+1","v":3},{"$f":"EDATE(BJ37,1)","v":"2026-01-07"},{"$f":"I37","v":250},{"$f":"BK37","v":250},250,250,null,"2026-01-07",null,280.29985802546787,250,null,null,null,null,250,250,250,250,250,250,250,250,250,250,250,250,250,250,250,250,250,250,250,250,250,250,250,250,250,250,250,250,250,250,250,250,250,250,250,250,250,250,250,250,250,250,250,250,250,250,250,250,250,250,250,250,250,250,250,250,250,250,250,250,250,250,250,250,250,250,250,250,250,250,250,250,250,250,250,250,250,250]
["2001-05-01","terça-feira","Dia do Trabalho",null,null,130,4,"2026-02-07",250,235.31773935568407,235.31773935568407,2.5084871015315922,250,235.31773935568407,0,0,0,0,4,250,233.65269253068604,233.65269253068604,233.65269253068604,233.65269253068604,233.65269253068604,233.65269253068604,{"$error":"#N/A"},{"$error":"#N/A"},{"$error":"#N/A"},{"$error":"#N/A"},235.31773935568407,235.31773935568407,null,0,0,0,0,0,0,0,0,0,0,0,0,null,250,250,250,250,250,250,250,250,250,250,250,250,null,130,4,"2026-02-07",250,250,250,250,null,"2026-02-07",null,280.29985802546787,250,null,null,null,null,250,250,250,250,250,250,250,250,250,250,250,250,250,250,250,250,250,250,250,250,250,250,250,250,250,250,250,250,250,250,250,250,250,250,250,250,250,250,250,250,250,250,250,250,250,250,250,250,250,250,250,250,250,250,250,250,250,250,250,250,250,250,250,250,250,250,250,250,250,250,250,250,250,250,250,250,250,250]
["2001-06-14","quinta-feira","Corpus Christi",null,null,158,5,"2026-03-07",250,232.27004789211759,232.27004789211759,3.0092907404902758,250,232.27004789211759,0,0,0,0,5,250,230.27410986084527,230.27410986084527,230.27410986084527,230.27410986084527,230.27410986084527,230.27410986084527,{"$error":"#N/A"},{"$error":"#N/A"},{"$error":"#N/A"},{"$error":"#N/A"},232.27004789211759,232.27004789211759,null,0,0,0,0,0,0,0,0,0,0,0,0,null,250,250,250,250,250,250,250,250,250,250,250,250,null,158,5,"2026-03-07",250,250,250,250,null,"2026-03-07",null,280.29985802546787,250,null,null,null,null,250,250,250,250,250,250,250,250,250,250,250,250,250,250,250,250,250,250,250,250,250,250,250,250,250,250,250,250,250,250,250,250,250,250,250,250,250,250,250,250,250,250,250,250,250,250,250,250,250,250,250,250,250,250,250,250,250,250,250,250,250,250,250,250,250,250,250,250,250,250,250,250,250,250,250,250,250,250]
["2001-09-07","sexta-feira","Independência do Brasil",null,null,189,6,"2026-04-07",250,228.94183878325293,228.94183878325293,3.5481406174628538,250,228.94183878325293,0,0,0,0,6,250,226.59049237556846,226.59049237556846,226.59049237556846,226.59049237556846,226.59049237556846,226.59049237556846,{"$error":"#N/A"},{"$error":"#N/A"},{"$error":"#N/A"},{"$error":"#N/A"},228.94183878325293,228.94183878325293,null,0,0,0,0,0,0,0,0,0,0,0,0,null,250,250,250,250,250,250,250,250,250,250,250,250,null,189,6,"2026-04-07",250,250,250,250,null,"2026-04-07",null,280.29985802546787,250,null,null,null,null,250,250,250,250,250,250,250,250,250,250,250,250,250,250,250,250,250,250,250,250,250,250,250,250,250,250,250,250,250,250,250,250,250,250,250,250,250,250,250,250,250,250,250,250,250,250,250,250,250,250,250,250,250,250,250,250,250,250,250,250,250,250,250,250,250,250,250,250,250,250,250,250,250,250,250,250,250,250]
["2001-10-12","sexta-feira","Nossa Sr.a Aparecida - Padroeira do Brasil",null,null,219,7,"2026-05-07",250,225.76640558365358,225.76640558365358,4.0543131114712514,250,225.76640558365358,0,0,0,0,7,250,223.08181596156564,223.08181596156564,223.08181596156564,223.08181596156564,223.08181596156564,223.08181596156564,{"$error":"#N/A"},{"$error":"#N/A"},{"$error":"#N/A"},{"$error":"#N/A"},225.76640558365358,225.76640558365358,null,0,0,0,0,0,0,0,0,0,0,0,0,null,250,250,250,250,250,250,250,250,250,250,250,250,null,219,7,"2026-05-07",250,250,250,250,null,"2026-05-07",null,280.29985802546787,250,null,null,null,null,250,250,250,250,250,250,250,250,250,250,250,250,250,250,250,250,250,250,250,250,250,250,250,250,250,250,250,250,250,250,250,250,250,250,250,250,250,250,250,250,250,250,250,250,250,250,250,250,250,250,250,250,250,250,250,250,250,250,250,250,250,250,250,250,250,250,250,250,250,250,250,250,250,250,250,250,250,250]
["2001-11-02","sexta-feira","Finados",null,null,250,8,"2026-06-07",250,222.53138749002423,222.53138749002423,4.5618934435454968,250,222.53138749002423,0,0,0,0,8,250,219.51325118274659,219.51325118274659,219.51325118274659,219.51325118274659,219.51325118274659,219.51325118274659,{"$error":"#N/A"},{"$error":"#N/A"},{"$error":"#N/A"},{"$error":"#N/A"},222.53138749002423,222.53138749002423,null,0,0,0,0,0,0,0,0,0,0,0,0,null,250,250,250,250,250,250,250,250,250,250,250,250,null,250,8,"2026-06-07",250,250,250,250,null,"2026-06-07",null,280.29985802546787,250,null,null,null,null,250,250,250,250,250,250,250,250,250,250,250,250,250,250,250,250,250,250,250,250,250,250,250,250,250,250,250,250,250,250,250,250,250,250,250,250,250,250,250,250,250,250,250,250,250,250,250,250,250,250,250,250,250,250,250,250,250,250,250,250,250,250,250,250,250,250,250,250,250,250,250,250,250,250,250,250,250,250]
["2001-11-15","quinta-feira","Proclamação da República",null,null,280,9,"2026-07-07",250,219.44486752694431,219.44486752694431,5.0384541584186406,250,219.44486752694431,0,0,0,0,9,250,216.11416343236814,216.11416343236814,216.11416343236814,216.11416343236814,216.11416343236814,216.11416343236814,{"$error":"#N/A"},{"$error":"#N/A"},{"$error":"#N/A"},{"$error":"#N/A"},219.44486752694431,219.44486752694431,null,0,0,0,0,0,0,0,0,0,0,0,0,null,250,250,250,250,250,250,250,250,250,250,250,250,null,280,9,"2026-07-07",250,250,250,250,null,"2026-07-07",null,280.29985802546787,250,null,null,null,null,250,250,250,250,250,250,250,250,250,250,250,250,250,250,250,250,250,250,250,250,250,250,250,250,250,250,250,250,250,250,250,250,250,250,250,250,250,250,250,250,250,250,250,250,250,250,250,250,250,250,250,250,250,250,250,250,250,250,250,250,250,250,250,{"$f":"IF($G44>EI$33,0,$I$9)","v":250},250,250,250,250,250,250,250,250,250,250,250,250,250,250]
["2001-12-25","terça-feira","Natal",null,null,311,10,"2026-08-07",250,216.30043106763807,216.30043106763807,5.5160935930869064,250,216.30043106763807,0,0,0,0,10,250,212.65705784756531,212.65705784756531,212.65705784756531,212.65705784756531,212.65705784756531,212.65705784756531,{"$error":"#N/A"},{"$error":"#N/A"},{"$error":"#N/A"},{"$error":"#N/A"},216.30043106763807,216.30043106763807,null,0,0,0,0,0,0,0,0,0,0,0,0,null,250,250,250,250,250,250,250,250,250,250,250,250,null,311,10,"2026-08-07",250,250,250,250,null,"2026-08-07",null,280.29985802546787,250,null,null,null,null,250,250,250,250,250,250,250,250,250,250,250,250,250,250,250,250,250,250,250,250,250,250,250,250,250,250,250,250,250,250,250,250,250,250,250,250,250,250,250,250,250,250,250,250,250,250,250,250,{"$f":"IF($G45>DT$33,0,$I$9)","v":250},250,250,250,250,250,250,250,250,250,250,250,250,250,250,250,250,250,250,250,250,250,250,250,250,250,250,250,250,250]
["2002-01-01","terça-feira","Confraternização Universal",null,null,342,11,"2026-09-07",250,213.20105139529633,213.20105139529633,5.9790102853296911,250,213.20105139529633,0,0,0,0,11,250,209.25525441804302,209.25525441804302,209.25525441804302,209.25525441804302,209.25525441804302,209.25525441804302,{"$error":"#N/A"},{"$error":"#N/A"},{"$error":"#N/A"},{"$error":"#N/A"},213.20105139529633,213.20105139529633,null,0,0,0,0,0,0,0,0,0,0,0,0,null,250,250,250,250,250,250,250,250,250,250,250,250,null,342,11,"2026-09-07",250,250,250,250,null,"2026-09-07",null,280.29985802546787,250,null,null,null,null,250,250,250,250,250,250,250,250,250,250,250,250,250,250,250,250,250,250,250,250,250,250,250,250,250,250,250,250,250,250,250,250,250,250,250,250,250,250,250,250,250,250,250,250,250,250,250,250,250,250,250,250,250,250,250,250,250,250,250,250,250,250,250,250,250,250,250,250,250,250,250,250,250,250,250,250,250,250]
["2002-02-11","segunda-feira","Carnaval",null,null,372,12,"2026-10-07",250,210.2439435971404,210.2439435971404,6.2926012318624123,250,210.2439435971404,0,0,0,0,12,250,206.01500824537561,206.01500824537561,206.01500824537561,206.01500824537561,206.01500824537561,206.01500824537561,{"$error":"#N/A"},{"$error":"#N/A"},{"$error":"#N/A"},{"$error":"#N/A"},210.2439435971404,210.2439435971404,null,0,0,0,0,0,0,0,0,0,0,0,0,null,250,250,250,250,250,250,250,250,250,250,250,250,null,372,12,"2026-10-07",250,250,250,250,null,"2026-10-07",null,280.29985802546787,250,null,null,null,null,250,250,250,250,250,250,250,250,250,250,250,250,250,250,250,250,250,250,250,250,250,250,250,250,250,250,250,250,250,250,250,250,250,250,250,250,250,250,250,250,250,250,250,250,250,250,250,250,250,250,250,250,250,250,250,250,250,250,250,250,250,250,250,250,250,250,250,250,250,250,250,250,250,250,250,250,250,250]
["2002-02-12","terça-feira","Carnaval",null,null,403,13,"2026-11-07",250,207.2313476360433,207.2313476360433,6.202434234746776,250,207.2313476360433,0,0,0,0,13,250,202.7194554493592,202.7194554493592,202.7194554493592,202.7194554493592,202.7194554493592,202.7194554493592,{"$error":"#N/A"},{"$error":"#N/A"},{"$error":"#N/A"},{"$error":"#N/A"},207.2313476360433,207.2313476360433,null,0,0,0,0,0,0,0,0,0,0,0,0,null,250,250,250,250,250,250,250,250,250,250,250,250,null,403,13,"2026-11-07",250,250,250,250,null,"2026-11-07",null,280.29985802546787,250,null,null,null,null,250,250,250,250,250,250,250,250,250,250,250,250,250,250,250,250,250,250,250,250,250,250,250,250,250,250,250,250,250,250,250,250,250,250,250,250,250,250,250,250,250,250,250,250,250,250,250,250,250,250,250,250,250,250,250,250,250,250,250,250,250,250,250,250,250,250,250,250,250,250,250,250,250,250,250,250,250,250]
["2002-03-29","sexta-feira","Paixão de Cristo",null,null,433,14,"2026-12-07",250,204.35703988705987,204.35703988705987,6.1164062038197011,250,204.35703988705987,0,0,0,0,14,250,199.58041389232969,199.58041389232969,199.58041389232969,199.58041389232969,199.58041389232969,199.58041389232969,{"$error":"#N/A"},{"$error":"#N/A"},{"$error":"#N/A"},{"$error":"#N/A"},204.35703988705987,204.35703988705987,null,0,0,0,0,0,0,0,0,0,0,0,0,null,250,250,250,250,250,250,250,250,250,250,250,250,null,433,14,"2026-12-07",250,250,250,250,null,"2026-12-07",null,280.29985802546787,250,null,null,null,null,250,250,250,250,250,250,250,250,250,250,250,250,250,250,250,250,250,250,250,250,250,250,250,250,250,250,250,250,250,250,250,250,250,250,250,250,250,250,250,250,250,250,250,250,250,250,250,250,250,250,250,250,250,250,250,250,250,250,250,250,250,250,250,250,250,250,250,250,250,250,250,250,250,250,250,250,250,250]
["2002-04-21","domingo","Tiradentes",null,null,464,15,"2027-01-07",250,201.4287976630404,201.4287976630404,6.0287639140547995,250,201.4287976630404,0,0,0,0,15,250,196.3877931379738,196.3877931379738,196.3877931379738,196.3877931379738,196.3877931379738,196.3877931379738,{"$error":"#N/A"},{"$error":"#N/A"},{"$error":"#N/A"},{"$error":"#N/A"},201.4287976630404,201.4287976630404,null,0,0,0,0,0,0,0,0,0,0,0,0,null,250,250,250,250,250,250,250,250,250,250,250,250,null,464,15,"2027-01-07",250,250,250,250,null,"2027-01-07",null,280.29985802546787,250,null,null,null,null,250,250,250,250,250,250,250,250,250,250,250,250,250,250,250,250,250,250,250,250,250,250,250,250,250,250,250,250,250,250,250,250,250,250,250,250,250,250,250,250,250,250,250,250,250,250,250,250,250,250,250,250,250,250,250,250,250,250,250,250,250,250,250,250,250,250,250,250,250,250,250,250,250,250,250,250,250,250]
["2002-05-01","quarta-feira","Dia do Trabalho",null,null,495,16,"2027-02-07",250,198.54251436799777,198.54251436799777,5.9423774550341735,250,198.54251436799777,0,0,0,0,16,250,193.24624366402247,193.24624366402247,193.24624366402247,193.24624366402247,193.24624366402247,193.24624366402247,{"$error":"#N/A"},{"$error":"#N/A"},{"$error":"#N/A"},{"$error":"#N/A"},198.54251436799777,198.54251436799777,null,0,0,0,0,0,0,0,0,0,0,0,0,null,250,250,250,250,250,250,250,250,250,250,250,250,null,495,16,"2027-02-07",250,250,250,250,null,"2027-02-07",null,280.29985802546787,250,null,null,null,null,250,250,250,250,250,250,250,250,250,250,250,250,250,250,250,{"$f":"IF($G51>CM$33,0,$I$9)","v":250},250,250,250,250,250,250,250,250,250,250,250,250,250,250,250,{"$f":"IF($G51>DC$33,0,$I$9)","v":250},250,250,250,250,250,250,250,250,250,250,250,250,250,250,250,250,250,250,250,250,250,250,250,250,250,250,250,250,250,250,250,250,250,250,250,250,250,250,250,250,250,250,250,250,250,250]
["2002-05-30","quinta-feira","Corpus Christi",null,null,523,17,"2027-03-07",250,195.97111313045747,195.97111313045747,5.8654154159945922,250,195.97111313045747,0,0,0,0,17,250,{"$f":"$T52/((U$29)^($H52-$H$35))","v":190.45193214642964},190.45193214642964,190.45193214642964,190.45193214642964,190.45193214642964,190.45193214642964,{"$error":"#N/A"},{"$error":"#N/A"},{"$error":"#N/A"},{"$error":"#N/A"},{"$f":"IF($I52<>0,$J52,$T52/((AE$29)^($H52-$H$35)))","v":195.97111313045747},{"$f":"IF($I52<>0,$J52,$T52/((AF$29)^($H52-$H$35)))","v":195.97111313045747},null,0,0,0,0,0,0,0,0,0,0,0,0,null,{"$f":"$T52","v":250},250,250,250,250,250,250,250,250,250,250,250,null,523,17,"2027-03-07",250,250,250,250,null,"2027-03-07",null,280.29985802546787,250,null,null,null,null,{"$f":"IF($G52>BX$33,0,$I$9)","v":250},250,250,250,250,250,250,250,250,250,250,250,250,250,250,250,{"$f":"IF($G52>CN$33,0,$I$9)","v":250},250,250,250,250,250,250,250,250,250,250,250,250,250,250,250,250,250,250,250,250,250,250,250,250,250,250,250,250,250,250,250,250,250,250,250,250,250,250,250,250,250,250,250,250,250,250,250,250,250,250,250,250,250,250,250,250,250,250,250,250,250]
["2002-09-07","sábado","Independência do Brasil",null,null,554,18,"2027-04-07",250,193.16303326947568,193.16303326947568,5.7813695857554075,250,193.16303326947568,0,0,0,0,18,250,187.40533664429836,187.40533664429836,187.40533664429836,187.40533664429836,187.40533664429836,187.40533664429836,{"$error":"#N/A"},{"$error":"#N/A"},{"$error":"#N/A"},{"$error":"#N/A"},{"$f":"IF($I53<>0,$J53,$T53/((AE$29)^($H53-$H$35)))","v":193.16303326947568},193.16303326947568,null,0,0,0,0,0,0,0,0,0,0,0,0,null,250,250,250,250,250,250,250,250,250,250,250,250,null,554,18,"2027-04-07",250,250,250,250,null,"2027-04-07",null,280.29985802546787,250,null,null,null,null,250,250,250,250,250,250,250,250,250,250,250,250,250,250,250,250,250,250,250,250,250,250,250,250,250,250,250,250,250,250,250,250,250,250,250,250,250,250,250,250,250,250,250,250,250,250,250,250,250,250,250,250,250,250,250,250,250,250,250,250,250,250,250,250,250,250,250,250,250,250,250,250,250,250,250,250,250,250]
["2002-10-12","sábado","Nossa Sr.a Aparecida - Padroeira do Brasil",null,null,584,19,"2027-05-07",250,190.48385364883882,190.48385364883882,5.701181739709746,250,190.48385364883882,0,0,0,0,19,250,184.50342898856022,184.50342898856022,184.50342898856022,184.50342898856022,184.50342898856022,184.50342898856022,{"$error":"#N/A"},{"$error":"#N/A"},{"$error":"#N/A"},{"$error":"#N/A"},190.48385364883882,190.48385364883882,null,0,0,0,0,0,0,0,0,0,0,0,0,null,250,250,250,250,250,250,250,250,250,250,250,250,null,584,19,"2027-05-07",250,250,250,250,null,"2027-05-07",null,280.29985802546787,250,null,null,null,null,250,250,250,250,250,250,250,250,250,250,250,250,250,250,250,250,250,250,250,250,250,250,250,250,250,250,250,250,250,250,250,250,250,250,250,250,250,250,250,250,250,250,250,250,250,250,250,250,250,250,250,250,250,250,250,250,250,250,250,250,250,250,250,250,250,250,250,250,250,250,250,250,250,250,250,250,250,250]
["2002-11-02","sábado","Finados",null,null,615,20,"2027-06-07",250,187.75440100283876,187.75440100283876,5.6194892220149644,250,187.75440100283876,0,0,0,0,20,250,181.55198969073172,181.55198969073172,181.55198969073172,181.55198969073172,181.55198969073172,181.55198969073172,{"$error":"#N/A"},{"$error":"#N/A"},{"$error":"#N/A"},{"$error":"#N/A"},187.75440100283876,187.75440100283876,null,0,0,0,0,0,0,0,0,0,0,0,0,null,250,250,250,250,250,250,250,250,250,250,250,250,null,615,20,"2027-06-07",250,250,250,250,null,"2027-06-07",null,280.29985802546787,250,null,null,null,null,250,250,250,250,250,250,250,250,250,250,250,250,250,250,250,250,250,250,250,250,250,250,250,250,250,250,250,250,250,250,250,250,250,250,250,250,250,250,250,250,250,250,250,250,250,250,250,250,250,250,250,250,250,250,250,250,250,250,250,250,250,250,250,250,250,250,250,250,250,250,250,250,250,250,250,250,250,0]
["2002-11-15","sexta-feira","Proclamação da República",null,null,645,21,"2027-07-07",250,185.15023934552036,185.15023934552036,5.5415466636114248,250,185.15023934552036,0,0,0,0,21,250,178.74071911417391,178.74071911417391,178.74071911417391,178.74071911417391,178.74071911417391,178.74071911417391,{"$error":"#N/A"},{"$error":"#N/A"},{"$error":"#N/A"},{"$error":"#N/A"},185.15023934552036,185.15023934552036,null,0,0,0,0,0,0,0,0,0,0,0,0,null,250,250,250,250,250,250,250,250,250,250,250,250,null,645,21,"2027-07-07",250,250,250,250,null,"2027-07-07",null,280.29985802546787,250,null,null,null,null,250,250,250,250,250,250,250,250,250,250,250,250,250,250,250,250,250,250,250,250,250,250,250,250,250,250,250,250,250,250,250,250,250,250,250,250,250,250,250,250,250,250,250,250,250,250,250,250,250,250,250,250,250,250,250,250,{"$f":"IF($G56>EB$33,0,$I$9)","v":250},250,250,250,250,250,250,250,250,250,250,250,250,250,250,250,250,250,250,250,0,0]
["2002-12-25","quarta-feira","Natal",null,null,676,22,"2027-08-07",250,182.49721232507369,182.49721232507369,5.4621415648894551,250,182.49721232507369,0,0,0,0,22,250,175.88146394798179,175.88146394798179,175.88146394798179,175.88146394798179,175.88146394798179,175.88146394798179,{"$error":"#N/A"},{"$error":"#N/A"},{"$error":"#N/A"},{"$error":"#N/A"},182.49721232507369,182.49721232507369,null,0,0,0,0,0,0,0,0,0,0,0,0,null,250,250,250,250,250,250,250,250,250,250,250,250,null,676,22,"2027-08-07",250,250,250,250,null,"2027-08-07",null,280.29985802546787,250,null,null,null,null,250,250,250,250,250,250,250,250,250,250,250,250,250,250,250,250,250,250,250,250,250,250,250,250,250,250,250,250,250,250,250,250,{"$f":"IF($G57>DD$33,0,$I$9)","v":250},250,250,250,250,250,250,250,250,250,250,250,250,250,250,250,250,250,250,250,250,250,250,250,250,250,250,250,250,250,250,250,250,250,250,250,250,250,250,250,250,250,250,0,0,0]
["2003-01-01","quarta-feira","Confraternização Universal",null,null,707,23,"2027-09-07",250,179.88220066121582,179.88220066121582,5.3838742657901895,250,179.88220066121582,0,0,0,0,23,250,173.06794732500424,173.06794732500424,173.06794732500424,173.06794732500424,173.06794732500424,173.06794732500424,{"$error":"#N/A"},{"$error":"#N/A"},{"$error":"#N/A"},{"$error":"#N/A"},179.88220066121582,179.88220066121582,null,0,0,0,0,0,0,0,0,0,0,0,0,null,250,250,250,250,250,250,250,250,250,250,250,250,null,707,23,"2027-09-07",250,250,250,250,null,"2027-09-07",null,280.29985802546787,250,null,null,null,null,250,250,250,250,250,250,250,250,250,250,250,250,250,250,250,250,250,250,250,250,250,250,250,250,250,250,250,250,250,250,250,250,250,250,250,250,250,250,250,250,250,250,250,250,250,250,250,250,250,250,250,250,250,250,250,250,250,250,250,250,250,250,250,250,250,250,250,250,250,250,250,250,250,250,0,0,0,0]
["2003-03-03","segunda-feira","Carnaval",null,null,737,24,"2027-10-07",250,177.3872267629001,177.3872267629001,5.3091996970136002,250,177.3872267629001,0,0,0,0,24,250,170.38804924793632,170.38804924793632,170.38804924793632,170.38804924793632,170.38804924793632,170.38804924793632,{"$error":"#N/A"},{"$error":"#N/A"},{"$error":"#N/A"},{"$error":"#N/A"},177.3872267629001,177.3872267629001,null,0,0,0,{"$f":"IF($I59<>0,0,X59*$B$1*MIN($F59,365))","v":0},0,0,0,0,0,0,0,0,null,250,250,250,250,250,250,250,250,250,250,250,250,null,737,24,"2027-10-07",250,250,250,250,null,"2027-10-07",null,280.29985802546787,250,null,null,null,null,250,250,250,250,250,250,250,250,250,250,250,250,250,250,250,250,250,250,250,250,250,250,250,250,250,250,250,250,250,250,250,250,250,250,250,250,250,250,250,250,250,250,250,250,250,250,250,250,250,250,250,250,250,250,250,250,250,250,250,250,250,250,250,250,250,250,250,250,250,250,250,250,250,0,0,0,0,0]
["2003-03-04","terça-feira","Carnaval",null,null,768,25,"2027-11-07",250,174.84543633720236,174.84543633720236,5.2331239095724671,250,174.84543633720236,0,0,0,0,25,250,167.66240893226566,167.66240893226566,167.66240893226566,167.66240893226566,167.66240893226566,167.66240893226566,{"$error":"#N/A"},{"$error":"#N/A"},{"$error":"#N/A"},{"$error":"#N/A"},174.84543633720236,174.84543633720236,null,0,{"$f":"IF($I60<>0,0,V60*$B$1*MIN($F60,365))","v":0},{"$f":"IF($I60<>0,0,W60*$B$1*MIN($F60,365))","v":0},0,0,0,0,0,0,0,0,0,null,250,250,250,250,250,250,250,250,250,250,250,250,null,768,25,"2027-11-07",250,250,250,250,null,"2027-11-07",null,280.29985802546787,250,null,null,null,null,250,250,250,250,250,250,250,250,250,250,250,250,250,250,250,250,250,250,250,250,250,250,250,250,250,250,250,250,250,250,250,250,250,250,250,250,250,250,250,250,250,250,250,250,250,250,250,250,250,250,250,250,250,250,250,250,250,250,250,250,250,250,250,250,250,250,250,250,250,250,250,250,0,0,0,0,0,0]
["2003-04-18","sexta-feira","Paixão de Cristo",null,null,798,26,"2027-12-07",250,172.42032257776748,172.42032257776748,5.1605402547525809,250,172.42032257776748,0,0,0,0,26,250,165.06621377170035,165.06621377170035,165.06621377170035,165.06621377170035,165.06621377170035,165.06621377170035,{"$error":"#N/A"},{"$error":"#N/A"},{"$error":"#N/A"},{"$error":"#N/A"},172.42032257776748,172.42032257776748,null,0,0,0,0,0,0,0,0,0,0,0,0,null,250,250,250,250,250,250,250,250,250,250,250,250,null,798,26,"2027-12-07",250,250,250,250,null,"2027-12-07",null,280.29985802546787,250,null,null,null,null,250,250,250,250,250,250,250,250,250,250,250,250,250,250,250,250,250,250,250,250,250,250,250,250,250,250,250,250,250,250,250,250,250,250,250,250,250,250,250,250,250,250,250,250,250,250,250,250,250,250,250,250,250,250,250,250,250,250,250,250,250,250,250,250,250,250,250,250,250,250,250,0,0,0,0,0,0,0]
["2003-04-21","segunda-feira","Tiradentes",null,null,829,27,"2028-01-07",250,169.9497031700372,169.9497031700372,5.0865946158792132,250,169.9497031700372,0,0,0,0,27,250,162.42570506820215,162.42570506820215,162.42570506820215,162.42570506820215,162.42570506820215,162.42570506820215,{"$error":"#N/A"},{"$error":"#N/A"},{"$error":"#N/A"},{"$error":"#N/A"},169.9497031700372,169.9497031700372,null,0,0,0,0,0,0,0,0,0,0,0,0,null,250,250,250,250,250,250,250,250,250,250,250,250,null,829,27,"2028-01-07",250,250,250,250,null,"2028-01-07",null,280.29985802546787,250,null,null,null,null,250,250,250,250,250,250,250,250,250,250,250,250,250,250,250,250,250,250,250,250,250,250,250,250,250,250,250,250,250,250,250,250,250,250,250,250,250,250,250,250,250,250,250,250,250,250,250,250,250,250,250,250,250,250,250,250,250,{"$f":"IF($G62>EC$33,0,$I$9)","v":250},250,250,250,250,250,250,250,250,250,250,250,250,0,0,0,0,0,0,0,0]
["2003-05-01","quinta-feira","Dia do Trabalho",null,null,860,28,"2028-02-07",250,167.51448539110908,167.51448539110908,5.0137085477558951,250,167.51448539110908,0,0,0,0,28,250,159.82743569432773,159.82743569432773,159.82743569432773,159.82743569432773,159.82743569432773,159.82743569432773,{"$error":"#N/A"},{"$error":"#N/A"},{"$error":"#N/A"},{"$error":"#N/A"},167.51448539110908,167.51448539110908,null,0,0,0,0,0,0,0,0,0,0,0,0,null,250,250,250,250,250,250,250,250,250,250,250,250,null,860,28,"2028-02-07",250,250,250,250,null,"2028-02-07",null,280.29985802546787,250,null,null,null,null,250,250,250,250,250,250,250,250,250,250,250,250,250,250,250,250,250,250,250,250,250,250,250,250,250,250,250,250,250,250,250,250,{"$f":"IF($G63>DD$33,0,$I$9)","v":250},250,250,250,250,250,250,250,250,250,250,250,250,250,250,250,250,250,250,250,250,250,250,250,250,250,250,250,250,250,250,250,250,250,250,250,250,0,0,0,0,0,0,0,0,0]
["2003-06-19","quinta-feira","Corpus Christi",null,null,889,29,"2028-03-07",250,165.26797831327173,165.26797831327173,4.9464705909162232,250,165.26797831327173,0,0,0,0,29,250,157.43443745685519,157.43443745685519,157.43443745685519,157.43443745685519,157.43443745685519,157.43443745685519,{"$error":"#N/A"},{"$error":"#N/A"},{"$error":"#N/A"},{"$error":"#N/A"},165.26797831327173,165.26797831327173,null,0,0,0,0,0,0,0,0,0,0,0,0,null,250,250,250,250,250,250,250,250,250,250,250,250,null,889,29,"2028-03-07",250,250,250,250,null,"2028-03-07",null,280.29985802546787,250,null,null,null,null,250,250,250,250,250,250,250,250,250,250,250,250,250,250,250,250,250,250,250,250,250,250,250,250,250,250,250,250,250,250,250,250,250,250,250,250,250,250,250,250,250,250,250,250,250,250,250,250,250,250,250,250,250,250,250,250,250,250,250,250,250,250,250,250,250,250,250,250,0,0,0,0,0,0,0,0,0,0]
["2003-09-07","domingo","Independência do Brasil",null,null,920,30,"2028-04-07",250,162.89984520348153,162.89984520348153,4.8755923669402019,250,162.89984520348153,0,0,0,0,30,250,154.91601171220142,154.91601171220142,154.91601171220142,154.91601171220142,154.91601171220142,154.91601171220142,{"$error":"#N/A"},{"$error":"#N/A"},{"$error":"#N/A"},{"$error":"#N/A"},162.89984520348153,162.89984520348153,null,0,0,0,0,0,0,0,0,0,0,0,0,null,250,250,250,250,250,250,250,250,250,250,250,250,null,920,30,"2028-04-07",250,250,250,250,null,"2028-04-07",null,280.29985802546787,250,null,null,null,null,250,250,250,250,250,250,250,250,250,250,250,250,250,250,250,250,250,250,250,250,250,250,250,250,250,250,250,250,250,250,250,250,250,250,250,250,250,250,250,250,250,250,250,250,250,250,250,250,250,250,250,250,250,250,250,250,250,250,250,250,250,250,250,250,250,250,250,0,0,0,0,0,0,0,0,0,0,0]
["2003-10-12","domingo","Nossa Sr.a Aparecida - Padroeira do Brasil",null,null,950,31,"2028-05-07",250,160.64041730940201,160.64041730940201,4.8079676900704023,250,160.64041730940201,0,0,0,0,31,250,152.51719016083166,152.51719016083166,152.51719016083166,152.51719016083166,152.51719016083166,152.51719016083166,{"$error":"#N/A"},{"$error":"#N/A"},{"$error":"#N/A"},{"$error":"#N/A"},160.64041730940201,160.64041730940201,null,0,0,0,0,0,0,0,0,0,0,0,0,null,250,250,250,250,250,250,250,250,250,250,250,250,null,950,31,"2028-05-07",250,250,250,250,null,"2028-05-07",null,280.29985802546787,250,null,null,null,null,250,250,250,250,250,250,250,250,250,250,250,250,250,250,250,250,250,250,250,250,250,250,250,250,250,250,250,250,250,250,250,250,250,250,250,250,250,250,250,250,250,250,250,250,250,250,250,250,250,250,250,250,250,250,250,250,250,250,250,250,250,250,250,250,250,250,0,0,0,0,0,0,0,0,0,0,0,0]
["2003-11-02","domingo","Finados",null,null,981,32,"2028-06-07",250,158.33859275219817,158.33859275219817,4.7390740810732908,250,158.33859275219817,0,0,0,0,32,250,150.0774239673103,150.0774239673103,150.0774239673103,150.0774239673103,150.0774239673103,150.0774239673103,{"$error":"#N/A"},{"$error":"#N/A"},{"$error":"#N/A"},{"$error":"#N/A"},158.33859275219817,158.33859275219817,null,0,0,0,0,0,0,0,0,0,0,0,0,null,250,250,250,250,250,250,250,250,250,250,250,250,null,981,32,"2028-06-07",250,250,250,250,null,"2028-06-07",null,280.29985802546787,250,null,null,null,null,250,250,250,250,250,250,250,250,250,250,250,250,250,250,250,{"$f":"IF($G67>CM$33,0,$I$9)","v":250},250,250,250,250,250,250,250,250,250,250,250,250,250,250,250,{"$f":"IF($G67>DC$33,0,$I$9)","v":250},250,250,250,250,250,250,250,250,250,250,250,250,250,250,250,250,250,250,250,250,250,250,250,250,250,250,250,250,250,250,250,250,250,0,0,0,0,0,0,0,0,0,0,0,0,0]
["2003-11-15","sábado","Proclamação da República",null,null,1011,33,"2028-07-07",250,156.14242962677147,156.14242962677147,4.6733429187292703,250,156.14242962677147,0,0,0,0,33,250,{"$f":"$T68/((U$29)^($H68-$H$35))","v":147.75352629522425},147.75352629522425,147.75352629522425,147.75352629522425,147.75352629522425,147.75352629522425,{"$error":"#N/A"},{"$error":"#N/A"},{"$error":"#N/A"},{"$error":"#N/A"},156.14242962677147,156.14242962677147,null,{"$f":"IF($I68<>0,0,U68*$B$1*MIN($F68,365))","v":0},0,0,0,0,0,0,0,0,0,0,0,null,{"$f":"$T68","v":250},250,250,250,250,250,250,250,250,250,250,250,null,1011,33,"2028-07-07",250,250,250,250,null,"2028-07-07",null,280.29985802546787,250,null,null,null,null,{"$f":"IF($G68>BX$33,0,$I$9)","v":250},250,250,250,250,250,250,250,250,250,250,250,250,250,250,250,250,250,250,250,250,250,250,250,250,250,250,250,250,250,250,250,250,250,250,250,250,250,250,250,250,250,250,250,250,250,250,250,250,250,250,250,250,250,250,250,250,250,250,250,250,250,250,250,0,0,0,0,0,0,0,0,{"$f":"IF($G68>ER$33,0,$I$9)","v":0},0,0,0,0,0]
["2003-12-25","quinta-feira","Natal",null,null,1042,34,"2028-08-07",250,153.90505695956708,153.90505695956708,4.6063783547998423,250,153.90505695956708,0,0,0,0,34,250,145.38996283035496,145.38996283035496,145.38996283035496,145.38996283035496,145.38996283035496,145.38996283035496,{"$error":"#N/A"},{"$error":"#N/A"},{"$error":"#N/A"},{"$error":"#N/A"},{"$f":"IF($I69<>0,$J69,$T69/((AE$29)^($H69-$H$35)))","v":153.90505695956708},153.90505695956708,null,0,0,0,0,0,0,0,0,0,0,0,0,null,250,250,250,250,250,250,250,250,250,250,250,250,null,1042,34,"2028-08-07",250,250,250,250,null,"2028-08-07",null,280.29985802546787,250,null,null,null,null,250,250,250,250,250,250,250,250,250,250,250,250,250,250,250,250,250,250,250,250,250,250,250,250,250,250,250,250,250,250,250,250,250,250,250,250,250,250,250,250,250,250,250,250,250,250,250,{"$f":"IF($G69>DS$33,0,$I$9)","v":250},250,250,250,250,250,250,250,250,250,250,250,250,250,250,250,0,0,0,0,0,0,0,0,0,0,0,0,0,0,0]
["2004-01-01","quinta-feira","Confraternização Universal",null,null,1073,35,"2028-09-07",250,151.69974371697853,151.69974371697853,4.5403733294491673,250,151.69974371697853,0,0,0,0,35,250,143.06420849527458,143.06420849527458,143.06420849527458,143.06420849527458,143.06420849527458,143.06420849527458,{"$error":"#N/A"},{"$error":"#N/A"},{"$error":"#N/A"},{"$error":"#N/A"},151.69974371697853,151.69974371697853,null,0,0,0,0,0,0,0,0,0,0,0,0,null,250,250,250,250,250,250,250,250,250,250,250,250,null,1073,35,"2028-09-07",250,250,250,250,null,"2028-09-07",null,280.29985802546787,250,null,null,null,null,250,250,250,250,250,250,250,250,250,250,250,250,250,250,250,250,250,250,250,250,250,250,250,250,250,250,250,250,250,250,250,250,250,250,250,250,250,250,250,250,250,250,250,250,250,250,250,250,250,250,250,250,250,250,250,250,250,250,250,250,250,250,0,0,0,0,0,0,0,0,0,0,0,0,0,0,0,0]
["2004-02-23","segunda-feira","Carnaval",null,null,1103,36,"2028-10-07",250,149.59566171462481,149.59566171462481,4.4773981551187205,250,149.59566171462481,0,0,0,0,36,250,140.84890807038573,140.84890807038573,140.84890807038573,140.84890807038573,140.84890807038573,140.84890807038573,{"$error":"#N/A"},{"$error":"#N/A"},{"$error":"#N/A"},{"$error":"#N/A"},149.59566171462481,149.59566171462481,null,0,0,0,0,0,0,0,0,0,0,0,0,null,250,250,250,250,250,250,250,250,250,250,250,250,null,1103,36,"2028-10-07",250,250,250,250,null,"2028-10-07",null,280.29985802546787,250,null,null,null,null,250,250,250,250,250,250,250,250,250,250,250,250,250,250,250,250,250,250,250,250,250,250,250,250,250,250,250,250,250,250,250,250,250,250,250,250,250,250,250,250,250,250,250,250,250,250,250,250,250,250,250,250,250,250,250,250,250,250,250,250,250,0,0,0,0,0,0,0,0,0,0,0,0,0,0,0,0,0]
["2004-02-24","terça-feira","Carnaval",null,null,1134,37,"2028-11-07",250,147.45209801158327,147.45209801158327,4.4132412934866876,250,147.45209801158327,0,0,0,0,37,250,138.59579546096671,138.59579546096671,138.59579546096671,138.59579546096671,138.59579546096671,138.59579546096671,{"$error":"#N/A"},{"$error":"#N/A"},{"$error":"#N/A"},{"$error":"#N/A"},147.45209801158327,147.45209801158327,null,0,0,0,0,0,0,0,0,0,0,0,0,null,250,250,250,250,250,250,250,250,250,250,250,250,null,1134,37,"2028-11-07",250,250,250,250,null,"2028-11-07",null,280.29985802546787,250,null,null,null,null,250,250,250,250,250,250,250,250,250,250,250,250,250,250,250,250,250,250,250,250,250,250,250,250,250,250,250,250,250,250,250,250,250,250,250,250,250,250,250,250,250,250,250,250,250,250,250,250,250,250,250,250,250,250,250,250,250,250,250,250,0,0,0,0,0,0,0,0,0,0,0,0,0,0,0,0,0,0]
["2004-04-09","sexta-feira","Paixão de Cristo",null,null,1164,38,"2028-12-07",250,145.40693103876166,145.40693103876166,4.3520294459901363,250,145.40693103876166,0,0,0,0,38,250,136.44968688634984,136.44968688634984,136.44968688634984,136.44968688634984,136.44968688634984,136.44968688634984,{"$error":"#N/A"},{"$error":"#N/A"},{"$error":"#N/A"},{"$error":"#N/A"},145.40693103876166,145.40693103876166,null,0,0,0,0,0,0,0,0,0,0,0,0,null,250,250,250,250,250,250,250,250,250,250,250,250,null,1164,38,"2028-12-07",250,250,250,250,null,"2028-12-07",null,280.29985802546787,250,null,null,null,null,250,250,250,250,250,250,250,250,250,250,250,250,250,250,250,250,250,250,250,250,250,250,250,250,250,250,250,250,250,250,250,250,250,250,250,250,250,250,250,250,250,250,250,250,250,250,250,250,250,250,250,250,250,250,250,250,250,250,250,0,0,0,0,0,0,0,0,0,0,0,0,0,0,0,0,0,0,0]
["2004-04-21","quarta-feira","Tiradentes",null,null,1195,39,"2029-01-07",250,143.32338786663456,143.32338786663456,4.2896689988483727,250,143.32338786663456,0,0,0,0,39,250,134.26694713858217,134.26694713858217,134.26694713858217,134.26694713858217,134.26694713858217,134.26694713858217,{"$error":"#N/A"},{"$error":"#N/A"},{"$error":"#N/A"},{"$error":"#N/A"},143.32338786663456,143.32338786663456,null,0,0,0,0,0,0,0,0,0,0,0,0,null,250,250,250,250,250,250,250,250,250,250,250,250,null,1195,39,"2029-01-07",250,250,250,250,null,"2029-01-07",null,280.29985802546787,250,null,null,null,null,250,250,250,250,250,250,250,250,250,250,250,250,250,250,250,250,250,250,250,250,250,250,250,250,250,250,250,250,250,250,250,250,250,250,250,250,250,250,250,250,250,250,250,250,250,250,250,250,250,250,250,250,250,250,250,250,250,250,0,0,0,0,0,0,0,0,0,0,0,0,0,0,0,0,0,0,0,0]
["2004-05-01","sábado","Dia do Trabalho",null,null,1226,40,"2029-02-07",250,141.26969988861069,141.26969988861069,4.2282021176661182,250,141.26969988861069,0,0,0,0,40,250,132.11912394441893,132.11912394441893,132.11912394441893,132.11912394441893,132.11912394441893,132.11912394441893,{"$error":"#N/A"},{"$error":"#N/A"},{"$error":"#N/A"},{"$error":"#N/A"},141.26969988861069,141.26969988861069,null,0,0,0,0,0,0,0,0,0,0,0,0,null,250,250,250,250,250,250,250,250,250,250,250,250,null,1226,40,"2029-02-07",250,250,250,250,null,"2029-02-07",null,280.29985802546787,250,null,null,null,null,250,250,250,250,250,250,250,250,250,250,250,250,250,250,250,250,250,250,250,250,250,250,250,250,250,250,250,250,250,250,250,250,250,250,250,250,250,250,250,250,250,250,250,250,250,250,250,250,250,250,250,250,250,250,250,250,250,0,0,0,0,0,0,0,0,0,0,0,0,0,0,0,0,0,0,0,0,0]
["2004-06-10","quinta-feira","Corpus Christi",null,null,1254,41,"2029-03-07",250,139.44006112193722,139.44006112193722,4.1734410293795809,250,139.44006112193722,0,0,0,0,41,250,130.20870135232946,130.20870135232946,130.20870135232946,130.20870135232946,130.20870135232946,130.20870135232946,{"$error":"#N/A"},{"$error":"#N/A"},{"$error":"#N/A"},{"$error":"#N/A"},139.44006112193722,139.44006112193722,null,0,0,0,0,0,0,0,0,0,0,0,0,null,250,250,250,250,250,250,250,250,250,250,250,250,null,1254,41,"2029-03-07",250,250,250,250,null,"2029-03-07",null,280.29985802546787,250,null,null,null,null,250,250,250,250,250,250,250,250,250,250,250,250,250,250,250,250,250,250,250,250,250,250,250,250,250,250,250,250,250,250,250,250,250,250,250,250,250,250,250,250,250,250,250,250,250,250,250,250,250,250,250,250,250,250,250,250,0,0,0,0,0,0,0,0,0,0,0,0,0,0,0,0,0,0,0,0,0,0]
["2004-09-07","terça-feira","Independência do Brasil",null,null,1285,42,"2029-04-07",250,137.44201752665523,137.44201752665523,4.1136395845727911,250,137.44201752665523,0,0,0,0,42,250,128.12579655106254,128.12579655106254,128.12579655106254,128.12579655106254,128.12579655106254,128.12579655106254,{"$error":"#N/A"},{"$error":"#N/A"},{"$error":"#N/A"},{"$error":"#N/A"},137.44201752665523,137.44201752665523,null,0,0,0,0,0,0,0,0,0,0,0,0,null,250,250,250,250,250,250,250,250,250,250,250,250,null,1285,42,"2029-04-07",250,250,250,250,null,"2029-04-07",null,280.29985802546787,250,null,null,null,null,250,250,250,250,250,250,250,250,250,250,250,250,250,250,250,250,250,250,250,250,250,250,250,250,250,250,250,250,250,250,250,250,250,250,250,250,250,250,250,250,250,250,250,250,250,250,250,250,250,250,250,250,250,250,{"$f":"IF($G77>DZ$33,0,$I$9)","v":250},0,0,0,0,0,0,0,0,0,0,0,0,0,0,0,0,0,0,0,0,0,0,0]
["2004-10-12","terça-feira","Nossa Sr.a Aparecida - Padroeira do Brasil",null,null,1315,43,"2029-05-07",250,135.53569080283066,135.53569080283066,4.0565832257287218,250,135.53569080283066,0,0,0,0,43,250,126.14181233499521,126.14181233499521,126.14181233499521,126.14181233499521,126.14181233499521,126.14181233499521,{"$error":"#N/A"},{"$error":"#N/A"},{"$error":"#N/A"},{"$error":"#N/A"},135.53569080283066,135.53569080283066,null,0,0,0,0,0,0,0,0,0,0,0,0,null,250,250,250,250,250,250,250,250,250,250,250,250,null,1315,43,"2029-05-07",250,250,250,250,null,"2029-05-07",null,280.29985802546787,250,null,null,null,null,250,250,250,250,250,250,250,250,250,250,250,250,250,250,250,250,250,250,250,250,250,250,250,250,250,250,250,250,250,250,250,250,250,250,250,250,250,250,250,250,250,250,250,250,250,250,250,{"$f":"IF($G78>DS$33,0,$I$9)","v":250},250,250,250,250,250,250,0,0,0,0,0,0,0,0,0,0,0,0,0,0,0,0,0,0,0,0,0,0,0,0]
["2004-11-02","terça-feira","Finados",null,null,1346,44,"2029-06-07",250,133.59359312471864,133.59359312471864,3.9984562422228289,250,133.59359312471864,0,0,0,0,44,250,124.12396418948514,124.12396418948514,124.12396418948514,124.12396418948514,124.12396418948514,124.12396418948514,{"$error":"#N/A"},{"$error":"#N/A"},{"$error":"#N/A"},{"$error":"#N/A"},133.59359312471864,133.59359312471864,null,0,0,0,0,0,0,0,0,0,0,0,0,null,250,250,250,250,250,250,250,250,250,250,250,250,null,1346,44,"2029-06-07",250,250,250,250,null,"2029-06-07",null,280.29985802546787,250,null,null,null,null,250,250,250,250,250,250,250,250,250,250,250,250,250,250,250,250,250,250,250,250,250,250,250,250,250,250,250,250,250,250,250,250,250,250,250,250,250,250,250,250,250,250,250,250,250,250,250,250,250,250,250,250,250,0,0,0,0,0,0,0,0,0,0,0,0,0,0,0,0,0,0,0,0,0,0,0,0,0]
["2004-11-15","segunda-feira","Proclamação da República",null,null,1376,45,"2029-07-07",250,131.74064421369138,131.74064421369138,3.9429974813157833,250,131.74064421369138,0,0,0,0,45,250,122.20194698126821,122.20194698126821,122.20194698126821,122.20194698126821,122.20194698126821,122.20194698126821,{"$error":"#N/A"},{"$error":"#N/A"},{"$error":"#N/A"},{"$error":"#N/A"},131.74064421369138,131.74064421369138,null,0,0,0,0,0,0,0,0,0,0,0,0,null,250,250,250,250,250,250,250,250,250,250,250,250,null,1376,45,"2029-07-07",250,250,250,250,null,"2029-07-07",null,280.29985802546787,250,null,null,null,null,250,250,250,250,250,250,250,250,250,250,250,250,250,250,250,250,250,250,250,250,250,250,250,250,250,250,250,250,250,250,250,250,250,250,250,250,250,250,250,250,250,250,250,250,250,250,250,250,250,250,250,250,0,0,0,0,0,0,0,0,0,0,0,0,0,0,0,0,0,0,0,0,0,0,0,0,0,0]
["2004-12-25","sábado","Natal",null,null,1407,46,"2029-08-07",250,129.85292594756629,129.85292594756629,3.8864980736106589,250,129.85292594756629,0,0,0,0,46,250,120.24712353669126,120.24712353669126,120.24712353669126,120.24712353669126,120.24712353669126,120.24712353669126,{"$error":"#N/A"},{"$error":"#N/A"},{"$error":"#N/A"},{"$error":"#N/A"},129.85292594756629,129.85292594756629,null,0,0,0,0,0,0,0,0,0,0,0,0,null,250,250,250,250,250,250,250,250,250,250,250,250,null,1407,46,"2029-08-07",250,250,250,250,null,"2029-08-07",null,280.29985802546787,250,null,null,null,null,250,250,250,250,250,250,250,250,250,250,250,250,250,250,250,250,250,250,250,250,250,250,250,250,250,250,250,250,250,250,250,250,250,250,250,250,250,250,250,250,250,250,250,250,250,250,250,250,250,250,250,0,0,0,0,0,0,0,0,0,0,0,0,0,0,0,0,0,0,0,0,0,0,0,0,0,0,0]
["2005-01-01","sábado","Confraternização Universal",null,null,1438,47,"2029-09-07",250,127.99225689069264,127.99225689069264,3.830808248738431,250,127.99225689069264,0,0,0,0,47,250,118.32357074527384,118.32357074527384,118.32357074527384,118.32357074527384,118.32357074527384,118.32357074527384,{"$error":"#N/A"},{"$error":"#N/A"},{"$error":"#N/A"},{"$error":"#N/A"},127.99225689069264,127.99225689069264,null,0,0,0,0,0,0,0,0,0,0,0,0,null,250,250,250,250,250,250,250,250,250,250,250,250,null,1438,47,"2029-09-07",250,250,250,250,null,"2029-09-07",null,280.29985802546787,250,null,null,null,null,250,250,250,250,250,250,250,250,250,250,250,250,250,250,250,250,250,250,250,250,250,250,250,250,250,250,250,250,250,250,250,250,250,250,250,250,250,250,250,250,250,250,250,250,250,250,250,250,250,250,0,0,0,0,0,0,0,0,0,0,0,0,0,0,0,0,0,0,0,0,0,0,0,0,0,0,0,0]
["2005-02-07","segunda-feira","Carnaval",null,null,1468,48,"2029-10-07",250,126.2169987553409,126.2169987553409,3.7776747727473534,250,126.2169987553409,0,0,0,0,48,250,116.49137064922374,116.49137064922374,116.49137064922374,116.49137064922374,116.49137064922374,116.49137064922374,{"$error":"#N/A"},{"$error":"#N/A"},{"$error":"#N/A"},{"$error":"#N/A"},126.2169987553409,126.2169987553409,null,0,0,0,0,0,0,0,0,0,0,0,0,null,250,250,250,250,250,250,250,250,250,250,250,250,null,1468,48,"2029-10-07",250,250,250,250,null,"2029-10-07",null,280.29985802546787,250,null,null,null,null,250,250,250,250,250,250,250,250,250,250,250,250,250,250,250,250,{"$f":"IF($G83>CN$33,0,$I$9)","v":250},250,250,250,250,250,250,250,250,250,250,250,250,250,250,250,250,250,250,250,250,250,250,250,250,250,250,250,250,250,250,250,250,0,0,0,0,0,0,0,0,0,0,0,0,0,0,0,0,0,0,0,0,0,0,0,0,0,0,0,0,0]
["2005-02-08","terça-feira","Carnaval",null,null,1499,49,"2029-11-07",250,124.40842908067414,124.40842908067414,3.723544282384577,250,124.40842908067414,0,0,0,0,49,250,{"$f":"$T84/((U$29)^($H84-$H$35))","v":114.62789737354097},114.62789737354097,114.62789737354097,114.62789737354097,114.62789737354097,114.62789737354097,{"$error":"#N/A"},{"$error":"#N/A"},{"$error":"#N/A"},{"$error":"#N/A"},124.40842908067414,124.40842908067414,null,0,0,0,0,0,0,0,0,0,0,0,0,null,{"$f":"$T84","v":250},250,250,250,250,250,250,250,250,250,250,250,null,1499,49,"2029-11-07",250,250,250,250,null,"2029-11-07",null,280.29985802546787,250,null,null,null,null,{"$f":"IF($G84>BX$33,0,$I$9)","v":250},250,250,250,250,250,250,250,250,250,250,250,250,250,250,250,250,250,250,250,250,250,250,250,250,250,250,250,250,250,250,250,250,250,250,250,250,250,250,250,250,250,250,250,250,250,250,250,0,0,0,0,0,0,0,0,0,0,0,0,0,0,0,0,0,0,0,0,0,0,0,0,0,0,0,0,0,0]
["2005-03-25","sexta-feira","Paixão de Cristo",null,null,1529,50,"2029-12-07",250,122.68287879195304,122.68287879195304,3.6718985622431548,250,122.68287879195304,0,0,0,0,50,250,112.8529235179095,112.8529235179095,112.8529235179095,112.8529235179095,112.8529235179095,112.8529235179095,{"$error":"#N/A"},{"$error":"#N/A"},{"$error":"#N/A"},{"$error":"#N/A"},{"$f":"IF($I85<>0,$J85,$T85/((AE$29)^($H85-$H$35)))","v":122.68287879195304},122.68287879195304,null,0,0,0,0,0,0,0,0,0,0,0,0,null,250,250,250,250,250,250,250,250,250,250,250,250,null,1529,50,"2029-12-07",250,250,250,250,null,"2029-12-07",null,280.29985802546787,250,null,null,null,null,250,250,250,250,250,250,250,250,250,250,250,250,250,250,250,250,250,250,250,250,250,250,250,250,250,250,250,250,250,250,250,250,250,250,250,250,250,250,250,250,250,250,250,250,250,250,250,0,0,0,0,0,0,0,0,0,0,0,0,0,0,0,0,0,0,0,0,0,0,0,0,0,0,0,0,0,0,0]
["2005-04-21","quinta-feira","Tiradentes",null,null,1560,51,"2030-01-07",250,120.92494969862987,120.92494969862987,3.6192837444799921,250,120.92494969862987,0,0,0,0,51,250,111.04765325723456,111.04765325723456,111.04765325723456,111.04765325723456,111.04765325723456,111.04765325723456,{"$error":"#N/A"},{"$error":"#N/A"},{"$error":"#N/A"},{"$error":"#N/A"},120.92494969862987,120.92494969862987,null,0,0,0,0,0,0,0,0,0,0,0,0,null,250,250,250,250,250,250,250,250,250,250,250,250,null,1560,51,"2030-01-07",250,250,250,250,null,"2030-01-07",null,280.29985802546787,250,null,null,null,null,250,250,250,250,250,250,250,250,250,250,250,250,250,250,250,250,250,250,250,250,250,250,250,250,250,250,250,250,250,250,250,250,250,250,250,250,250,250,250,250,250,250,250,250,250,250,0,0,0,0,0,0,0,0,0,0,0,0,0,0,0,0,0,0,0,0,0,0,0,0,0,0,0,0,0,0,0,0]
["2005-05-01","domingo","Dia do Trabalho",null,null,1591,52,"2030-02-07",250,119.19221005902335,119.19221005902335,3.567422847066569,250,119.19221005902335,0,0,0,0,52,250,109.27126129773687,109.27126129773687,109.27126129773687,109.27126129773687,109.27126129773687,109.27126129773687,{"$error":"#N/A"},{"$error":"#N/A"},{"$error":"#N/A"},{"$error":"#N/A"},119.19221005902335,119.19221005902335,null,0,0,0,0,0,0,{"$f":"IF($I87<>0,0,AA87*$B$1*MIN($F87,365))","v":0},0,0,0,0,0,null,250,250,250,250,250,250,250,250,250,250,250,250,null,1591,52,"2030-02-07",250,250,250,250,null,"2030-02-07",null,280.29985802546787,250,null,null,null,null,250,250,250,250,250,250,250,250,250,250,250,250,250,250,250,250,250,250,250,250,250,250,250,{"$f":"IF($G87>CU$33,0,$I$9)","v":250},250,250,250,250,250,250,250,250,250,250,250,250,250,250,250,{"$f":"IF($G87>DK$33,0,$I$9)","v":250},250,250,250,250,250,0,0,0,0,0,0,0,0,0,0,0,0,0,0,0,0,0,0,0,0,0,0,0,0,0,0,0,0,0,0,0,0,0]
["2005-05-26","quinta-feira","Corpus Christi",null,null,1619,53,"2030-03-07",250,117.64850544025919,117.64850544025919,3.5212197678269574,250,117.64850544025919,0,0,0,0,53,250,107.69121535119302,107.69121535119302,107.69121535119302,107.69121535119302,107.69121535119302,107.69121535119302,{"$error":"#N/A"},{"$error":"#N/A"},{"$error":"#N/A"},{"$error":"#N/A"},117.64850544025919,117.64850544025919,null,0,0,0,{"$f":"IF($I88<>0,0,X88*$B$1*MIN($F88,365))","v":0},{"$f":"IF($I88<>0,0,Y88*$B$1*MIN($F88,365))","v":0},{"$f":"IF($I88<>0,0,Z88*$B$1*MIN($F88,365))","v":0},0,0,0,0,0,0,null,250,250,250,250,250,250,250,250,250,250,250,250,null,1619,53,"2030-03-07",250,250,250,250,null,"2030-03-07",null,280.29985802546787,250,null,null,null,null,250,250,250,250,250,250,250,250,250,250,250,250,250,250,250,250,{"$f":"IF($G88>CN$33,0,$I$9)","v":250},250,250,250,250,250,250,250,250,250,250,250,250,250,250,250,250,250,250,250,250,250,250,250,250,250,250,250,0,0,0,0,0,0,0,0,0,0,0,0,0,0,0,0,0,0,0,0,0,0,0,0,0,0,0,0,0,0,0,0,0,0]
["2005-09-07","quarta-feira","Independência do Brasil",null,null,1650,54,"2030-04-07",250,115.96271413395846,115.96271413395846,3.4707640340293771,250,115.96271413395846,0,0,0,0,54,250,105.9685151999772,105.9685151999772,105.9685151999772,105.9685151999772,105.9685151999772,105.9685151999772,{"$error":"#N/A"},{"$error":"#N/A"},{"$error":"#N/A"},{"$error":"#N/A"},115.96271413395846,115.96271413395846,null,0,0,0,0,0,0,0,0,0,0,0,0,null,250,250,250,250,250,250,250,250,250,250,250,250,null,1650,54,"2030-04-07",250,250,250,250,null,"2030-04-07",null,280.29985802546787,250,null,null,null,null,250,250,250,250,250,250,250,250,250,250,250,250,250,250,250,250,250,250,250,250,250,250,250,250,250,250,250,250,250,250,250,250,250,250,250,250,250,250,250,250,250,250,250,0,0,0,0,0,0,0,0,0,0,0,0,0,0,0,0,0,0,0,0,0,0,0,0,0,0,0,0,0,0,0,0,0,0,0]
["2005-10-12","quarta-feira","Nossa Sr.a Aparecida - Padroeira do Brasil",null,null,1680,55,"2030-05-07",250,114.35430627660196,114.35430627660196,3.422624386858697,250,114.35430627660196,0,0,0,0,55,250,104.32762892089711,104.32762892089711,104.32762892089711,104.32762892089711,104.32762892089711,104.32762892089711,{"$error":"#N/A"},{"$error":"#N/A"},{"$error":"#N/A"},{"$error":"#N/A"},114.35430627660196,114.35430627660196,null,0,0,0,0,0,0,0,0,0,0,0,0,null,250,250,250,250,250,250,250,250,250,250,250,250,null,1680,55,"2030-05-07",250,250,250,250,null,"2030-05-07",null,280.29985802546787,250,null,null,null,null,250,250,250,250,250,250,250,250,250,250,250,250,250,250,250,250,250,250,250,250,250,250,250,250,250,250,250,250,250,250,250,250,250,250,250,250,250,250,250,250,250,250,0,0,0,0,0,0,0,0,0,0,0,0,0,0,0,0,0,0,0,0,0,0,0,0,0,0,0,0,0,0,0,0,0,0,0,0]
["2005-11-02","quarta-feira","Finados",null,null,1711,56,"2030-06-07",250,112.71571771453111,112.71571771453111,3.3735814311959165,250,112.71571771453111,0,0,0,0,56,250,102.65873493050141,102.65873493050141,102.65873493050141,102.65873493050141,102.65873493050141,102.65873493050141,{"$error":"#N/A"},{"$error":"#N/A"},{"$error":"#N/A"},{"$error":"#N/A"},112.71571771453111,112.71571771453111,null,0,0,0,0,0,0,0,0,0,0,0,0,null,250,250,250,250,250,250,250,250,250,250,250,250,null,1711,56,"2030-06-07",250,250,250,250,null,"2030-06-07",null,280.29985802546787,250,null,null,null,null,250,250,250,250,250,250,250,250,250,250,250,250,250,250,250,250,250,250,250,250,250,250,250,250,250,250,250,250,250,250,250,250,250,250,250,250,250,250,250,250,250,0,0,0,0,0,0,0,0,0,0,0,0,0,0,0,0,0,0,0,0,0,0,0,0,0,0,0,0,0,0,0,0,0,0,0,0,0]
["2005-11-15","terça-feira","Proclamação da República",null,null,1741,57,"2030-07-07",250,111.15234583785872,111.15234583785872,3.3267897109271116,250,111.15234583785872,0,0,0,0,57,250,101.06909946889957,101.06909946889957,101.06909946889957,101.06909946889957,101.06909946889957,101.06909946889957,{"$error":"#N/A"},{"$error":"#N/A"},{"$error":"#N/A"},{"$error":"#N/A"},111.15234583785872,111.15234583785872,null,0,0,0,0,0,0,0,0,0,0,0,0,null,250,250,250,250,250,250,250,250,250,250,250,250,null,1741,57,"2030-07-07",250,250,250,250,null,"2030-07-07",null,280.29985802546787,250,null,null,null,null,250,250,250,250,250,250,250,250,250,250,250,250,250,250,250,250,250,250,250,250,250,250,250,250,250,250,250,250,250,250,250,250,250,250,250,250,250,250,250,250,0,0,0,0,0,0,0,0,0,0,0,0,0,0,0,0,0,0,0,0,0,0,0,0,0,0,0,0,0,0,0,0,0,0,0,0,0,0]
["2005-12-25","domingo","Natal",null,null,1772,58,"2030-08-07",250,109.55963832672468,109.55963832672468,3.2791199751188693,250,109.55963832672468,0,0,0,0,58,250,99.452331078176911,99.452331078176911,99.452331078176911,99.452331078176911,99.452331078176911,99.452331078176911,{"$error":"#N/A"},{"$error":"#N/A"},{"$error":"#N/A"},{"$error":"#N/A"},109.55963832672468,109.55963832672468,null,0,0,0,0,0,0,0,0,0,0,0,0,null,250,250,250,250,250,250,250,250,250,250,250,250,null,1772,58,"2030-08-07",250,250,250,250,null,"2030-08-07",null,280.29985802546787,250,null,null,null,null,250,250,250,250,250,250,250,250,250,250,250,250,250,250,250,250,250,250,250,250,250,250,250,250,250,250,250,250,250,250,250,250,250,250,250,250,250,250,250,0,0,0,0,0,0,0,0,0,0,0,0,0,0,0,0,0,0,0,0,0,{"$f":"IF($G93>EF$33,0,$I$9)","v":0},0,0,0,0,0,0,0,0,0,0,0,0,0,0,0,0,0]
["2006-01-01","domingo","Confraternização Universal",null,null,1803,59,"2030-09-07",250,107.98975280100986,107.98975280100986,3.2321333013342253,250,107.98975280100986,0,0,0,0,59,250,97.861425587618356,97.861425587618356,97.861425587618356,97.861425587618356,97.861425587618356,97.861425587618356,{"$error":"#N/A"},{"$error":"#N/A"},{"$error":"#N/A"},{"$error":"#N/A"},107.98975280100986,107.98975280100986,null,0,0,0,0,0,0,0,0,0,0,0,0,null,250,250,250,250,250,250,250,250,250,250,250,250,null,1803,59,"2030-09-07",250,250,250,0,null,"2030-09-07",null,280.29985802546787,250,null,null,null,null,250,250,250,250,250,250,250,250,250,250,250,250,250,250,250,250,250,250,250,250,250,250,250,250,250,250,250,250,250,250,250,250,250,250,250,250,250,250,0,{"$f":"IF($G94>DK$33,0,$I$9)","v":0},0,0,0,0,0,0,0,0,0,0,0,0,0,0,0,0,0,0,0,0,0,0,0,0,0,0,0,0,0,0,0,0,0,0,0,0,0,0]
["2006-02-27","segunda-feira","Carnaval",null,null,1833,60,"2030-10-07",250,106.49193026196096,106.49193026196096,3.1873034727404912,250,106.49193026196096,0,0,0,0,60,250,96.346074823337958,96.346074823337958,96.346074823337958,96.346074823337958,96.346074823337958,96.346074823337958,{"$error":"#N/A"},{"$error":"#N/A"},{"$error":"#N/A"},{"$error":"#N/A"},106.49193026196096,106.49193026196096,null,0,0,0,0,0,0,0,0,0,0,0,0,null,250,250,250,250,250,250,250,250,250,250,250,250,null,1833,60,"2030-10-07",250,250,0,0,null,"2030-10-07",null,280.29985802546787,250,null,null,null,null,250,250,250,250,250,250,250,250,250,250,250,250,250,250,250,250,250,250,250,250,250,250,250,250,250,250,250,250,250,250,250,250,250,250,250,250,250,0,0,0,0,0,0,0,0,0,0,0,0,0,0,0,0,0,0,0,0,0,0,0,0,0,0,0,0,0,0,0,0,0,0,0,0,0,0,0,0,0]
["2006-02-28","terça-feira","Carnaval",null,null,1864,61,"2030-11-07",0,0,0,0,0,0,0,0,0,0,61,250,94.804859069332878,94.804859069332878,94.804859069332878,94.804859069332878,94.804859069332878,94.804859069332878,{"$error":"#N/A"},{"$error":"#N/A"},{"$error":"#N/A"},{"$error":"#N/A"},{"$error":"#N/A"},{"$error":"#N/A"},null,2.8375094319451328,2.8375094319451328,2.8375094319451328,2.8375094319451328,2.8375094319451328,2.8375094319451328,{"$error":"#N/A"},{"$error":"#N/A"},{"$error":"#N/A"},{"$error":"#N/A"},{"$error":"#N/A"},{"$error":"#N/A"},null,250,250,250,250,250,250,250,250,250,250,250,250,null,1864,61,"2030-11-07",250,250,0,0,null,"2030-11-07",null,0,0,null,null,null,null,250,250,250,250,250,250,250,250,250,250,250,250,250,250,250,250,250,250,250,250,250,250,250,250,250,250,250,250,250,250,250,250,250,250,250,250,0,0,0,0,0,0,0,0,0,0,0,0,0,0,0,0,0,0,0,0,0,0,0,0,0,0,0,0,0,0,0,0,0,0,0,0,0,0,0,0,0,0]
["2006-04-14","sexta-feira","Paixão de Cristo",null,null,1894,62,"2030-12-07",0,0,0,0,0,0,0,0,0,0,62,250,93.336838194043466,93.336838194043466,93.336838194043466,93.336838194043466,93.336838194043466,93.336838194043466,{"$error":"#N/A"},{"$error":"#N/A"},{"$error":"#N/A"},{"$error":"#N/A"},{"$error":"#N/A"},{"$error":"#N/A"},null,2.7935715671477208,2.7935715671477208,2.7935715671477208,2.7935715671477208,2.7935715671477208,2.7935715671477208,{"$error":"#N/A"},{"$error":"#N/A"},{"$error":"#N/A"},{"$error":"#N/A"},{"$error":"#N/A"},{"$error":"#N/A"},null,250,250,250,250,250,250,250,250,250,250,250,250,null,1894,62,"2030-12-07",0,250,0,0,null,"2030-12-07",null,0,0,null,null,null,null,250,250,250,250,250,250,250,250,250,250,250,250,250,250,250,250,250,250,250,250,250,250,250,250,250,250,250,250,250,250,250,250,250,250,250,0,0,0,0,0,0,0,0,0,0,0,0,0,0,0,0,0,0,0,0,0,0,0,0,0,0,0,0,0,0,0,0,0,0,0,0,0,0,0,0,0,0,0]
["2006-04-21","sexta-feira","Tiradentes",null,null,1925,63,"2031-01-07",0,0,0,0,0,0,0,0,0,0,63,250,91.843760186273528,91.843760186273528,91.843760186273528,91.843760186273528,91.843760186273528,91.843760186273528,{"$error":"#N/A"},{"$error":"#N/A"},{"$error":"#N/A"},{"$error":"#N/A"},{"$error":"#N/A"},{"$error":"#N/A"},null,2.7488837423751669,2.7488837423751669,2.7488837423751669,2.7488837423751669,2.7488837423751669,2.7488837423751669,{"$error":"#N/A"},{"$error":"#N/A"},{"$error":"#N/A"},{"$error":"#N/A"},{"$error":"#N/A"},{"$error":"#N/A"},null,250,250,250,250,250,250,250,250,250,250,250,250,null,1925,63,"2031-01-07",0,0,0,0,null,"2031-01-07",null,0,0,null,null,null,null,250,250,250,250,250,250,250,250,250,250,250,250,250,250,250,250,250,250,250,250,250,250,250,250,250,250,250,250,250,250,250,250,250,250,0,0,0,0,0,0,0,0,0,0,0,0,0,0,0,0,0,0,0,0,0,0,0,0,0,0,0,0,0,0,0,0,0,0,0,0,0,0,0,0,0,0,0,0]
["2006-05-01","segunda-feira","Dia do Trabalho",null,null,1956,64,"2031-02-07",0,0,0,0,0,0,0,0,0,0,64,250,90.374566445213503,90.374566445213503,90.374566445213503,90.374566445213503,90.374566445213503,90.374566445213503,{"$error":"#N/A"},{"$error":"#N/A"},{"$error":"#N/A"},{"$error":"#N/A"},{"$error":"#N/A"},{"$error":"#N/A"},null,2.7049107737052402,2.7049107737052402,2.7049107737052402,2.7049107737052402,2.7049107737052402,2.7049107737052402,{"$error":"#N/A"},{"$error":"#N/A"},{"$error":"#N/A"},{"$error":"#N/A"},{"$error":"#N/A"},{"$error":"#N/A"},null,250,250,250,250,250,250,250,250,250,250,250,250,null,1956,64,"2031-02-07",0,0,0,0,null,"2031-02-07",null,0,0,null,null,null,null,250,250,250,250,250,250,250,250,250,250,250,250,250,250,250,{"$f":"IF($G99>CM$33,0,$I$9)","v":250},250,250,250,250,250,250,250,250,250,250,250,250,250,250,250,250,250,0,0,0,0,0,0,0,0,0,0,0,0,0,0,0,0,0,0,0,0,0,0,0,0,0,0,0,0,0,0,0,0,0,0,0,0,0,0,0,0,0,0,0,0,0]
["2006-06-15","quinta-feira","Corpus Christi",null,null,1984,65,"2031-03-07",0,{"$f":"I100/($J$32^(H100-$H$35))","v":0},{"$f":"I100/($I$32^(H100-$H$35))","v":0},0,{"$f":"IF($G100>$I$10,0,$I$9)","v":0},{"$f":"M100/($J$32^($H100-$H$35))","v":0},0,{"$f":"IF($G100>$I$10,0,$M$27)","v":0},{"$f":"P100/($J$32^($H100-$H$35))","v":0},{"$f":"($N$27/($J$8+$N$27))*$Q100*$B$1*MIN($F100,365)","v":0},65,{"$f":"IF($G100>$P$3,0,$J$9)","v":250},{"$f":"$T100/((U$29)^($H100-$H$35))","v":89.067763854243722},89.067763854243722,89.067763854243722,89.067763854243722,89.067763854243722,89.067763854243722,{"$error":"#N/A"},{"$error":"#N/A"},{"$error":"#N/A"},{"$error":"#N/A"},{"$error":"#N/A"},{"$error":"#N/A"},null,2.6657981721575146,2.6657981721575146,2.6657981721575146,2.6657981721575146,2.6657981721575146,2.6657981721575146,{"$error":"#N/A"},{"$error":"#N/A"},{"$error":"#N/A"},{"$error":"#N/A"},{"$error":"#N/A"},{"$error":"#N/A"},null,{"$f":"$T100","v":250},250,250,250,250,250,250,250,250,250,250,250,null,1984,65,"2031-03-07",0,0,0,0,null,"2031-03-07",null,0,0,null,null,null,null,{"$f":"IF($G100>BX$33,0,$I$9)","v":250},250,250,250,250,250,250,250,250,250,250,250,250,250,250,250,250,250,250,250,250,250,250,250,250,250,250,250,250,250,250,250,0,0,0,0,0,0,0,0,0,0,0,0,0,0,0,0,0,0,0,0,0,0,0,0,0,0,0,0,{"$f":"IF($G100>EF$33,0,$I$9)","v":0},0,0,0,0,0,0,0,0,0,0,0,0,0,0,0,0,0]
["2006-09-07","quinta-feira","Independência do Brasil",null,null,{"$f":"H101-$H$35","v":2015},66,"2031-04-07",0,0,0,{"$f":"J101*0.0082%*MIN(F101,365)","v":0},0,0,{"$f":"$N$26/($J$8+$N$26)*$N101*$B$1*MIN($F101,365)","v":0},0,0,0,{"$f":"S100+1","v":66},250,87.642976792831305,87.642976792831305,87.642976792831305,87.642976792831305,87.642976792831305,87.642976792831305,{"$error":"#N/A"},{"$error":"#N/A"},{"$error":"#N/A"},{"$error":"#N/A"},{"$f":"IF($I101<>0,$J101,$T101/((AE$29)^($H101-$H$35)))","v":{"$error":"#N/A"}},{"$error":"#N/A"},null,{"$f":"IF($I101<>0,0,U101*$B$1*MIN($F101,365))","v":2.6231542954094409},2.6231542954094409,2.6231542954094409,2.6231542954094409,2.6231542954094409,2.6231542954094409,{"$error":"#N/A"},{"$error":"#N/A"},{"$error":"#N/A"},{"$error":"#N/A"},{"$error":"#N/A"},{"$error":"#N/A"},null,250,250,250,250,250,250,250,250,250,250,250,250,null,{"$f":"BJ101-$H$35","v":2015},66,"2031-04-07",0,0,{"$f":"I102","v":0},{"$f":"BM102","v":0},null,{"$f":"BJ101","v":"2031-04-07"},null,{"$f":"IF(I101=0,0,PMT($BR$31,$I$10,$BR$35))","v":0},{"$f":"MIN(BR101,$I$9)","v":0},null,null,null,null,250,250,250,250,250,250,250,250,250,250,250,250,250,250,250,250,250,250,250,250,250,250,250,250,250,250,250,250,250,250,250,0,0,0,0,0,0,0,0,{"$f":"IF($G101>DK$33,0,$I$9)","v":0},0,0,0,0,0,0,0,0,0,0,0,0,0,0,0,0,0,0,0,0,0,0,0,0,0,0,0,0,0,0,0,0,0,0,0,0,0,0]
["2006-10-12","quinta-feira","Nossa Sr.a Aparecida - Padroeira do Brasil",null,null,2045,{"$f":"G101+1","v":67},{"$f":"EDATE(H101,1)","v":"2031-05-07"},{"$f":"IF($G102>$I$10,0,$I$9)","v":0},0,0,0,0,0,0,0,0,0,67,250,86.285855219449829,86.285855219449829,86.285855219449829,86.285855219449829,86.285855219449829,86.285855219449829,{"$error":"#N/A"},{"$error":"#N/A"},{"$error":"#N/A"},{"$error":"#N/A"},{"$error":"#N/A"},{"$error":"#N/A"},null,2.5825356467181333,2.5825356467181333,2.5825356467181333,2.5825356467181333,2.5825356467181333,2.5825356467181333,{"$error":"#N/A"},{"$error":"#N/A"},{"$error":"#N/A"},{"$error":"#N/A"},{"$error":"#N/A"},{"$error":"#N/A"},null,250,250,250,250,250,250,250,250,250,250,250,250,null,2045,{"$f":"BI101+1","v":67},{"$f":"EDATE(BJ101,1)","v":"2031-05-07"},{"$f":"I101","v":0},{"$f":"BK101","v":0},0,0,null,"2031-05-07",null,0,0,null,null,null,null,250,250,250,250,250,250,250,250,250,250,250,250,250,250,250,250,250,250,250,250,250,250,250,250,250,250,250,250,250,250,0,0,0,0,0,0,0,0,0,0,0,0,0,0,0,0,0,0,0,0,0,0,0,0,0,0,0,0,0,0,0,0,0,0,0,0,0,0,0,0,0,0,0,0,0,0,0,0]
["2006-11-02","quinta-feira","Finados",null,null,2076,68,"2031-06-07",0,0,0,0,0,0,0,0,0,0,68,250,84.905569414803807,84.905569414803807,84.905569414803807,84.905569414803807,84.905569414803807,84.905569414803807,{"$error":"#N/A"},{"$error":"#N/A"},{"$error":"#N/A"},{"$error":"#N/A"},{"$error":"#N/A"},{"$error":"#N/A"},null,2.5412236925850782,2.5412236925850782,2.5412236925850782,2.5412236925850782,2.5412236925850782,2.5412236925850782,{"$error":"#N/A"},{"$error":"#N/A"},{"$error":"#N/A"},{"$error":"#N/A"},{"$error":"#N/A"},{"$error":"#N/A"},null,250,250,250,250,250,250,250,250,250,250,250,250,null,2076,68,"2031-06-07",0,0,0,0,null,"2031-06-07",null,0,0,null,null,null,null,250,250,250,250,250,250,250,250,250,250,250,250,250,250,250,250,250,250,250,250,250,250,250,250,250,250,250,250,250,0,0,{"$f":"IF($G103>DC$33,0,$I$9)","v":0},0,0,0,0,0,0,0,0,0,0,0,0,0,0,0,0,0,0,0,0,0,0,0,0,0,0,0,0,0,0,0,0,0,0,0,0,0,0,0,0,0,0,0,0,0,0]
["2006-11-15","quarta-feira","Proclamação da República",null,null,2106,69,"2031-07-07",0,0,0,0,0,0,0,0,0,0,69,250,83.590835660090761,83.590835660090761,83.590835660090761,83.590835660090761,83.590835660090761,83.590835660090761,{"$error":"#N/A"},{"$error":"#N/A"},{"$error":"#N/A"},{"$error":"#N/A"},{"$error":"#N/A"},{"$error":"#N/A"},null,2.5018737113065166,2.5018737113065166,2.5018737113065166,2.5018737113065166,2.5018737113065166,2.5018737113065166,{"$error":"#N/A"},{"$error":"#N/A"},{"$error":"#N/A"},{"$error":"#N/A"},{"$error":"#N/A"},{"$error":"#N/A"},null,250,250,250,250,250,250,250,250,250,250,250,250,null,2106,69,"2031-07-07",0,0,0,0,null,"2031-07-07",null,0,0,null,null,null,null,250,250,250,250,250,250,250,250,250,250,250,250,250,250,250,250,250,250,250,250,250,250,250,250,250,250,250,250,0,0,0,0,0,0,0,0,0,0,0,0,0,0,0,0,0,0,0,0,0,0,0,0,0,0,0,0,0,0,0,0,0,0,0,0,0,0,0,0,0,0,0,0,0,0,0,0,0,0]
["2006-12-25","segunda-feira","Natal",null,null,2137,70,"2031-08-07",0,0,0,0,0,0,0,0,0,0,70,250,82.253661176895562,82.253661176895562,82.253661176895562,82.253661176895562,82.253661176895562,82.253661176895562,{"$error":"#N/A"},{"$error":"#N/A"},{"$error":"#N/A"},{"$error":"#N/A"},{"$error":"#N/A"},{"$error":"#N/A"},null,2.4618520790244842,2.4618520790244842,2.4618520790244842,2.4618520790244842,2.4618520790244842,2.4618520790244842,{"$error":"#N/A"},{"$error":"#N/A"},{"$error":"#N/A"},{"$error":"#N/A"},{"$error":"#N/A"},{"$error":"#N/A"},null,250,250,250,250,250,250,250,250,250,250,250,250,null,2137,70,"2031-08-07",0,0,0,0,null,"2031-08-07",null,0,0,null,null,null,null,250,250,250,250,250,250,250,250,250,250,250,250,250,250,250,250,250,250,250,250,250,250,250,250,250,250,250,0,0,0,0,0,0,0,0,0,0,0,0,0,0,0,0,0,0,0,0,0,0,0,0,0,0,0,0,0,0,0,0,0,0,0,0,0,0,0,0,0,0,0,0,0,0,0,0,0,0,0]
["2007-01-01","segunda-feira","Confraternização Universal",null,null,2168,71,"2031-09-07",0,0,0,0,0,0,0,0,0,0,71,250,80.937877024164123,80.937877024164123,80.937877024164123,80.937877024164123,80.937877024164123,80.937877024164123,{"$error":"#N/A"},{"$error":"#N/A"},{"$error":"#N/A"},{"$error":"#N/A"},{"$error":"#N/A"},{"$error":"#N/A"},null,2.4224706593332321,2.4224706593332321,2.4224706593332321,2.4224706593332321,2.4224706593332321,2.4224706593332321,{"$error":"#N/A"},{"$error":"#N/A"},{"$error":"#N/A"},{"$error":"#N/A"},{"$error":"#N/A"},{"$error":"#N/A"},null,250,250,250,250,250,250,250,250,250,250,250,250,null,2168,71,"2031-09-07",0,0,0,0,null,"2031-09-07",null,0,0,null,null,null,null,250,250,250,250,250,250,250,250,250,250,250,250,250,250,250,250,250,250,250,250,250,250,250,250,250,250,0,0,0,0,0,0,0,0,0,0,0,0,0,0,0,0,0,0,0,0,0,0,0,0,0,0,0,0,0,0,0,0,0,0,0,0,0,0,0,0,0,0,0,0,0,0,0,0,0,0,0,0]
["2007-02-19","segunda-feira","Carnaval",null,null,2198,72,"2031-10-07",0,0,0,0,0,0,0,0,0,0,72,250,79.684581631507214,79.684581631507214,79.684581631507214,79.684581631507214,79.684581631507214,79.684581631507214,{"$error":"#N/A"},{"$error":"#N/A"},{"$error":"#N/A"},{"$error":"#N/A"},{"$error":"#N/A"},{"$error":"#N/A"},null,2.3849595282310108,2.3849595282310108,2.3849595282310108,2.3849595282310108,2.3849595282310108,2.3849595282310108,{"$error":"#N/A"},{"$error":"#N/A"},{"$error":"#N/A"},{"$error":"#N/A"},{"$error":"#N/A"},{"$error":"#N/A"},null,250,250,250,250,250,250,250,250,250,250,250,250,null,2198,72,"2031-10-07",0,0,0,0,null,"2031-10-07",null,0,0,null,null,null,null,250,250,250,250,250,250,250,250,250,250,250,250,250,250,250,250,250,250,250,250,250,250,250,250,250,0,0,0,0,0,0,0,0,0,0,0,0,0,0,0,0,0,0,0,0,0,0,0,0,0,0,0,0,0,0,0,0,0,0,0,0,0,0,0,0,0,0,0,0,0,0,0,0,0,0,0,0,0]
["2007-02-20","terça-feira","Carnaval",null,null,2229,73,"2031-11-07",0,0,0,0,0,0,0,0,0,0,73,250,78.409894180181666,78.409894180181666,78.409894180181666,78.409894180181666,78.409894180181666,78.409894180181666,{"$error":"#N/A"},{"$error":"#N/A"},{"$error":"#N/A"},{"$error":"#N/A"},{"$error":"#N/A"},{"$error":"#N/A"},null,2.3468081328128374,2.3468081328128374,2.3468081328128374,2.3468081328128374,2.3468081328128374,2.3468081328128374,{"$error":"#N/A"},{"$error":"#N/A"},{"$error":"#N/A"},{"$error":"#N/A"},{"$error":"#N/A"},{"$error":"#N/A"},null,250,250,250,250,250,250,250,250,250,250,250,250,null,2229,73,"2031-11-07",0,0,0,0,null,"2031-11-07",null,0,0,null,null,null,null,250,250,250,250,250,250,250,250,250,250,250,250,250,250,250,250,250,250,250,250,250,250,250,250,0,0,0,0,0,0,0,0,0,0,0,0,0,0,0,0,0,0,0,0,0,0,0,0,0,0,0,{"$f":"IF($G108>DW$33,0,$I$9)","v":0},0,0,0,0,0,0,0,0,0,0,0,0,0,0,0,0,0,0,0,0,0,0,0,0,0,0]
["2007-04-06","sexta-feira","Paixão de Cristo",null,null,2259,74,"2031-12-07",0,0,0,0,0,0,0,0,0,0,74,250,77.195743738783307,77.195743738783307,77.195743738783307,77.195743738783307,77.195743738783307,77.195743738783307,{"$error":"#N/A"},{"$error":"#N/A"},{"$error":"#N/A"},{"$error":"#N/A"},{"$error":"#N/A"},{"$error":"#N/A"},null,2.3104686101017844,2.3104686101017844,2.3104686101017844,2.3104686101017844,2.3104686101017844,2.3104686101017844,{"$error":"#N/A"},{"$error":"#N/A"},{"$error":"#N/A"},{"$error":"#N/A"},{"$error":"#N/A"},{"$error":"#N/A"},null,250,250,250,250,250,250,250,250,250,250,250,250,null,2259,74,"2031-12-07",0,0,0,0,null,"2031-12-07",null,0,0,null,null,null,null,250,250,250,250,250,250,250,250,250,250,250,250,250,250,250,250,250,250,250,250,250,250,250,0,0,0,0,0,0,0,0,{"$f":"IF($G109>DC$33,0,$I$9)","v":0},0,0,0,0,0,0,0,0,0,0,0,0,0,0,0,0,0,0,0,0,0,0,0,0,0,0,0,0,0,0,0,0,0,0,0,0,0,0,0,0,0,0,0,0,0,0]
["2007-04-21","sábado","Tiradentes",null,null,2290,75,"2032-01-07",0,0,0,0,0,0,0,0,0,0,75,250,75.960869390134363,75.960869390134363,75.960869390134363,75.960869390134363,75.960869390134363,75.960869390134363,{"$error":"#N/A"},{"$error":"#N/A"},{"$error":"#N/A"},{"$error":"#N/A"},{"$error":"#N/A"},{"$error":"#N/A"},null,2.2735088208467218,2.2735088208467218,2.2735088208467218,2.2735088208467218,2.2735088208467218,2.2735088208467218,{"$error":"#N/A"},{"$error":"#N/A"},{"$error":"#N/A"},{"$error":"#N/A"},{"$error":"#N/A"},{"$error":"#N/A"},null,250,250,250,250,250,250,250,250,250,250,250,250,null,2290,75,"2032-01-07",0,0,0,0,null,"2032-01-07",null,0,0,null,null,null,null,250,250,250,250,250,250,250,250,250,250,250,250,250,250,250,250,250,250,250,250,250,250,0,0,0,0,0,0,0,0,0,0,0,0,0,0,0,0,0,0,0,0,0,0,0,0,0,0,0,0,0,0,0,0,0,0,0,0,0,0,0,0,0,0,0,0,0,0,0,0,0,0,0,0,0,0,0,0]
["2007-05-01","terça-feira","Dia do Trabalho",null,null,2321,76,"2032-02-07",0,0,0,0,0,0,0,0,0,0,76,250,74.745748911104329,74.745748911104329,74.745748911104329,74.745748911104329,74.745748911104329,74.745748911104329,{"$error":"#N/A"},{"$error":"#N/A"},{"$error":"#N/A"},{"$error":"#N/A"},{"$error":"#N/A"},{"$error":"#N/A"},null,2.2371402649093528,2.2371402649093528,2.2371402649093528,2.2371402649093528,2.2371402649093528,2.2371402649093528,{"$error":"#N/A"},{"$error":"#N/A"},{"$error":"#N/A"},{"$error":"#N/A"},{"$error":"#N/A"},{"$error":"#N/A"},null,250,250,250,250,250,250,250,250,250,250,250,250,null,2321,76,"2032-02-07",0,0,0,0,null,"2032-02-07",null,0,0,null,null,null,null,250,250,250,250,250,250,250,250,250,250,250,250,250,250,250,250,250,250,250,250,250,0,0,0,0,0,0,0,0,0,0,0,0,0,0,0,0,0,0,0,0,0,0,0,0,0,0,0,0,0,0,0,0,0,0,0,0,0,0,0,0,0,0,0,0,0,0,0,0,0,0,0,0,0,0,0,0,0]
["2007-06-07","quinta-feira","Corpus Christi",null,null,2350,77,"2032-03-07",0,0,0,0,0,0,0,0,0,0,77,250,73.626626623833715,73.626626623833715,73.626626623833715,73.626626623833715,73.626626623833715,73.626626623833715,{"$error":"#N/A"},{"$error":"#N/A"},{"$error":"#N/A"},{"$error":"#N/A"},{"$error":"#N/A"},{"$error":"#N/A"},null,2.2036449348513432,2.2036449348513432,2.2036449348513432,2.2036449348513432,2.2036449348513432,2.2036449348513432,{"$error":"#N/A"},{"$error":"#N/A"},{"$error":"#N/A"},{"$error":"#N/A"},{"$error":"#N/A"},{"$error":"#N/A"},null,250,250,250,250,250,250,250,250,250,250,250,250,null,2350,77,"2032-03-07",0,0,0,0,null,"2032-03-07",null,0,0,null,null,null,null,250,250,250,250,250,250,250,250,250,250,250,250,250,250,250,250,250,250,250,250,0,0,0,0,0,0,0,0,0,0,0,0,0,0,0,0,0,0,0,0,0,0,0,0,0,0,0,0,0,0,0,0,0,0,0,0,0,0,0,0,0,0,0,0,0,0,0,0,0,0,0,0,0,0,0,0,0,0]
["2007-09-07","sexta-feira","Independência do Brasil",null,null,2381,78,"2032-04-07",0,0,0,0,0,0,0,0,0,0,78,250,72.448846241239281,72.448846241239281,72.448846241239281,72.448846241239281,72.448846241239281,72.448846241239281,{"$error":"#N/A"},{"$error":"#N/A"},{"$error":"#N/A"},{"$error":"#N/A"},{"$error":"#N/A"},{"$error":"#N/A"},null,2.1683939680002919,2.1683939680002919,2.1683939680002919,2.1683939680002919,2.1683939680002919,2.1683939680002919,{"$error":"#N/A"},{"$error":"#N/A"},{"$error":"#N/A"},{"$error":"#N/A"},{"$error":"#N/A"},{"$error":"#N/A"},null,250,250,250,250,250,250,250,250,250,250,250,250,null,2381,78,"2032-04-07",0,0,0,0,null,"2032-04-07",null,0,0,null,null,null,null,250,250,250,250,250,250,250,250,250,250,250,250,250,250,250,250,250,250,250,0,0,0,0,0,0,0,0,0,0,0,0,0,0,0,0,0,0,0,0,0,0,0,0,0,0,0,0,0,0,0,0,0,0,0,0,0,0,0,0,0,0,0,0,0,0,0,0,0,0,0,0,0,0,0,0,0,0,0]
["2007-10-12","sexta-feira","Nossa Sr.a Aparecida - Padroeira do Brasil",null,null,2411,79,"2032-05-07",0,0,0,0,0,0,0,0,0,0,79,250,71.32700059200954,71.32700059200954,71.32700059200954,71.32700059200954,71.32700059200954,71.32700059200954,{"$error":"#N/A"},{"$error":"#N/A"},{"$error":"#N/A"},{"$error":"#N/A"},{"$error":"#N/A"},{"$error":"#N/A"},null,2.1348171277188457,2.1348171277188457,2.1348171277188457,2.1348171277188457,2.1348171277188457,2.1348171277188457,{"$error":"#N/A"},{"$error":"#N/A"},{"$error":"#N/A"},{"$error":"#N/A"},{"$error":"#N/A"},{"$error":"#N/A"},null,250,250,250,250,250,250,250,250,250,250,250,250,null,2411,79,"2032-05-07",0,0,0,0,null,"2032-05-07",null,0,0,null,null,null,null,250,250,250,250,250,250,250,250,250,250,250,250,250,250,250,250,250,250,0,0,0,0,0,0,0,0,0,0,0,0,0,0,0,0,0,0,0,0,0,0,0,0,0,0,0,0,0,0,0,0,0,0,0,0,0,0,0,0,0,0,0,0,0,0,0,{"$f":"IF($G114>EK$33,0,$I$9)","v":0},0,0,0,0,0,0,0,0,0,0,0,0]
["2007-11-02","sexta-feira","Finados",null,null,2442,80,"2032-06-07",0,0,0,0,0,0,0,0,0,0,80,250,70.186006553592236,70.186006553592236,70.186006553592236,70.186006553592236,70.186006553592236,70.186006553592236,{"$error":"#N/A"},{"$error":"#N/A"},{"$error":"#N/A"},{"$error":"#N/A"},{"$error":"#N/A"},{"$error":"#N/A"},null,2.1006671761490159,2.1006671761490159,2.1006671761490159,2.1006671761490159,2.1006671761490159,2.1006671761490159,{"$error":"#N/A"},{"$error":"#N/A"},{"$error":"#N/A"},{"$error":"#N/A"},{"$error":"#N/A"},{"$error":"#N/A"},null,250,250,250,250,250,250,250,250,250,250,250,250,null,2442,80,"2032-06-07",0,0,0,0,null,"2032-06-07",null,0,0,null,null,null,null,250,250,250,250,250,250,250,250,250,250,250,250,250,250,250,250,{"$f":"IF($G115>CN$33,0,$I$9)","v":250},0,0,0,0,0,0,0,0,0,0,0,0,0,0,0,{"$f":"IF($G115>DD$33,0,$I$9)","v":0},0,0,0,0,0,0,0,0,0,0,0,0,0,0,0,0,0,0,0,0,0,0,0,0,0,0,0,0,0,0,0,0,0,0,0,0,0,0,0,0,0,0,0,0,0]
["2007-11-15","quinta-feira","Proclamação da República",null,null,2472,81,"2032-07-07",0,0,0,0,0,0,0,0,0,0,81,250,{"$f":"$T116/((U$29)^($H116-$H$35))","v":69.099200204367847},69.099200204367847,69.099200204367847,69.099200204367847,69.099200204367847,69.099200204367847,{"$error":"#N/A"},{"$error":"#N/A"},{"$error":"#N/A"},{"$error":"#N/A"},{"$error":"#N/A"},{"$error":"#N/A"},null,2.0681390621167295,2.0681390621167295,2.0681390621167295,2.0681390621167295,2.0681390621167295,2.0681390621167295,{"$error":"#N/A"},{"$error":"#N/A"},{"$error":"#N/A"},{"$error":"#N/A"},{"$error":"#N/A"},{"$error":"#N/A"},null,{"$f":"$T116","v":250},250,250,250,250,250,250,250,250,250,250,250,null,2472,81,"2032-07-07",0,0,0,0,null,"2032-07-07",null,0,0,null,null,null,null,{"$f":"IF($G116>BX$33,0,$I$9)","v":250},250,250,250,250,250,250,250,250,250,250,250,250,250,250,250,0,0,0,0,0,0,0,0,0,0,0,0,0,0,0,0,0,0,0,0,0,0,0,0,0,0,0,0,0,0,0,0,0,0,0,0,0,0,0,0,0,0,0,0,0,0,0,0,0,0,0,0,0,0,0,0,0,0,0,0,0,0]
["2007-12-25","terça-feira","Natal",null,null,2503,82,"2032-08-07",0,0,0,0,0,0,0,0,0,0,82,250,67.993843539455483,67.993843539455483,67.993843539455483,67.993843539455483,67.993843539455483,67.993843539455483,{"$error":"#N/A"},{"$error":"#N/A"},{"$error":"#N/A"},{"$error":"#N/A"},{"$f":"IF($I117<>0,$J117,$T117/((AE$29)^($H117-$H$35)))","v":{"$error":"#N/A"}},{"$error":"#N/A"},null,2.0350557371359028,2.0350557371359028,2.0350557371359028,2.0350557371359028,2.0350557371359028,2.0350557371359028,{"$error":"#N/A"},{"$error":"#N/A"},{"$error":"#N/A"},{"$error":"#N/A"},{"$error":"#N/A"},{"$error":"#N/A"},null,250,250,250,250,250,250,250,250,250,250,250,250,null,2503,82,"2032-08-07",0,0,0,0,null,"2032-08-07",null,0,0,null,null,null,null,250,250,250,250,250,250,250,250,250,250,250,250,250,250,250,0,0,0,0,0,0,0,0,0,0,0,0,0,0,0,0,0,0,0,0,0,0,0,0,0,0,0,0,0,0,0,0,0,0,0,0,0,0,0,0,0,0,0,0,0,0,0,0,0,0,0,0,0,0,0,0,0,0,0,0,0,0,0]
["2008-01-01","terça-feira","Confraternização Universal",null,null,2534,83,"2032-09-07",0,0,0,0,0,0,0,0,0,0,83,250,66.906168893337153,66.906168893337153,66.906168893337153,66.906168893337153,66.906168893337153,66.906168893337153,{"$error":"#N/A"},{"$error":"#N/A"},{"$error":"#N/A"},{"$error":"#N/A"},{"$error":"#N/A"},{"$error":"#N/A"},null,2.0025016349775813,2.0025016349775813,2.0025016349775813,2.0025016349775813,2.0025016349775813,2.0025016349775813,{"$error":"#N/A"},{"$error":"#N/A"},{"$error":"#N/A"},{"$error":"#N/A"},{"$error":"#N/A"},{"$error":"#N/A"},null,250,250,250,250,250,250,250,250,250,250,250,250,null,2534,83,"2032-09-07",0,0,0,0,null,"2032-09-07",null,0,0,null,null,null,null,250,250,250,250,250,250,250,250,250,250,250,250,250,250,0,0,0,0,0,0,0,0,0,0,0,0,0,0,0,0,0,0,0,0,0,0,0,0,0,0,0,0,0,0,0,0,0,0,0,0,0,0,0,0,0,0,0,0,0,0,0,0,0,0,0,0,0,0,0,0,0,0,0,0,0,0,0,0]
["2008-02-04","segunda-feira","Carnaval",null,null,2564,84,"2032-10-07",0,0,0,0,0,0,0,0,0,0,84,250,65.870149710509949,65.870149710509949,65.870149710509949,65.870149710509949,65.870149710509949,65.870149710509949,{"$error":"#N/A"},{"$error":"#N/A"},{"$error":"#N/A"},{"$error":"#N/A"},{"$error":"#N/A"},{"$error":"#N/A"},null,1.9714935808355629,1.9714935808355629,1.9714935808355629,1.9714935808355629,1.9714935808355629,1.9714935808355629,{"$error":"#N/A"},{"$error":"#N/A"},{"$error":"#N/A"},{"$error":"#N/A"},{"$error":"#N/A"},{"$error":"#N/A"},null,250,250,250,250,250,250,250,250,250,250,250,250,null,2564,84,"2032-10-07",0,0,0,0,null,"2032-10-07",null,0,0,null,null,null,null,250,250,250,250,250,250,250,250,250,250,250,250,250,0,0,0,0,0,0,0,0,0,0,0,0,0,0,0,0,0,0,0,0,0,0,0,0,0,0,0,0,0,0,0,0,0,0,0,0,0,0,0,0,0,0,0,0,0,0,0,0,0,0,0,0,0,0,0,0,0,0,0,0,0,0,0,0,0]
["2008-02-05","terça-feira","Carnaval",null,null,2595,85,"2032-11-07",0,0,0,0,0,0,0,0,0,0,85,250,64.816447080292164,64.816447080292164,64.816447080292164,64.816447080292164,64.816447080292164,64.816447080292164,{"$error":"#N/A"},{"$error":"#N/A"},{"$error":"#N/A"},{"$error":"#N/A"},{"$error":"#N/A"},{"$error":"#N/A"},null,1.9399562611131445,1.9399562611131445,1.9399562611131445,1.9399562611131445,1.9399562611131445,1.9399562611131445,{"$error":"#N/A"},{"$error":"#N/A"},{"$error":"#N/A"},{"$error":"#N/A"},{"$error":"#N/A"},{"$error":"#N/A"},null,250,250,250,250,250,250,250,250,250,250,250,250,null,2595,85,"2032-11-07",0,0,0,0,null,"2032-11-07",null,0,0,null,null,null,null,250,250,250,250,250,250,250,250,250,250,250,250,0,0,0,0,0,0,0,0,0,0,0,0,0,0,0,0,0,0,0,0,0,0,0,0,0,0,0,0,0,0,0,0,0,0,0,0,0,0,0,0,0,0,0,0,0,{"$f":"IF($G120>EC$33,0,$I$9)","v":0},0,0,0,0,0,0,0,0,0,0,0,0,0,0,0,0,0,0,0,0]
["2008-03-21","sexta-feira","Paixão de Cristo",null,null,2625,86,"2032-12-07",0,0,0,0,0,0,0,0,0,0,86,250,63.812786526286445,63.812786526286445,63.812786526286445,63.812786526286445,63.812786526286445,63.812786526286445,{"$error":"#N/A"},{"$error":"#N/A"},{"$error":"#N/A"},{"$error":"#N/A"},{"$error":"#N/A"},{"$error":"#N/A"},null,1.9099167007317532,1.9099167007317532,1.9099167007317532,1.9099167007317532,1.9099167007317532,1.9099167007317532,{"$error":"#N/A"},{"$error":"#N/A"},{"$error":"#N/A"},{"$error":"#N/A"},{"$error":"#N/A"},{"$error":"#N/A"},null,250,250,250,250,250,250,250,250,250,250,250,250,null,2625,86,"2032-12-07",0,0,0,0,null,"2032-12-07",null,0,0,null,null,null,null,250,250,250,250,250,250,250,250,250,250,250,0,0,0,0,0,0,0,0,0,0,0,0,0,0,0,0,0,0,0,0,0,{"$f":"IF($G121>DD$33,0,$I$9)","v":0},0,0,0,0,0,0,0,0,0,0,0,0,0,0,0,0,0,0,0,0,0,0,0,0,0,0,0,0,0,0,0,0,0,0,0,0,0,0,0,0,0,0,0,0,0]
["2008-04-21","segunda-feira","Tiradentes",null,null,2656,87,"2033-01-07",0,0,0,0,0,0,0,0,0,0,87,250,62.791994842955184,62.791994842955184,62.791994842955184,62.791994842955184,62.791994842955184,62.791994842955184,{"$error":"#N/A"},{"$error":"#N/A"},{"$error":"#N/A"},{"$error":"#N/A"},{"$error":"#N/A"},{"$error":"#N/A"},null,1.8793644056496488,1.8793644056496488,1.8793644056496488,1.8793644056496488,1.8793644056496488,1.8793644056496488,{"$error":"#N/A"},{"$error":"#N/A"},{"$error":"#N/A"},{"$error":"#N/A"},{"$error":"#N/A"},{"$error":"#N/A"},null,250,250,250,250,250,250,250,250,250,250,250,250,null,2656,87,"2033-01-07",0,0,0,0,null,"2033-01-07",null,0,0,null,null,null,null,250,250,250,250,250,250,250,250,250,250,0,0,0,0,0,0,0,0,0,0,0,0,0,0,0,0,0,0,0,0,0,0,0,0,0,0,0,0,0,0,0,0,0,0,0,0,0,0,0,0,0,0,0,0,0,0,0,0,0,0,0,0,0,0,0,0,0,0,0,0,0,0,0,0,0,0,0,0]
["2008-05-01","quinta-feira","Dia do Trabalho",null,null,2687,88,"2033-02-07",0,0,0,0,0,0,0,0,0,0,88,250,61.787532420850091,61.787532420850091,61.787532420850091,61.787532420850091,61.787532420850091,61.787532420850091,{"$error":"#N/A"},{"$error":"#N/A"},{"$error":"#N/A"},{"$error":"#N/A"},{"$error":"#N/A"},{"$error":"#N/A"},null,1.8493008453560433,1.8493008453560433,1.8493008453560433,1.8493008453560433,1.8493008453560433,1.8493008453560433,{"$error":"#N/A"},{"$error":"#N/A"},{"$error":"#N/A"},{"$error":"#N/A"},{"$error":"#N/A"},{"$error":"#N/A"},null,250,250,250,250,250,250,250,250,250,250,250,250,null,2687,88,"2033-02-07",0,0,0,0,null,"2033-02-07",null,0,0,null,null,null,null,250,250,250,250,250,250,250,250,250,0,0,0,0,0,0,0,0,0,0,0,0,0,0,0,0,0,0,0,0,0,0,0,0,0,0,0,0,0,0,0,0,0,0,0,0,0,0,0,0,0,0,0,0,0,0,0,0,0,0,0,0,0,0,0,0,0,0,0,0,0,0,0,0,0,0,0,0,0]
["2008-05-22","quinta-feira","Corpus Christi",null,null,2715,89,"2033-03-07",0,0,0,0,0,0,0,0,0,0,89,250,60.894094027359785,60.894094027359785,60.894094027359785,60.894094027359785,60.894094027359785,60.894094027359785,{"$error":"#N/A"},{"$error":"#N/A"},{"$error":"#N/A"},{"$error":"#N/A"},{"$error":"#N/A"},{"$error":"#N/A"},null,1.8225602342388785,1.8225602342388785,1.8225602342388785,1.8225602342388785,1.8225602342388785,1.8225602342388785,{"$error":"#N/A"},{"$error":"#N/A"},{"$error":"#N/A"},{"$error":"#N/A"},{"$error":"#N/A"},{"$error":"#N/A"},null,250,250,250,250,250,250,250,250,250,250,250,250,null,2715,89,"2033-03-07",0,0,0,0,null,"2033-03-07",null,0,0,null,null,null,null,250,250,250,250,250,250,250,250,0,0,0,0,0,0,0,0,0,0,0,0,0,0,0,0,0,0,0,0,0,0,0,0,0,0,0,0,0,0,0,0,0,0,0,0,0,0,0,0,0,0,0,0,0,0,0,0,0,0,0,0,0,0,0,0,0,0,0,0,0,0,0,0,0,0,0,0,0,0]
["2008-09-07","domingo","Independência do Brasil",null,null,2746,90,"2033-04-07",0,0,0,0,0,0,0,0,0,0,90,250,59.919991686263685,59.919991686263685,59.919991686263685,59.919991686263685,59.919991686263685,59.919991686263685,{"$error":"#N/A"},{"$error":"#N/A"},{"$error":"#N/A"},{"$error":"#N/A"},{"$error":"#N/A"},{"$error":"#N/A"},null,1.7934053511698722,1.7934053511698722,1.7934053511698722,1.7934053511698722,1.7934053511698722,1.7934053511698722,{"$error":"#N/A"},{"$error":"#N/A"},{"$error":"#N/A"},{"$error":"#N/A"},{"$error":"#N/A"},{"$error":"#N/A"},null,250,250,250,250,250,250,250,250,250,250,250,250,null,2746,90,"2033-04-07",0,0,0,0,null,"2033-04-07",null,0,0,null,null,null,null,250,250,250,250,250,250,250,0,0,0,0,0,0,0,0,0,0,0,0,0,0,0,0,0,0,0,0,0,0,0,0,0,0,0,0,0,0,0,0,0,0,0,0,0,0,0,0,0,0,0,0,0,0,0,0,0,0,0,0,0,0,0,0,0,0,0,0,0,0,0,0,0,0,0,0,0,0,0]
["2008-10-12","domingo","Nossa Sr.a Aparecida - Padroeira do Brasil",null,null,2776,91,"2033-05-07",0,0,0,0,0,0,0,0,0,0,91,250,58.992151072331914,58.992151072331914,58.992151072331914,58.992151072331914,58.992151072331914,58.992151072331914,{"$error":"#N/A"},{"$error":"#N/A"},{"$error":"#N/A"},{"$error":"#N/A"},{"$error":"#N/A"},{"$error":"#N/A"},null,1.765635081594894,1.765635081594894,1.765635081594894,1.765635081594894,1.765635081594894,1.765635081594894,{"$error":"#N/A"},{"$error":"#N/A"},{"$error":"#N/A"},{"$error":"#N/A"},{"$error":"#N/A"},{"$error":"#N/A"},null,250,250,250,250,250,250,250,250,250,250,250,250,null,2776,91,"2033-05-07",0,0,0,0,null,"2033-05-07",null,0,0,null,null,null,null,250,250,250,250,250,250,0,0,0,0,0,0,0,0,0,0,0,0,0,0,0,0,0,0,0,0,0,0,0,0,0,0,0,0,0,0,0,0,0,0,0,0,0,0,0,0,0,0,0,0,0,0,0,0,0,0,0,{"$f":"IF($G126>EC$33,0,$I$9)","v":0},0,0,0,0,0,0,0,0,0,0,0,0,0,0,0,0,0,0,0,0]
["2008-11-02","domingo","Finados",null,null,2807,92,"2033-06-07",0,0,0,0,0,0,0,0,0,0,92,250,58.048473472989798,58.048473472989798,58.048473472989798,58.048473472989798,58.048473472989798,58.048473472989798,{"$error":"#N/A"},{"$error":"#N/A"},{"$error":"#N/A"},{"$error":"#N/A"},{"$error":"#N/A"},{"$error":"#N/A"},null,1.7373908110465845,1.7373908110465845,1.7373908110465845,1.7373908110465845,1.7373908110465845,1.7373908110465845,{"$error":"#N/A"},{"$error":"#N/A"},{"$error":"#N/A"},{"$error":"#N/A"},{"$error":"#N/A"},{"$error":"#N/A"},null,250,250,250,250,250,250,250,250,250,250,250,250,null,2807,92,"2033-06-07",0,0,0,0,null,"2033-06-07",null,0,0,null,null,null,null,250,250,250,250,250,0,0,0,0,0,0,0,0,0,0,0,0,0,0,0,0,0,0,0,0,0,0,0,0,0,0,0,{"$f":"IF($G127>DD$33,0,$I$9)","v":0},0,0,0,0,0,0,0,0,0,0,0,0,0,0,0,0,0,0,0,0,0,0,0,0,0,0,0,0,0,0,0,0,0,0,0,0,0,0,0,0,0,0,0,0,0]
["2008-11-15","sábado","Proclamação da República",null,null,2837,93,"2033-07-07",0,0,0,0,0,0,0,0,0,0,93,250,57.14961267963411,57.14961267963411,57.14961267963411,57.14961267963411,57.14961267963411,57.14961267963411,{"$error":"#N/A"},{"$error":"#N/A"},{"$error":"#N/A"},{"$error":"#N/A"},{"$error":"#N/A"},{"$error":"#N/A"},null,1.7104879075014492,1.7104879075014492,1.7104879075014492,1.7104879075014492,1.7104879075014492,1.7104879075014492,{"$error":"#N/A"},{"$error":"#N/A"},{"$error":"#N/A"},{"$error":"#N/A"},{"$error":"#N/A"},{"$error":"#N/A"},null,250,250,250,250,250,250,250,250,250,250,250,250,null,2837,93,"2033-07-07",0,0,0,0,null,"2033-07-07",null,0,0,null,null,null,null,250,250,250,250,0,0,0,0,0,0,0,0,0,0,0,0,0,0,0,0,0,0,0,0,0,0,0,0,0,0,0,0,0,0,0,0,0,0,0,0,0,0,0,0,0,0,0,0,0,0,0,0,0,0,0,0,0,0,0,0,0,0,0,0,0,0,0,0,0,0,0,0,0,0,0,0,0,0]
["2008-12-25","quinta-feira","Natal",null,null,2868,94,"2033-08-07",0,0,0,0,0,0,0,0,0,0,94,250,56.235409547242405,56.235409547242405,56.235409547242405,56.235409547242405,56.235409547242405,56.235409547242405,{"$error":"#N/A"},{"$error":"#N/A"},{"$error":"#N/A"},{"$error":"#N/A"},{"$error":"#N/A"},{"$error":"#N/A"},null,1.6831258077489653,1.6831258077489653,1.6831258077489653,1.6831258077489653,1.6831258077489653,1.6831258077489653,{"$error":"#N/A"},{"$error":"#N/A"},{"$error":"#N/A"},{"$f":"IF($I129<>0,0,AD129*$B$1*MIN($F129,365))","v":{"$error":"#N/A"}},{"$error":"#N/A"},{"$error":"#N/A"},null,250,250,250,250,250,250,250,250,250,250,250,250,null,2868,94,"2033-08-07",0,0,0,0,null,"2033-08-07",null,0,0,null,null,null,null,250,250,250,0,0,0,0,0,0,0,0,0,0,0,0,0,0,0,0,0,0,0,0,0,0,0,0,0,0,0,0,0,0,0,0,0,0,0,0,0,0,0,0,0,0,0,0,0,0,0,0,0,0,0,0,0,0,0,0,0,0,0,0,0,0,0,0,0,0,0,0,0,0,0,0,0,0,0]
["2009-01-01","quinta-feira","Confraternização Universal",null,null,2899,95,"2033-09-07",0,0,0,0,0,0,0,0,0,0,95,250,55.335830614877409,55.335830614877409,55.335830614877409,55.335830614877409,55.335830614877409,55.335830614877409,{"$error":"#N/A"},{"$error":"#N/A"},{"$error":"#N/A"},{"$error":"#N/A"},{"$error":"#N/A"},{"$error":"#N/A"},null,1.6562014103032807,1.6562014103032807,1.6562014103032807,1.6562014103032807,1.6562014103032807,1.6562014103032807,{"$error":"#N/A"},{"$error":"#N/A"},{"$error":"#N/A"},{"$error":"#N/A"},{"$error":"#N/A"},{"$error":"#N/A"},null,250,250,250,250,250,250,250,250,250,250,250,250,null,2899,95,"2033-09-07",0,0,0,0,null,"2033-09-07",null,0,0,null,null,null,null,250,250,0,0,0,0,0,0,0,0,0,0,0,0,0,0,0,0,0,0,0,0,0,0,0,0,0,0,0,0,0,{"$f":"IF($G130>DC$33,0,$I$9)","v":0},0,0,0,0,0,0,0,0,0,0,0,0,0,0,0,0,0,0,0,0,0,0,0,0,0,0,0,0,0,0,0,0,0,0,0,0,0,0,0,0,0,0,0,0,0,0]
["2009-02-23","segunda-feira","Carnaval",null,null,2929,96,"2033-10-07",0,0,0,0,0,0,0,0,0,0,{"$f":"S130+1","v":96},250,54.478974170054137,54.478974170054137,54.478974170054137,54.478974170054137,54.478974170054137,54.478974170054137,{"$error":"#N/A"},{"$error":"#N/A"},{"$error":"#N/A"},{"$error":"#N/A"},{"$error":"#N/A"},{"$error":"#N/A"},null,1.6305556969097204,1.6305556969097204,1.6305556969097204,1.6305556969097204,1.6305556969097204,1.6305556969097204,{"$error":"#N/A"},{"$error":"#N/A"},{"$error":"#N/A"},{"$error":"#N/A"},{"$error":"#N/A"},{"$error":"#N/A"},null,250,250,250,250,250,250,250,250,250,250,250,250,null,2929,96,"2033-10-07",0,0,0,0,null,"2033-10-07",null,0,0,null,null,null,null,250,0,0,0,0,0,0,0,0,0,0,0,0,0,0,{"$f":"IF($G131>CM$33,0,$I$9)","v":0},0,0,0,0,0,0,0,0,0,0,0,0,0,0,0,0,0,0,0,0,0,0,0,0,0,0,0,0,0,0,0,0,0,0,0,0,0,0,0,0,0,0,0,0,0,0,0,0,0,0,0,0,0,0,0,0,0,0,0,0,0,0]
["2009-02-24","terça-feira","Carnaval"]
["2009-04-10","sexta-feira","Paixão de Cristo"]
["2009-04-21","terça-feira","Tiradentes"]
["2009-05-01","sexta-feira","Dia do Trabalho"]
["2009-06-11","quinta-feira","Corpus Christi"]
["2009-09-07","segunda-feira","Independência do Brasil"]
["2009-10-12","segunda-feira","Nossa Sr.a Aparecida - Padroeira do Brasil"]
["2009-11-02","segunda-feira","Finados"]
["2009-11-15","domingo","Proclamação da República"]
["2009-12-25","sexta-feira","Natal"]
["2010-01-01","sexta-feira","Confraternização Universal"]
["2010-02-15","segunda-feira","Carnaval"]
["2010-02-16","terça-feira","Carnaval"]
["2010-04-02","sexta-feira","Paixão de Cristo"]
["2010-04-21","quarta-feira","Tiradentes"]
["2010-05-01","sábado","Dia do Trabalho"]
["2010-06-03","quinta-feira","Corpus Christi"]
["2010-09-07","terça-feira","Independência do Brasil"]
["2010-10-12","terça-feira","Nossa Sr.a Aparecida - Padroeira do Brasil"]
["2010-11-02","terça-feira","Finados"]
["2010-11-15","segunda-feira","Proclamação da República"]
["2010-12-25","sábado","Natal"]
["2011-01-01","sábado","Confraternização Universal"]
["2011-03-07","segunda-feira","Carnaval"]
["2011-03-08","terça-feira","Carnaval"]
["2011-04-21","quinta-feira","Tiradentes"]
["2011-04-22","sexta-feira","Paixão de Cristo"]
["2011-05-01","domingo","Dia do Trabalho"]
["2011-06-23","quinta-feira","Corpus Christi"]
["2011-09-07","quarta-feira","Independência do Brasil"]
["2011-10-12","quarta-feira","Nossa Sr.a Aparecida - Padroeira do Brasil"]
["2011-11-02","quarta-feira","Finados"]
["2011-11-15","terça-feira","Proclamação da República"]
["2011-12-25","domingo","Natal"]
["2012-01-01","domingo","Confraternização Universal"]
["2012-02-20","segunda-feira","Carnaval"]
["2012-02-21","terça-feira","Carnaval"]
["2012-04-06","sexta-feira","Paixão de Cristo"]
["2012-04-21","sábado","Tiradentes"]
["2012-05-01","terça-feira","Dia do Trabalho"]
["2012-06-07","quinta-feira","Corpus Christi"]
["2012-09-07","sexta-feira","Independência do Brasil"]
["2012-10-12","sexta-feira","Nossa Sr.a Aparecida - Padroeira do Brasil"]
["2012-11-02","sexta-feira","Finados"]
["2012-11-15","quinta-feira","Proclamação da República"]
["2012-12-25","terça-feira","Natal"]
["2013-01-01","terça-feira","Confraternização Universal"]
["2013-02-11","segunda-feira","Carnaval"]
["2013-02-12","terça-feira","Carnaval"]
["2013-03-29","sexta-feira","Paixão de Cristo"]
["2013-04-21","domingo","Tiradentes"]
["2013-05-01","quarta-feira","Dia do Trabalho"]
["2013-05-30","quinta-feira","Corpus Christi"]
["2013-09-07","sábado","Independência do Brasil"]
["2013-10-12","sábado","Nossa Sr.a Aparecida - Padroeira do Brasil"]
["2013-11-02","sábado","Finados"]
["2013-11-15","sexta-feira","Proclamação da República"]
["2013-12-25","quarta-feira","Natal"]
["2014-01-01","quarta-feira","Confraternização Universal"]
["2014-03-03","segunda-feira","Carnaval"]
["2014-03-04","terça-feira","Carnaval"]
["2014-04-18","sexta-feira","Paixão de Cristo"]
["2014-04-21","segunda-feira","Tiradentes"]
["2014-05-01","quinta-feira","Dia do Trabalho"]
["2014-06-19","quinta-feira","Corpus Christi"]
["2014-09-07","domingo","Independência do Brasil"]
["2014-10-12","domingo","Nossa Sr.a Aparecida - Padroeira do Brasil"]
["2014-11-02","domingo","Finados"]
["2014-11-15","sábado","Proclamação da República"]
["2014-12-25","quinta-feira","Natal"]
["2015-01-01","quinta-feira","Confraternização Universal"]
["2015-02-16","segunda-feira","Carnaval"]
["2015-02-17","terça-feira","Carnaval"]
["2015-04-03","sexta-feira","Paixão de Cristo"]
["2015-04-21","terça-feira","Tiradentes"]
["2015-05-01","sexta-feira","Dia do Trabalho"]
["2015-06-04","quinta-feira","Corpus Christi"]
["2015-09-07","segunda-feira","Independência do Brasil"]
["2015-10-12","segunda-feira","Nossa Sr.a Aparecida - Padroeira do Brasil"]
["2015-11-02","segunda-feira","Finados"]
["2015-11-15","domingo","Proclamação da República"]
["2015-12-25","sexta-feira","Natal"]
["2016-01-01","sexta-feira","Confraternização Universal"]
["2016-02-08","segunda-feira","Carnaval"]
["2016-02-09","terça-feira","Carnaval"]
["2016-03-25","sexta-feira","Paixão de Cristo"]
["2016-04-21","quinta-feira","Tiradentes"]
["2016-05-01","domingo","Dia do Trabalho"]
["2016-05-26","quinta-feira","Corpus Christi"]
["2016-09-07","quarta-feira","Independência do Brasil"]
["2016-10-12","quarta-feira","Nossa Sr.a Aparecida - Padroeira do Brasil"]
["2016-11-02","quarta-feira","Finados"]
["2016-11-15","terça-feira","Proclamação da República"]
["2016-12-25","domingo","Natal"]
["2017-01-01","domingo","Confraternização Universal"]
["2017-02-27","segunda-feira","Carnaval"]
["2017-02-28","terça-feira","Carnaval"]
["2017-04-14","sexta-feira","Paixão de Cristo"]
["2017-04-21","sexta-feira","Tiradentes"]
["2017-05-01","segunda-feira","Dia do Trabalho"]
["2017-06-15","quinta-feira","Corpus Christi"]
["2017-09-07","quinta-feira","Independência do Brasil"]
["2017-10-12","quinta-feira","Nossa Sr.a Aparecida - Padroeira do Brasil"]
["2017-11-02","quinta-feira","Finados"]
["2017-11-15","quarta-feira","Proclamação da República"]
["2017-12-25","segunda-feira","Natal"]
["2018-01-01","segunda-feira","Confraternização Universal"]
["2018-02-12","segunda-feira","Carnaval"]
["2018-02-13","terça-feira","Carnaval"]
["2018-03-30","sexta-feira","Paixão de Cristo"]
["2018-04-21","sábado","Tiradentes"]
["2018-05-01","terça-feira","Dia do Trabalho"]
["2018-05-31","quinta-feira","Corpus Christi"]
["2018-09-07","sexta-feira","Independência do Brasil"]
["2018-10-12","sexta-feira","Nossa Sr.a Aparecida - Padroeira do Brasil"]
["2018-11-02","sexta-feira","Finados"]
["2018-11-15","quinta-feira","Proclamação da República"]
["2018-12-25","terça-feira","Natal"]
["2019-01-01","terça-feira","Confraternização Universal"]
["2019-03-04","segunda-feira","Carnaval"]
["2019-03-05","terça-feira","Carnaval"]
["2019-04-19","sexta-feira","Paixão de Cristo"]
["2019-04-21","domingo","Tiradentes"]
["2019-05-01","quarta-feira","Dia do Trabalho"]
["2019-06-20","quinta-feira","Corpus Christi"]
["2019-09-07","sábado","Independência do Brasil"]
["2019-10-12","sábado","Nossa Sr.a Aparecida - Padroeira do Brasil"]
["2019-11-02","sábado","Finados"]
["2019-11-15","sexta-feira","Proclamação da República"]
["2019-12-25","quarta-feira","Natal"]
["2020-01-01","quarta-feira","Confraternização Universal"]
["2020-02-24","segunda-feira","Carnaval"]
["2020-02-25","terça-feira","Carnaval"]
["2020-04-10","sexta-feira","Paixão de Cristo"]
["2020-04-21","terça-feira","Tiradentes"]
["2020-05-01","sexta-feira","Dia do Trabalho"]
["2020-06-11","quinta-feira","Corpus Christi"]
["2020-09-07","segunda-feira","Independência do Brasil"]
["2020-10-12","segunda-feira","Nossa Sr.a Aparecida - Padroeira do Brasil"]
["2020-11-02","segunda-feira","Finados"]
["2020-11-15","domingo","Proclamação da República"]
["2020-12-25","sexta-feira","Natal"]
["2021-01-01","sexta-feira","Confraternização Universal"]
["2021-02-15","segunda-feira","Carnaval"]
["2021-02-16","terça-feira","Carnaval"]
["2021-04-02","sexta-feira","Paixão de Cristo"]
["2021-04-21","quarta-feira","Tiradentes"]
["2021-05-01","sábado","Dia do Trabalho"]
["2021-06-03","quinta-feira","Corpus Christi"]
["2021-09-07","terça-feira","Independência do Brasil"]
["2021-10-12","terça-feira","Nossa Sr.a Aparecida - Padroeira do Brasil"]
["2021-11-02","terça-feira","Finados"]
["2021-11-15","segunda-feira","Proclamação da República"]
["2021-12-25","sábado","Natal"]
["2022-01-01","sábado","Confraternização Universal"]
["2022-02-28","segunda-feira","Carnaval"]
["2022-03-01","terça-feira","Carnaval"]
["2022-04-15","sexta-feira","Paixão de Cristo"]
["2022-04-21","quinta-feira","Tiradentes"]
["2022-05-01","domingo","Dia do Trabalho"]
["2022-06-16","quinta-feira","Corpus Christi"]
["2022-09-07","quarta-feira","Independência do Brasil"]
["2022-10-12","quarta-feira","Nossa Sr.a Aparecida - Padroeira do Brasil"]
["2022-11-02","quarta-feira","Finados"]
["2022-11-15","terça-feira","Proclamação da República"]
["2022-12-25","domingo","Natal"]
["2023-01-01","domingo","Confraternização Universal"]
["2023-02-20","segunda-feira","Carnaval"]
["2023-02-21","terça-feira","Carnaval"]
["2023-04-07","sexta-feira","Paixão de Cristo"]
["2023-04-21","sexta-feira","Tiradentes"]
["2023-05-01","segunda-feira","Dia do Trabalho"]
["2023-06-08","quinta-feira","Corpus Christi"]
["2023-09-07","quinta-feira","Independência do Brasil"]
["2023-10-12","quinta-feira","Nossa Sr.a Aparecida - Padroeira do Brasil"]
["2023-11-02","quinta-feira","Finados"]
["2023-11-15","quarta-feira","Proclamação da República"]
["2023-12-25","segunda-feira","Natal"]
["2024-01-01","segunda-feira","Confraternização Universal"]
["2024-02-12","segunda-feira","Carnaval"]
["2024-02-13","terça-feira","Carnaval"]
["2024-03-29","sexta-feira","Paixão de Cristo"]
["2024-04-21","domingo","Tiradentes"]
["2024-05-01","quarta-feira","Dia do Trabalho"]
["2024-05-30","quinta-feira","Corpus Christi"]
["2024-09-07","sábado","Independência do Brasil"]
["2024-10-12","sábado","Nossa Sr.a Aparecida - Padroeira do Brasil"]
["2024-11-02","sábado","Finados"]
["2024-11-15","sexta-feira","Proclamação da República"]
["2024-11-20","quarta-feira","Dia Nacional de Zumbi e da Consciência Negra"]
["2024-12-25","quarta-feira","Natal"]
["2025-01-01","quarta-feira","Confraternização Universal"]
["2025-03-03","segunda-feira","Carnaval"]
["2025-03-04","terça-feira","Carnaval"]
["2025-04-18","sexta-feira","Paixão de Cristo"]
["2025-04-21","segunda-feira","Tiradentes"]
["2025-05-01","quinta-feira","Dia do Trabalho"]
["2025-06-19","quinta-feira","Corpus Christi"]
["2025-09-07","domingo","Independência do Brasil"]
["2025-10-12","domingo","Nossa Sr.a Aparecida - Padroeira do Brasil"]
["2025-11-02","domingo","Finados"]
["2025-11-15","sábado","Proclamação da República"]
["2025-11-20","quinta-feira","Dia Nacional de Zumbi e da Consciência Negra"]
["2025-12-25","quinta-feira","Natal"]
["2026-01-01","quinta-feira","Confraternização Universal"]
["2026-02-16","segunda-feira","Carnaval"]
["2026-02-17","terça-feira","Carnaval"]
["2026-04-03","sexta-feira","Paixão de Cristo"]
["2026-04-21","terça-feira","Tiradentes"]
["2026-05-01","sexta-feira","Dia do Trabalho"]
["2026-06-04","quinta-feira","Corpus Christi"]
["2026-09-07","segunda-feira","Independência do Brasil"]
["2026-10-12","segunda-feira","Nossa Sr.a Aparecida - Padroeira do Brasil"]
["2026-11-02","segunda-feira","Finados"]
["2026-11-15","domingo","Proclamação da República"]
["2026-11-20","sexta-feira","Dia Nacional de Zumbi e da Consciência Negra"]
["2026-12-25","sexta-feira","Natal"]
["2027-01-01","sexta-feira","Confraternização Universal"]
["2027-02-08","segunda-feira","Carnaval"]
["2027-02-09","terça-feira","Carnaval"]
["2027-03-26","sexta-feira","Paixão de Cristo"]
["2027-04-21","quarta-feira","Tiradentes"]
["2027-05-01","sábado","Dia do Trabalho"]
["2027-05-27","quinta-feira","Corpus Christi"]
["2027-09-07","terça-feira","Independência do Brasil"]
["2027-10-12","terça-feira","Nossa Sr.a Aparecida - Padroeira do Brasil"]
["2027-11-02","terça-feira","Finados"]
["2027-11-15","segunda-feira","Proclamação da República"]
["2027-11-20","sábado","Dia Nacional de Zumbi e da Consciência Negra"]
["2027-12-25","sábado","Natal"]
["2028-01-01","sábado","Confraternização Universal"]
["2028-02-28","segunda-feira","Carnaval"]
["2028-02-29","terça-feira","Carnaval"]
["2028-04-14","sexta-feira","Paixão de Cristo"]
["2028-04-21","sexta-feira","Tiradentes"]
["2028-05-01","segunda-feira","Dia do Trabalho"]
["2028-06-15","quinta-feira","Corpus Christi"]
["2028-09-07","quinta-feira","Independência do Brasil"]
["2028-10-12","quinta-feira","Nossa Sr.a Aparecida - Padroeira do Brasil"]
["2028-11-02","quinta-feira","Finados"]
["2028-11-15","quarta-feira","Proclamação da República"]
["2028-11-20","segunda-feira","Dia Nacional de Zumbi e da Consciência Negra"]
["2028-12-25","segunda-feira","Natal"]
["2029-01-01","segunda-feira","Confraternização Universal"]
["2029-02-12","segunda-feira","Carnaval"]
["2029-02-13","terça-feira","Carnaval"]
["2029-03-30","sexta-feira","Paixão de Cristo"]
["2029-04-21","sábado","Tiradentes"]
["2029-05-01","terça-feira","Dia do Trabalho"]
["2029-05-31","quinta-feira","Corpus Christi"]
["2029-09-07","sexta-feira","Independência do Brasil"]
["2029-10-12","sexta-feira","Nossa Sr.a Aparecida - Padroeira do Brasil"]
["2029-11-02","sexta-feira","Finados"]
["2029-11-15","quinta-feira","Proclamação da República"]
["2029-11-20","terça-feira","Dia Nacional de Zumbi e da Consciência Negra"]
["2029-12-25","terça-feira","Natal"]
["2030-01-01","terça-feira","Confraternização Universal"]
["2030-03-04","segunda-feira","Carnaval"]
["2030-03-05","terça-feira","Carnaval"]
["2030-04-19","sexta-feira","Paixão de Cristo"]
["2030-04-21","domingo","Tiradentes"]
["2030-05-01","quarta-feira","Dia do Trabalho"]
["2030-06-20","quinta-feira","Corpus Christi"]
["2030-09-07","sábado","Independência do Brasil"]
["2030-10-12","sábado","Nossa Sr.a Aparecida - Padroeira do Brasil"]
["2030-11-02","sábado","Finados"]
["2030-11-15","sexta-feira","Proclamação da República"]
["2030-11-20","quarta-feira","Dia Nacional de Zumbi e da Consciência Negra"]
["2030-12-25","quarta-feira","Natal"]
["2031-01-01","quarta-feira","Confraternização Universal"]
["2031-02-24","segunda-feira","Carnaval"]
["2031-02-25","terça-feira","Carnaval"]
["2031-04-11","sexta-feira","Paixão de Cristo"]
["2031-04-21","segunda-feira","Tiradentes"]
["2031-05-01","quinta-feira","Dia do Trabalho"]
["2031-06-12","quinta-feira","Corpus Christi"]
["2031-09-07","domingo","Independência do Brasil"]
["2031-10-12","domingo","Nossa Sr.a Aparecida - Padroeira do Brasil"]
["2031-11-02","domingo","Finados"]
["2031-11-15","sábado","Proclamação da República"]
["2031-11-20","quinta-feira","Dia Nacional de Zumbi e da Consciência Negra"]
["2031-12-25","quinta-feira","Natal"]
["2032-01-01","quinta-feira","Confraternização Universal"]
["2032-02-09","segunda-feira","Carnaval"]
["2032-02-10","terça-feira","Carnaval"]
["2032-03-26","sexta-feira","Paixão de Cristo"]
["2032-04-21","quarta-feira","Tiradentes"]
["2032-05-01","sábado","Dia do Trabalho"]
["2032-05-27","quinta-feira","Corpus Christi"]
["2032-09-07","terça-feira","Independência do Brasil"]
["2032-10-12","terça-feira","Nossa Sr.a Aparecida - Padroeira do Brasil"]
["2032-11-02","terça-feira","Finados"]
["2032-11-15","segunda-feira","Proclamação da República"]
["2032-11-20","sábado","Dia Nacional de Zumbi e da Consciência Negra"]
["2032-12-25","sábado","Natal"]
["2033-01-01","sábado","Confraternização Universal"]
["2033-02-28","segunda-feira","Carnaval"]
["2033-03-01","terça-feira","Carnaval"]
["2033-04-15","sexta-feira","Paixão de Cristo"]
["2033-04-21","quinta-feira","Tiradentes"]
["2033-05-01","domingo","Dia do Trabalho"]
["2033-06-16","quinta-feira","Corpus Christi"]
["2033-09-07","quarta-feira","Independência do Brasil"]
["2033-10-12","quarta-feira","Nossa Sr.a Aparecida - Padroeira do Brasil"]
["2033-11-02","quarta-feira","Finados"]
["2033-11-15","terça-feira","Proclamação da República"]
["2033-11-20","domingo","Dia Nacional de Zumbi e da Consciência Negra"]
["2033-12-25","domingo","Natal"]
["2034-01-01","domingo","Confraternização Universal"]
["2034-02-20","segunda-feira","Carnaval"]
["2034-02-21","terça-feira","Carnaval"]
["2034-04-07","sexta-feira","Paixão de Cristo"]
["2034-04-21","sexta-feira","Tiradentes"]
["2034-05-01","segunda-feira","Dia do Trabalho"]
["2034-06-08","quinta-feira","Corpus Christi"]
["2034-09-07","quinta-feira","Independência do Brasil"]
["2034-10-12","quinta-feira","Nossa Sr.a Aparecida - Padroeira do Brasil"]
["2034-11-02","quinta-feira","Finados"]
["2034-11-15","quarta-feira","Proclamação da República"]
["2034-11-20","segunda-feira","Dia Nacional de Zumbi e da Consciência Negra"]
["2034-12-25","segunda-feira","Natal"]
["2035-01-01","segunda-feira","Confraternização Universal"]
["2035-02-05","segunda-feira","Carnaval"]
["2035-02-06","terça-feira","Carnaval"]
["2035-03-23","sexta-feira","Paixão de Cristo"]
["2035-04-21","sábado","Tiradentes"]
["2035-05-01","terça-feira","Dia do Trabalho"]
["2035-05-24","quinta-feira","Corpus Christi"]
["2035-09-07","sexta-feira","Independência do Brasil"]
["2035-10-12","sexta-feira","Nossa Sr.a Aparecida - Padroeira do Brasil"]
["2035-11-02","sexta-feira","Finados"]
["2035-11-15","quinta-feira","Proclamação da República"]
["2035-11-20","terça-feira","Dia Nacional de Zumbi e da Consciência Negra"]
["2035-12-25","terça-feira","Natal"]
["2036-01-01","terça-feira","Confraternização Universal"]
["2036-02-25","segunda-feira","Carnaval"]
["2036-02-26","terça-feira","Carnaval"]
["2036-04-11","sexta-feira","Paixão de Cristo"]
["2036-04-21","segunda-feira","Tiradentes"]
["2036-05-01","quinta-feira","Dia do Trabalho"]
["2036-06-12","quinta-feira","Corpus Christi"]
["2036-09-07","domingo","Independência do Brasil"]
["2036-10-12","domingo","Nossa Sr.a Aparecida - Padroeira do Brasil"]
["2036-11-02","domingo","Finados"]
["2036-11-15","sábado","Proclamação da República"]
["2036-11-20","quinta-feira","Dia Nacional de Zumbi e da Consciência Negra"]
["2036-12-25","quinta-feira","Natal"]
["2037-01-01","quinta-feira","Confraternização Universal"]
["2037-02-16","segunda-feira","Carnaval"]
["2037-02-17","terça-feira","Carnaval"]
["2037-04-03","sexta-feira","Paixão de Cristo"]
["2037-04-21","terça-feira","Tiradentes"]
["2037-05-01","sexta-feira","Dia do Trabalho"]
["2037-06-04","quinta-feira","Corpus Christi"]
["2037-09-07","segunda-feira","Independência do Brasil"]
["2037-10-12","segunda-feira","Nossa Sr.a Aparecida - Padroeira do Brasil"]
["2037-11-02","segunda-feira","Finados"]
["2037-11-15","domingo","Proclamação da República"]
["2037-11-20","sexta-feira","Dia Nacional de Zumbi e da Consciência Negra"]
["2037-12-25","sexta-feira","Natal"]
["2038-01-01","sexta-feira","Confraternização Universal"]
["2038-03-08","segunda-feira","Carnaval"]
["2038-03-09","terça-feira","Carnaval"]
["2038-04-21","quarta-feira","Tiradentes"]
["2038-04-23","sexta-feira","Paixão de Cristo"]
["2038-05-01","sábado","Dia do Trabalho"]
["2038-06-24","quinta-feira","Corpus Christi"]
["2038-09-07","terça-feira","Independência do Brasil"]
["2038-10-12","terça-feira","Nossa Sr.a Aparecida - Padroeira do Brasil"]
["2038-11-02","terça-feira","Finados"]
["2038-11-15","segunda-feira","Proclamação da República"]
["2038-11-20","sábado","Dia Nacional de Zumbi e da Consciência Negra"]
["2038-12-25","sábado","Natal"]
["2039-01-01","sábado","Confraternização Universal"]
["2039-02-21","segunda-feira","Carnaval"]
["2039-02-22","terça-feira","Carnaval"]
["2039-04-08","sexta-feira","Paixão de Cristo"]
["2039-04-21","quinta-feira","Tiradentes"]
["2039-05-01","domingo","Dia do Trabalho"]
["2039-06-09","quinta-feira","Corpus Christi"]
["2039-09-07","quarta-feira","Independência do Brasil"]
["2039-10-12","quarta-feira","Nossa Sr.a Aparecida - Padroeira do Brasil"]
["2039-11-02","quarta-feira","Finados"]
["2039-11-15","terça-feira","Proclamação da República"]
["2039-11-20","domingo","Dia Nacional de Zumbi e da Consciência Negra"]
["2039-12-25","domingo","Natal"]
["2040-01-01","domingo","Confraternização Universal"]
["2040-02-13","segunda-feira","Carnaval"]
["2040-02-14","terça-feira","Carnaval"]
["2040-03-30","sexta-feira","Paixão de Cristo"]
["2040-04-21","sábado","Tiradentes"]
["2040-05-01","terça-feira","Dia do Trabalho"]
["2040-05-31","quinta-feira","Corpus Christi"]
["2040-09-07","sexta-feira","Independência do Brasil"]
["2040-10-12","sexta-feira","Nossa Sr.a Aparecida - Padroeira do Brasil"]
["2040-11-02","sexta-feira","Finados"]
["2040-11-15","quinta-feira","Proclamação da República"]
["2040-11-20","terça-feira","Dia Nacional de Zumbi e da Consciência Negra"]
["2040-12-25","terça-feira","Natal"]
["2041-01-01","terça-feira","Confraternização Universal"]
["2041-03-04","segunda-feira","Carnaval"]
["2041-03-05","terça-feira","Carnaval"]
["2041-04-19","sexta-feira","Paixão de Cristo"]
["2041-04-21","domingo","Tiradentes"]
["2041-05-01","quarta-feira","Dia do Trabalho"]
["2041-06-20","quinta-feira","Corpus Christi"]
["2041-09-07","sábado","Independência do Brasil"]
["2041-10-12","sábado","Nossa Sr.a Aparecida - Padroeira do Brasil"]
["2041-11-02","sábado","Finados"]
["2041-11-15","sexta-feira","Proclamação da República"]
["2041-11-20","quarta-feira","Dia Nacional de Zumbi e da Consciência Negra"]
["2041-12-25","quarta-feira","Natal"]
["2042-01-01","quarta-feira","Confraternização Universal"]
["2042-02-17","segunda-feira","Carnaval"]
["2042-02-18","terça-feira","Carnaval"]
["2042-04-04","sexta-feira","Paixão de Cristo"]
["2042-04-21","segunda-feira","Tiradentes"]
["2042-05-01","quinta-feira","Dia do Trabalho"]
["2042-06-05","quinta-feira","Corpus Christi"]
["2042-09-07","domingo","Independência do Brasil"]
["2042-10-12","domingo","Nossa Sr.a Aparecida - Padroeira do Brasil"]
["2042-11-02","domingo","Finados"]
["2042-11-15","sábado","Proclamação da República"]
["2042-11-20","quinta-feira","Dia Nacional de Zumbi e da Consciência Negra"]
["2042-12-25","quinta-feira","Natal"]
["2043-01-01","quinta-feira","Confraternização Universal"]
["2043-02-09","segunda-feira","Carnaval"]
["2043-02-10","terça-feira","Carnaval"]
["2043-03-27","sexta-feira","Paixão de Cristo"]
["2043-04-21","terça-feira","Tiradentes"]
["2043-05-01","sexta-feira","Dia do Trabalho"]
["2043-05-28","quinta-feira","Corpus Christi"]
["2043-09-07","segunda-feira","Independência do Brasil"]
["2043-10-12","segunda-feira","Nossa Sr.a Aparecida - Padroeira do Brasil"]
["2043-11-02","segunda-feira","Finados"]
["2043-11-15","domingo","Proclamação da República"]
["2043-11-20","sexta-feira","Dia Nacional de Zumbi e da Consciência Negra"]
["2043-12-25","sexta-feira","Natal"]
["2044-01-01","sexta-feira","Confraternização Universal"]
["2044-02-29","segunda-feira","Carnaval"]
["2044-03-01","terça-feira","Carnaval"]
["2044-04-15","sexta-feira","Paixão de Cristo"]
["2044-04-21","quinta-feira","Tiradentes"]
["2044-05-01","domingo","Dia do Trabalho"]
["2044-06-16","quinta-feira","Corpus Christi"]
["2044-09-07","quarta-feira","Independência do Brasil"]
["2044-10-12","quarta-feira","Nossa Sr.a Aparecida - Padroeira do Brasil"]
["2044-11-02","quarta-feira","Finados"]
["2044-11-15","terça-feira","Proclamação da República"]
["2044-11-20","domingo","Dia Nacional de Zumbi e da Consciência Negra"]
["2044-12-25","domingo","Natal"]
["2045-01-01","domingo","Confraternização Universal"]
["2045-02-20","segunda-feira","Carnaval"]
["2045-02-21","terça-feira","Carnaval"]
["2045-04-07","sexta-feira","Paixão de Cristo"]
["2045-04-21","sexta-feira","Tiradentes"]
["2045-05-01","segunda-feira","Dia do Trabalho"]
["2045-06-08","quinta-feira","Corpus Christi"]
["2045-09-07","quinta-feira","Independência do Brasil"]
["2045-10-12","quinta-feira","Nossa Sr.a Aparecida - Padroeira do Brasil"]
["2045-11-02","quinta-feira","Finados"]
["2045-11-15","quarta-feira","Proclamação da República"]
["2045-11-20","segunda-feira","Dia Nacional de Zumbi e da Consciência Negra"]
["2045-12-25","segunda-feira","Natal"]
["2046-01-01","segunda-feira","Confraternização Universal"]
["2046-02-05","segunda-feira","Carnaval"]
["2046-02-06","terça-feira","Carnaval"]
["2046-03-23","sexta-feira","Paixão de Cristo"]
["2046-04-21","sábado","Tiradentes"]
["2046-05-01","terça-feira","Dia do Trabalho"]
["2046-05-24","quinta-feira","Corpus Christi"]
["2046-09-07","sexta-feira","Independência do Brasil"]
["2046-10-12","sexta-feira","Nossa Sr.a Aparecida - Padroeira do Brasil"]
["2046-11-02","sexta-feira","Finados"]
["2046-11-15","quinta-feira","Proclamação da República"]
["2046-11-20","terça-feira","Dia Nacional de Zumbi e da Consciência Negra"]
["2046-12-25","terça-feira","Natal"]
["2047-01-01","terça-feira","Confraternização Universal"]
["2047-02-25","segunda-feira","Carnaval"]
["2047-02-26","terça-feira","Carnaval"]
["2047-04-12","sexta-feira","Paixão de Cristo"]
["2047-04-21","domingo","Tiradentes"]
["2047-05-01","quarta-feira","Dia do Trabalho"]
["2047-06-13","quinta-feira","Corpus Christi"]
["2047-09-07","sábado","Independência do Brasil"]
["2047-10-12","sábado","Nossa Sr.a Aparecida - Padroeira do Brasil"]
["2047-11-02","sábado","Finados"]
["2047-11-15","sexta-feira","Proclamação da República"]
["2047-11-20","quarta-feira","Dia Nacional de Zumbi e da Consciência Negra"]
["2047-12-25","quarta-feira","Natal"]
["2048-01-01","quarta-feira","Confraternização Universal"]
["2048-02-17","segunda-feira","Carnaval"]
["2048-02-18","terça-feira","Carnaval"]
["2048-04-03","sexta-feira","Paixão de Cristo"]
["2048-04-21","terça-feira","Tiradentes"]
["2048-05-01","sexta-feira","Dia do Trabalho"]
["2048-06-04","quinta-feira","Corpus Christi"]
["2048-09-07","segunda-feira","Independência do Brasil"]
["2048-10-12","segunda-feira","Nossa Sr.a Aparecida - Padroeira do Brasil"]
["2048-11-02","segunda-feira","Finados"]
["2048-11-15","domingo","Proclamação da República"]
["2048-11-20","sexta-feira","Dia Nacional de Zumbi e da Consciência Negra"]
["2048-12-25","sexta-feira","Natal"]
["2049-01-01","sexta-feira","Confraternização Universal"]
["2049-03-01","segunda-feira","Carnaval"]
["2049-03-02","terça-feira","Carnaval"]
["2049-04-16","sexta-feira","Paixão de Cristo"]
["2049-04-21","quarta-feira","Tiradentes"]
["2049-05-01","sábado","Dia do Trabalho"]
["2049-06-17","quinta-feira","Corpus Christi"]
["2049-09-07","terça-feira","Independência do Brasil"]
["2049-10-12","terça-feira","Nossa Sr.a Aparecida - Padroeira do Brasil"]
["2049-11-02","terça-feira","Finados"]
["2049-11-15","segunda-feira","Proclamação da República"]
["2049-11-20","sábado","Dia Nacional de Zumbi e da Consciência Negra"]
["2049-12-25","sábado","Natal"]
["2050-01-01","sábado","Confraternização Universal"]
["2050-02-21","segunda-feira","Carnaval"]
["2050-02-22","terça-feira","Carnaval"]
["2050-04-08","sexta-feira","Paixão de Cristo"]
["2050-04-21","quinta-feira","Tiradentes"]
["2050-05-01","domingo","Dia do Trabalho"]
["2050-06-09","quinta-feira","Corpus Christi"]
["2050-09-07","quarta-feira","Independência do Brasil"]
["2050-10-12","quarta-feira","Nossa Sr.a Aparecida - Padroeira do Brasil"]
["2050-11-02","quarta-feira","Finados"]
["2050-11-15","terça-feira","Proclamação da República"]
["2050-11-20","domingo","Dia Nacional de Zumbi e da Consciência Negra"]
["2050-12-25","domingo","Natal"]
["2051-01-01","domingo","Confraternização Universal"]
["2051-02-13","segunda-feira","Carnaval"]
["2051-02-14","terça-feira","Carnaval"]
["2051-03-31","sexta-feira","Paixão de Cristo"]
["2051-04-21","sexta-feira","Tiradentes"]
["2051-05-01","segunda-feira","Dia do Trabalho"]
["2051-06-01","quinta-feira","Corpus Christi"]
["2051-09-07","quinta-feira","Independência do Brasil"]
["2051-10-12","quinta-feira","Nossa Sr.a Aparecida - Padroeira do Brasil"]
["2051-11-02","quinta-feira","Finados"]
["2051-11-15","quarta-feira","Proclamação da República"]
["2051-11-20","segunda-feira","Dia Nacional de Zumbi e da Consciência Negra"]
["2051-12-25","segunda-feira","Natal"]
["2052-01-01","segunda-feira","Confraternização Universal"]
["2052-03-04","segunda-feira","Carnaval"]
["2052-03-05","terça-feira","Carnaval"]
["2052-04-19","sexta-feira","Paixão de Cristo"]
["2052-04-21","domingo","Tiradentes"]
["2052-05-01","quarta-feira","Dia do Trabalho"]
["2052-06-20","quinta-feira","Corpus Christi"]
["2052-09-07","sábado","Independência do Brasil"]
["2052-10-12","sábado","Nossa Sr.a Aparecida - Padroeira do Brasil"]
["2052-11-02","sábado","Finados"]
["2052-11-15","sexta-feira","Proclamação da República"]
["2052-11-20","quarta-feira","Dia Nacional de Zumbi e da Consciência Negra"]
["2052-12-25","quarta-feira","Natal"]
["2053-01-01","quarta-feira","Confraternização Universal"]
["2053-02-17","segunda-feira","Carnaval"]
["2053-02-18","terça-feira","Carnaval"]
["2053-04-04","sexta-feira","Paixão de Cristo"]
["2053-04-21","segunda-feira","Tiradentes"]
["2053-05-01","quinta-feira","Dia do Trabalho"]
["2053-06-05","quinta-feira","Corpus Christi"]
["2053-09-07","domingo","Independência do Brasil"]
["2053-10-12","domingo","Nossa Sr.a Aparecida - Padroeira do Brasil"]
["2053-11-02","domingo","Finados"]
["2053-11-15","sábado","Proclamação da República"]
["2053-11-20","quinta-feira","Dia Nacional de Zumbi e da Consciência Negra"]
["2053-12-25","quinta-feira","Natal"]
["2054-01-01","quinta-feira","Confraternização Universal"]
["2054-02-09","segunda-feira","Carnaval"]
["2054-02-10","terça-feira","Carnaval"]
["2054-03-27","sexta-feira","Paixão de Cristo"]
["2054-04-21","terça-feira","Tiradentes"]
["2054-05-01","sexta-feira","Dia do Trabalho"]
["2054-05-28","quinta-feira","Corpus Christi"]
["2054-09-07","segunda-feira","Independência do Brasil"]
["2054-10-12","segunda-feira","Nossa Sr.a Aparecida - Padroeira do Brasil"]
["2054-11-02","segunda-feira","Finados"]
["2054-11-15","domingo","Proclamação da República"]
["2054-11-20","sexta-feira","Dia Nacional de Zumbi e da Consciência Negra"]
["2054-12-25","sexta-feira","Natal"]
["2055-01-01","sexta-feira","Confraternização Universal"]
["2055-03-01","segunda-feira","Carnaval"]
["2055-03-02","terça-feira","Carnaval"]
["2055-04-16","sexta-feira","Paixão de Cristo"]
["2055-04-21","quarta-feira","Tiradentes"]
["2055-05-01","sábado","Dia do Trabalho"]
["2055-06-17","quinta-feira","Corpus Christi"]
["2055-09-07","terça-feira","Independência do Brasil"]
["2055-10-12","terça-feira","Nossa Sr.a Aparecida - Padroeira do Brasil"]
["2055-11-02","terça-feira","Finados"]
["2055-11-15","segunda-feira","Proclamação da República"]
["2055-11-20","sábado","Dia Nacional de Zumbi e da Consciência Negra"]
["2055-12-25","sábado","Natal"]
["2056-01-01","sábado","Confraternização Universal"]
["2056-02-14","segunda-feira","Carnaval"]
["2056-02-15","terça-feira","Carnaval"]
["2056-03-31","sexta-feira","Paixão de Cristo"]
["2056-04-21","sexta-feira","Tiradentes"]
["2056-05-01","segunda-feira","Dia do Trabalho"]
["2056-06-01","quinta-feira","Corpus Christi"]
["2056-09-07","quinta-feira","Independência do Brasil"]
["2056-10-12","quinta-feira","Nossa Sr.a Aparecida - Padroeira do Brasil"]
["2056-11-02","quinta-feira","Finados"]
["2056-11-15","quarta-feira","Proclamação da República"]
["2056-11-20","segunda-feira","Dia Nacional de Zumbi e da Consciência Negra"]
["2056-12-25","segunda-feira","Natal"]
["2057-01-01","segunda-feira","Confraternização Universal"]
["2057-03-05","segunda-feira","Carnaval"]
["2057-03-06","terça-feira","Carnaval"]
["2057-04-20","sexta-feira","Paixão de Cristo"]
["2057-04-21","sábado","Tiradentes"]
["2057-05-01","terça-feira","Dia do Trabalho"]
["2057-06-21","quinta-feira","Corpus Christi"]
["2057-09-07","sexta-feira","Independência do Brasil"]
["2057-10-12","sexta-feira","Nossa Sr.a Aparecida - Padroeira do Brasil"]
["2057-11-02","sexta-feira","Finados"]
["2057-11-15","quinta-feira","Proclamação da República"]
["2057-11-20","terça-feira","Dia Nacional de Zumbi e da Consciência Negra"]
["2057-12-25","terça-feira","Natal"]
["2058-01-01","terça-feira","Confraternização Universal"]
["2058-02-25","segunda-feira","Carnaval"]
["2058-02-26","terça-feira","Carnaval"]
["2058-04-12","sexta-feira","Paixão de Cristo"]
["2058-04-21","domingo","Tiradentes"]
["2058-05-01","quarta-feira","Dia do Trabalho"]
["2058-06-13","quinta-feira","Corpus Christi"]
["2058-09-07","sábado","Independência do Brasil"]
["2058-10-12","sábado","Nossa Sr.a Aparecida - Padroeira do Brasil"]
["2058-11-02","sábado","Finados"]
["2058-11-15","sexta-feira","Proclamação da República"]
["2058-11-20","quarta-feira","Dia Nacional de Zumbi e da Consciência Negra"]
["2058-12-25","quarta-feira","Natal"]
["2059-01-01","quarta-feira","Confraternização Universal"]
["2059-02-10","segunda-feira","Carnaval"]
["2059-02-11","terça-feira","Carnaval"]
["2059-03-28","sexta-feira","Paixão de Cristo"]
["2059-04-21","segunda-feira","Tiradentes"]
["2059-05-01","quinta-feira","Dia do Trabalho"]
["2059-05-29","quinta-feira","Corpus Christi"]
["2059-09-07","domingo","Independência do Brasil"]
["2059-10-12","domingo","Nossa Sr.a Aparecida - Padroeira do Brasil"]
["2059-11-02","domingo","Finados"]
["2059-11-15","sábado","Proclamação da República"]
["2059-11-20","quinta-feira","Dia Nacional de Zumbi e da Consciência Negra"]
["2059-12-25","quinta-feira","Natal"]
["2060-01-01","quinta-feira","Confraternização Universal"]
["2060-03-01","segunda-feira","Carnaval"]
["2060-03-02","terça-feira","Carnaval"]
["2060-04-16","sexta-feira","Paixão de Cristo"]
["2060-04-21","quarta-feira","Tiradentes"]
["2060-05-01","sábado","Dia do Trabalho"]
["2060-06-17","quinta-feira","Corpus Christi"]
["2060-09-07","terça-feira","Independência do Brasil"]
["2060-10-12","terça-feira","Nossa Sr.a Aparecida - Padroeira do Brasil"]
["2060-11-02","terça-feira","Finados"]
["2060-11-15","segunda-feira","Proclamação da República"]
["2060-11-20","sábado","Dia Nacional de Zumbi e da Consciência Negra"]
["2060-12-25","sábado","Natal"]
["2061-01-01","sábado","Confraternização Universal"]
["2061-02-21","segunda-feira","Carnaval"]
["2061-02-22","terça-feira","Carnaval"]
["2061-04-08","sexta-feira","Paixão de Cristo"]
["2061-04-21","quinta-feira","Tiradentes"]
["2061-05-01","domingo","Dia do Trabalho"]
["2061-06-09","quinta-feira","Corpus Christi"]
["2061-09-07","quarta-feira","Independência do Brasil"]
["2061-10-12","quarta-feira","Nossa Sr.a Aparecida - Padroeira do Brasil"]
["2061-11-02","quarta-feira","Finados"]
["2061-11-15","terça-feira","Proclamação da República"]
["2061-11-20","domingo","Dia Nacional de Zumbi e da Consciência Negra"]
["2061-12-25","domingo","Natal"]
["2062-01-01","domingo","Confraternização Universal"]
["2062-02-06","segunda-feira","Carnaval"]
["2062-02-07","terça-feira","Carnaval"]
["2062-03-24","sexta-feira","Paixão de Cristo"]
["2062-04-21","sexta-feira","Tiradentes"]
["2062-05-01","segunda-feira","Dia do Trabalho"]
["2062-05-25","quinta-feira","Corpus Christi"]
["2062-09-07","quinta-feira","Independência do Brasil"]
["2062-10-12","quinta-feira","Nossa Sr.a Aparecida - Padroeira do Brasil"]
["2062-11-02","quinta-feira","Finados"]
["2062-11-15","quarta-feira","Proclamação da República"]
["2062-11-20","segunda-feira","Dia Nacional de Zumbi e da Consciência Negra"]
["2062-12-25","segunda-feira","Natal"]
["2063-01-01","segunda-feira","Confraternização Universal"]
["2063-02-26","segunda-feira","Carnaval"]
["2063-02-27","terça-feira","Carnaval"]
["2063-04-13","sexta-feira","Paixão de Cristo"]
["2063-04-21","sábado","Tiradentes"]
["2063-05-01","terça-feira","Dia do Trabalho"]
["2063-06-14","quinta-feira","Corpus Christi"]
["2063-09-07","sexta-feira","Independência do Brasil"]
["2063-10-12","sexta-feira","Nossa Sr.a Aparecida - Padroeira do Brasil"]
["2063-11-02","sexta-feira","Finados"]
["2063-11-15","quinta-feira","Proclamação da República"]
["2063-11-20","terça-feira","Dia Nacional de Zumbi e da Consciência Negra"]
["2063-12-25","terça-feira","Natal"]
["2064-01-01","terça-feira","Confraternização Universal"]
["2064-02-18","segunda-feira","Carnaval"]
["2064-02-19","terça-feira","Carnaval"]
["2064-04-04","sexta-feira","Paixão de Cristo"]
["2064-04-21","segunda-feira","Tiradentes"]
["2064-05-01","quinta-feira","Dia do Trabalho"]
["2064-06-05","quinta-feira","Corpus Christi"]
["2064-09-07","domingo","Independência do Brasil"]
["2064-10-12","domingo","Nossa Sr.a Aparecida - Padroeira do Brasil"]
["2064-11-02","domingo","Finados"]
["2064-11-15","sábado","Proclamação da República"]
["2064-11-20","quinta-feira","Dia Nacional de Zumbi e da Consciência Negra"]
["2064-12-25","quinta-feira","Natal"]
["2065-01-01","quinta-feira","Confraternização Universal"]
["2065-02-09","segunda-feira","Carnaval"]
["2065-02-10","terça-feira","Carnaval"]
["2065-03-27","sexta-feira","Paixão de Cristo"]
["2065-04-21","terça-feira","Tiradentes"]
["2065-05-01","sexta-feira","Dia do Trabalho"]
["2065-05-28","quinta-feira","Corpus Christi"]
["2065-09-07","segunda-feira","Independência do Brasil"]
["2065-10-12","segunda-feira","Nossa Sr.a Aparecida - Padroeira do Brasil"]
["2065-11-02","segunda-feira","Finados"]
["2065-11-15","domingo","Proclamação da República"]
["2065-11-20","sexta-feira","Dia Nacional de Zumbi e da Consciência Negra"]
["2065-12-25","sexta-feira","Natal"]
["2066-01-01","sexta-feira","Confraternização Universal"]
["2066-02-22","segunda-feira","Carnaval"]
["2066-02-23","terça-feira","Carnaval"]
["2066-04-09","sexta-feira","Paixão de Cristo"]
["2066-04-21","quarta-feira","Tiradentes"]
["2066-05-01","sábado","Dia do Trabalho"]
["2066-06-10","quinta-feira","Corpus Christi"]
["2066-09-07","terça-feira","Independência do Brasil"]
["2066-10-12","terça-feira","Nossa Sr.a Aparecida - Padroeira do Brasil"]
["2066-11-02","terça-feira","Finados"]
["2066-11-15","segunda-feira","Proclamação da República"]
["2066-11-20","sábado","Dia Nacional de Zumbi e da Consciência Negra"]
["2066-12-25","sábado","Natal"]
["2067-01-01","sábado","Confraternização Universal"]
["2067-02-14","segunda-feira","Carnaval"]
["2067-02-15","terça-feira","Carnaval"]
["2067-04-01","sexta-feira","Paixão de Cristo"]
["2067-04-21","quinta-feira","Tiradentes"]
["2067-05-01","domingo","Dia do Trabalho"]
["2067-06-02","quinta-feira","Corpus Christi"]
["2067-09-07","quarta-feira","Independência do Brasil"]
["2067-10-12","quarta-feira","Nossa Sr.a Aparecida - Padroeira do Brasil"]
["2067-11-02","quarta-feira","Finados"]
["2067-11-15","terça-feira","Proclamação da República"]
["2067-11-20","domingo","Dia Nacional de Zumbi e da Consciência Negra"]
["2067-12-25","domingo","Natal"]
["2068-01-01","domingo","Confraternização Universal"]
["2068-03-05","segunda-feira","Carnaval"]
["2068-03-06","terça-feira","Carnaval"]
["2068-04-20","sexta-feira","Paixão de Cristo"]
["2068-04-21","sábado","Tiradentes"]
["2068-05-01","terça-feira","Dia do Trabalho"]
["2068-06-21","quinta-feira","Corpus Christi"]
["2068-09-07","sexta-feira","Independência do Brasil"]
["2068-10-12","sexta-feira","Nossa Sr.a Aparecida - Padroeira do Brasil"]
["2068-11-02","sexta-feira","Finados"]
["2068-11-15","quinta-feira","Proclamação da República"]
["2068-11-20","terça-feira","Dia Nacional de Zumbi e da Consciência Negra"]
["2068-12-25","terça-feira","Natal"]
["2069-01-01","terça-feira","Confraternização Universal"]
["2069-02-25","segunda-feira","Carnaval"]
["2069-02-26","terça-feira","Carnaval"]
["2069-04-12","sexta-feira","Paixão de Cristo"]
["2069-04-21","domingo","Tiradentes"]
["2069-05-01","quarta-feira","Dia do Trabalho"]
["2069-06-13","quinta-feira","Corpus Christi"]
["2069-09-07","sábado","Independência do Brasil"]
["2069-10-12","sábado","Nossa Sr.a Aparecida - Padroeira do Brasil"]
["2069-11-02","sábado","Finados"]
["2069-11-15","sexta-feira","Proclamação da República"]
["2069-11-20","quarta-feira","Dia Nacional de Zumbi e da Consciência Negra"]
["2069-12-25","quarta-feira","Natal"]
["2070-01-01","quarta-feira","Confraternização Universal"]
["2070-02-10","segunda-feira","Carnaval"]
["2070-02-11","terça-feira","Carnaval"]
["2070-03-28","sexta-feira","Paixão de Cristo"]
["2070-04-21","segunda-feira","Tiradentes"]
["2070-05-01","quinta-feira","Dia do Trabalho"]
["2070-05-29","quinta-feira","Corpus Christi"]
["2070-09-07","domingo","Independência do Brasil"]
["2070-10-12","domingo","Nossa Sr.a Aparecida - Padroeira do Brasil"]
["2070-11-02","domingo","Finados"]
["2070-11-15","sábado","Proclamação da República"]
["2070-11-20","quinta-feira","Dia Nacional de Zumbi e da Consciência Negra"]
["2070-12-25","quinta-feira","Natal"]
["2071-01-01","quinta-feira","Confraternização Universal"]
["2071-03-02","segunda-feira","Carnaval"]
["2071-03-03","terça-feira","Carnaval"]
["2071-04-17","sexta-feira","Paixão de Cristo"]
["2071-04-21","terça-feira","Tiradentes"]
["2071-05-01","sexta-feira","Dia do Trabalho"]
["2071-06-18","quinta-feira","Corpus Christi"]
["2071-09-07","segunda-feira","Independência do Brasil"]
["2071-10-12","segunda-feira","Nossa Sr.a Aparecida - Padroeira do Brasil"]
["2071-11-02","segunda-feira","Finados"]
["2071-11-15","domingo","Proclamação da República"]
["2071-11-20","sexta-feira","Dia Nacional de Zumbi e da Consciência Negra"]
["2071-12-25","sexta-feira","Natal"]
["2072-01-01","sexta-feira","Confraternização Universal"]
["2072-02-22","segunda-feira","Carnaval"]
["2072-02-23","terça-feira","Carnaval"]
["2072-04-08","sexta-feira","Paixão de Cristo"]
["2072-04-21","quinta-feira","Tiradentes"]
["2072-05-01","domingo","Dia do Trabalho"]
["2072-06-09","quinta-feira","Corpus Christi"]
["2072-09-07","quarta-feira","Independência do Brasil"]
["2072-10-12","quarta-feira","Nossa Sr.a Aparecida - Padroeira do Brasil"]
["2072-11-02","quarta-feira","Finados"]
["2072-11-15","terça-feira","Proclamação da República"]
["2072-11-20","domingo","Dia Nacional de Zumbi e da Consciência Negra"]
["2072-12-25","domingo","Natal"]
["2073-01-01","domingo","Confraternização Universal"]
["2073-02-06","segunda-feira","Carnaval"]
["2073-02-07","terça-feira","Carnaval"]
["2073-03-24","sexta-feira","Paixão de Cristo"]
["2073-04-21","sexta-feira","Tiradentes"]
["2073-05-01","segunda-feira","Dia do Trabalho"]
["2073-05-25","quinta-feira","Corpus Christi"]
["2073-09-07","quinta-feira","Independência do Brasil"]
["2073-10-12","quinta-feira","Nossa Sr.a Aparecida - Padroeira do Brasil"]
["2073-11-02","quinta-feira","Finados"]
["2073-11-15","quarta-feira","Proclamação da República"]
["2073-11-20","segunda-feira","Dia Nacional de Zumbi e da Consciência Negra"]
["2073-12-25","segunda-feira","Natal"]
["2074-01-01","segunda-feira","Confraternização Universal"]
["2074-02-26","segunda-feira","Carnaval"]
["2074-02-27","terça-feira","Carnaval"]
["2074-04-13","sexta-feira","Paixão de Cristo"]
["2074-04-21","sábado","Tiradentes"]
["2074-05-01","terça-feira","Dia do Trabalho"]
["2074-06-14","quinta-feira","Corpus Christi"]
["2074-09-07","sexta-feira","Independência do Brasil"]
["2074-10-12","sexta-feira","Nossa Sr.a Aparecida - Padroeira do Brasil"]
["2074-11-02","sexta-feira","Finados"]
["2074-11-15","quinta-feira","Proclamação da República"]
["2074-11-20","terça-feira","Dia Nacional de Zumbi e da Consciência Negra"]
["2074-12-25","terça-feira","Natal"]
["2075-01-01","terça-feira","Confraternização Universal"]
["2075-02-18","segunda-feira","Carnaval"]
["2075-02-19","terça-feira","Carnaval"]
["2075-04-05","sexta-feira","Paixão de Cristo"]
["2075-04-21","domingo","Tiradentes"]
["2075-05-01","quarta-feira","Dia do Trabalho"]
["2075-06-06","quinta-feira","Corpus Christi"]
["2075-09-07","sábado","Independência do Brasil"]
["2075-10-12","sábado","Nossa Sr.a Aparecida - Padroeira do Brasil"]
["2075-11-02","sábado","Finados"]
["2075-11-15","sexta-feira","Proclamação da República"]
["2075-11-20","quarta-feira","Dia Nacional de Zumbi e da Consciência Negra"]
["2075-12-25","quarta-feira","Natal"]
["2076-01-01","quarta-feira","Confraternização Universal"]
["2076-03-02","segunda-feira","Carnaval"]
["2076-03-03","terça-feira","Carnaval"]
["2076-04-17","sexta-feira","Paixão de Cristo"]
["2076-04-21","terça-feira","Tiradentes"]
["2076-05-01","sexta-feira","Dia do Trabalho"]
["2076-06-18","quinta-feira","Corpus Christi"]
["2076-09-07","segunda-feira","Independência do Brasil"]
["2076-10-12","segunda-feira","Nossa Sr.a Aparecida - Padroeira do Brasil"]
["2076-11-02","segunda-feira","Finados"]
["2076-11-15","domingo","Proclamação da República"]
["2076-11-20","sexta-feira","Dia Nacional de Zumbi e da Consciência Negra"]
["2076-12-25","sexta-feira","Natal"]
["2077-01-01","sexta-feira","Confraternização Universal"]
["2077-02-22","segunda-feira","Carnaval"]
["2077-02-23","terça-feira","Carnaval"]
["2077-04-09","sexta-feira","Paixão de Cristo"]
["2077-04-21","quarta-feira","Tiradentes"]
["2077-05-01","sábado","Dia do Trabalho"]
["2077-06-10","quinta-feira","Corpus Christi"]
["2077-09-07","terça-feira","Independência do Brasil"]
["2077-10-12","terça-feira","Nossa Sr.a Aparecida - Padroeira do Brasil"]
["2077-11-02","terça-feira","Finados"]
["2077-11-15","segunda-feira","Proclamação da República"]
["2077-11-20","sábado","Dia Nacional de Zumbi e da Consciência Negra"]
["2077-12-25","sábado","Natal"]
["2078-01-01","sábado","Confraternização Universal"]
["2078-02-14","segunda-feira","Carnaval"]
["2078-02-15","terça-feira","Carnaval"]
["2078-04-01","sexta-feira","Paixão de Cristo"]
["2078-04-21","quinta-feira","Tiradentes"]
["2078-05-01","domingo","Dia do Trabalho"]
["2078-06-02","quinta-feira","Corpus Christi"]
["2078-09-07","quarta-feira","Independência do Brasil"]
["2078-10-12","quarta-feira","Nossa Sr.a Aparecida - Padroeira do Brasil"]
["2078-11-02","quarta-feira","Finados"]
["2078-11-15","terça-feira","Proclamação da República"]
["2078-11-20","domingo","Dia Nacional de Zumbi e da Consciência Negra"]
["2078-12-25","domingo","Natal"]
["2079-01-01","domingo","Confraternização Universal"]
["2079-03-06","segunda-feira","Carnaval"]
["2079-03-07","terça-feira","Carnaval"]
["2079-04-21","sexta-feira","Paixão de Cristo"]
["2079-04-21","sexta-feira","Tiradentes"]
["2079-05-01","segunda-feira","Dia do Trabalho"]
["2079-06-22","quinta-feira","Corpus Christi"]
["2079-09-07","quinta-feira","Independência do Brasil"]
["2079-10-12","quinta-feira","Nossa Sr.a Aparecida - Padroeira do Brasil"]
["2079-11-02","quinta-feira","Finados"]
["2079-11-15","quarta-feira","Proclamação da República"]
["2079-11-20","segunda-feira","Dia Nacional de Zumbi e da Consciência Negra"]
["2079-12-25","segunda-feira","Natal"]
["2080-01-01","segunda-feira","Confraternização Universal"]
["2080-02-19","segunda-feira","Carnaval"]
["2080-02-20","terça-feira","Carnaval"]
["2080-04-05","sexta-feira","Paixão de Cristo"]
["2080-04-21","domingo","Tiradentes"]
["2080-05-01","quarta-feira","Dia do Trabalho"]
["2080-06-06","quinta-feira","Corpus Christi"]
["2080-09-07","sábado","Independência do Brasil"]
["2080-10-12","sábado","Nossa Sr.a Aparecida - Padroeira do Brasil"]
["2080-11-02","sábado","Finados"]
["2080-11-15","sexta-feira","Proclamação da República"]
["2080-11-20","quarta-feira","Dia Nacional de Zumbi e da Consciência Negra"]
["2080-12-25","quarta-feira","Natal"]
["2081-01-01","quarta-feira","Confraternização Universal"]
["2081-02-10","segunda-feira","Carnaval"]
["2081-02-11","terça-feira","Carnaval"]
["2081-03-28","sexta-feira","Paixão de Cristo"]
["2081-04-21","segunda-feira","Tiradentes"]
["2081-05-01","quinta-feira","Dia do Trabalho"]
["2081-05-29","quinta-feira","Corpus Christi"]
["2081-09-07","domingo","Independência do Brasil"]
["2081-10-12","domingo","Nossa Sr.a Aparecida - Padroeira do Brasil"]
["2081-11-02","domingo","Finados"]
["2081-11-15","sábado","Proclamação da República"]
["2081-11-20","quinta-feira","Dia Nacional de Zumbi e da Consciência Negra"]
["2081-12-25","quinta-feira","Natal"]
["2082-01-01","quinta-feira","Confraternização Universal"]
["2082-03-02","segunda-feira","Carnaval"]
["2082-03-03","terça-feira","Carnaval"]
["2082-04-17","sexta-feira","Paixão de Cristo"]
["2082-04-21","terça-feira","Tiradentes"]
["2082-05-01","sexta-feira","Dia do Trabalho"]
["2082-06-18","quinta-feira","Corpus Christi"]
["2082-09-07","segunda-feira","Independência do Brasil"]
["2082-10-12","segunda-feira","Nossa Sr.a Aparecida - Padroeira do Brasil"]
["2082-11-02","segunda-feira","Finados"]
["2082-11-15","domingo","Proclamação da República"]
["2082-11-20","sexta-feira","Dia Nacional de Zumbi e da Consciência Negra"]
["2082-12-25","sexta-feira","Natal"]
["2083-01-01","sexta-feira","Confraternização Universal"]
["2083-02-15","segunda-feira","Carnaval"]
["2083-02-16","terça-feira","Carnaval"]
["2083-04-02","sexta-feira","Paixão de Cristo"]
["2083-04-21","quarta-feira","Tiradentes"]
["2083-05-01","sábado","Dia do Trabalho"]
["2083-06-03","quinta-feira","Corpus Christi"]
["2083-09-07","terça-feira","Independência do Brasil"]
["2083-10-12","terça-feira","Nossa Sr.a Aparecida - Padroeira do Brasil"]
["2083-11-02","terça-feira","Finados"]
["2083-11-15","segunda-feira","Proclamação da República"]
["2083-11-20","sábado","Dia Nacional de Zumbi e da Consciência Negra"]
["2083-12-25","sábado","Natal"]
["2084-01-01","sábado","Confraternização Universal"]
["2084-02-07","segunda-feira","Carnaval"]
["2084-02-08","terça-feira","Carnaval"]
["2084-03-24","sexta-feira","Paixão de Cristo"]
["2084-04-21","sexta-feira","Tiradentes"]
["2084-05-01","segunda-feira","Dia do Trabalho"]
["2084-05-25","quinta-feira","Corpus Christi"]
["2084-09-07","quinta-feira","Independência do Brasil"]
["2084-10-12","quinta-feira","Nossa Sr.a Aparecida - Padroeira do Brasil"]
["2084-11-02","quinta-feira","Finados"]
["2084-11-15","quarta-feira","Proclamação da República"]
["2084-11-20","segunda-feira","Dia Nacional de Zumbi e da Consciência Negra"]
["2084-12-25","segunda-feira","Natal"]
["2085-01-01","segunda-feira","Confraternização Universal"]
["2085-02-26","segunda-feira","Carnaval"]
["2085-02-27","terça-feira","Carnaval"]
["2085-04-13","sexta-feira","Paixão de Cristo"]
["2085-04-21","sábado","Tiradentes"]
["2085-05-01","terça-feira","Dia do Trabalho"]
["2085-06-14","quinta-feira","Corpus Christi"]
["2085-09-07","sexta-feira","Independência do Brasil"]
["2085-10-12","sexta-feira","Nossa Sr.a Aparecida - Padroeira do Brasil"]
["2085-11-02","sexta-feira","Finados"]
["2085-11-15","quinta-feira","Proclamação da República"]
["2085-11-20","terça-feira","Dia Nacional de Zumbi e da Consciência Negra"]
["2085-12-25","terça-feira","Natal"]
["2086-01-01","terça-feira","Confraternização Universal"]
["2086-02-11","segunda-feira","Carnaval"]
["2086-02-12","terça-feira","Carnaval"]
["2086-03-29","sexta-feira","Paixão de Cristo"]
["2086-04-21","domingo","Tiradentes"]
["2086-05-01","quarta-feira","Dia do Trabalho"]
["2086-05-30","quinta-feira","Corpus Christi"]
["2086-09-07","sábado","Independência do Brasil"]
["2086-10-12","sábado","Nossa Sr.a Aparecida - Padroeira do Brasil"]
["2086-11-02","sábado","Finados"]
["2086-11-15","sexta-feira","Proclamação da República"]
["2086-11-20","quarta-feira","Dia Nacional de Zumbi e da Consciência Negra"]
["2086-12-25","quarta-feira","Natal"]
["2087-01-01","quarta-feira","Confraternização Universal"]
["2087-03-03","segunda-feira","Carnaval"]
["2087-03-04","terça-feira","Carnaval"]
["2087-04-18","sexta-feira","Paixão de Cristo"]
["2087-04-21","segunda-feira","Tiradentes"]
["2087-05-01","quinta-feira","Dia do Trabalho"]
["2087-06-19","quinta-feira","Corpus Christi"]
["2087-09-07","domingo","Independência do Brasil"]
["2087-10-12","domingo","Nossa Sr.a Aparecida - Padroeira do Brasil"]
["2087-11-02","domingo","Finados"]
["2087-11-15","sábado","Proclamação da República"]
["2087-11-20","quinta-feira","Dia Nacional de Zumbi e da Consciência Negra"]
["2087-12-25","quinta-feira","Natal"]
["2088-01-01","quinta-feira","Confraternização Universal"]
["2088-02-23","segunda-feira","Carnaval"]
["2088-02-24","terça-feira","Carnaval"]
["2088-04-09","sexta-feira","Paixão de Cristo"]
["2088-04-21","quarta-feira","Tiradentes"]
["2088-05-01","sábado","Dia do Trabalho"]
["2088-06-10","quinta-feira","Corpus Christi"]
["2088-09-07","terça-feira","Independência do Brasil"]
["2088-10-12","terça-feira","Nossa Sr.a Aparecida - Padroeira do Brasil"]
["2088-11-02","terça-feira","Finados"]
["2088-11-15","segunda-feira","Proclamação da República"]
["2088-11-20","sábado","Dia Nacional de Zumbi e da Consciência Negra"]
["2088-12-25","sábado","Natal"]
["2089-01-01","sábado","Confraternização Universal"]
["2089-02-14","segunda-feira","Carnaval"]
["2089-02-15","terça-feira","Carnaval"]
["2089-04-01","sexta-feira","Paixão de Cristo"]
["2089-04-21","quinta-feira","Tiradentes"]
["2089-05-01","domingo","Dia do Trabalho"]
["2089-06-02","quinta-feira","Corpus Christi"]
["2089-09-07","quarta-feira","Independência do Brasil"]
["2089-10-12","quarta-feira","Nossa Sr.a Aparecida - Padroeira do Brasil"]
["2089-11-02","quarta-feira","Finados"]
["2089-11-15","terça-feira","Proclamação da República"]
["2089-11-20","domingo","Dia Nacional de Zumbi e da Consciência Negra"]
["2089-12-25","domingo","Natal"]
["2090-01-01","domingo","Confraternização Universal"]
["2090-02-27","segunda-feira","Carnaval"]
["2090-02-28","terça-feira","Carnaval"]
["2090-04-14","sexta-feira","Paixão de Cristo"]
["2090-04-21","sexta-feira","Tiradentes"]
["2090-05-01","segunda-feira","Dia do Trabalho"]
["2090-06-15","quinta-feira","Corpus Christi"]
["2090-09-07","quinta-feira","Independência do Brasil"]
["2090-10-12","quinta-feira","Nossa Sr.a Aparecida - Padroeira do Brasil"]
["2090-11-02","quinta-feira","Finados"]
["2090-11-15","quarta-feira","Proclamação da República"]
["2090-11-20","segunda-feira","Dia Nacional de Zumbi e da Consciência Negra"]
["2090-12-25","segunda-feira","Natal"]
["2091-01-01","segunda-feira","Confraternização Universal"]
["2091-02-19","segunda-feira","Carnaval"]
["2091-02-20","terça-feira","Carnaval"]
["2091-04-06","sexta-feira","Paixão de Cristo"]
["2091-04-21","sábado","Tiradentes"]
["2091-05-01","terça-feira","Dia do Trabalho"]
["2091-06-07","quinta-feira","Corpus Christi"]
["2091-09-07","sexta-feira","Independência do Brasil"]
["2091-10-12","sexta-feira","Nossa Sr.a Aparecida - Padroeira do Brasil"]
["2091-11-02","sexta-feira","Finados"]
["2091-11-15","quinta-feira","Proclamação da República"]
["2091-11-20","terça-feira","Dia Nacional de Zumbi e da Consciência Negra"]
["2091-12-25","terça-feira","Natal"]
["2092-01-01","terça-feira","Confraternização Universal"]
["2092-02-11","segunda-feira","Carnaval"]
["2092-02-12","terça-feira","Carnaval"]
["2092-03-28","sexta-feira","Paixão de Cristo"]
["2092-04-21","segunda-feira","Tiradentes"]
["2092-05-01","quinta-feira","Dia do Trabalho"]
["2092-05-29","quinta-feira","Corpus Christi"]
["2092-09-07","domingo","Independência do Brasil"]
["2092-10-12","domingo","Nossa Sr.a Aparecida - Padroeira do Brasil"]
["2092-11-02","domingo","Finados"]
["2092-11-15","sábado","Proclamação da República"]
["2092-11-20","quinta-feira","Dia Nacional de Zumbi e da Consciência Negra"]
["2092-12-25","quinta-feira","Natal"]
["2093-01-01","quinta-feira","Confraternização Universal"]
["2093-02-23","segunda-feira","Carnaval"]
["2093-02-24","terça-feira","Carnaval"]
["2093-04-10","sexta-feira","Paixão de Cristo"]
["2093-04-21","terça-feira","Tiradentes"]
["2093-05-01","sexta-feira","Dia do Trabalho"]
["2093-06-11","quinta-feira","Corpus Christi"]
["2093-09-07","segunda-feira","Independência do Brasil"]
["2093-10-12","segunda-feira","Nossa Sr.a Aparecida - Padroeira do Brasil"]
["2093-11-02","segunda-feira","Finados"]
["2093-11-15","domingo","Proclamação da República"]
["2093-11-20","sexta-feira","Dia Nacional de Zumbi e da Consciência Negra"]
["2093-12-25","sexta-feira","Natal"]
["2094-01-01","sexta-feira","Confraternização Universal"]
["2094-02-15","segunda-feira","Carnaval"]
["2094-02-16","terça-feira","Carnaval"]
["2094-04-02","sexta-feira","Paixão de Cristo"]
["2094-04-21","quarta-feira","Tiradentes"]
["2094-05-01","sábado","Dia do Trabalho"]
["2094-06-03","quinta-feira","Corpus Christi"]
["2094-09-07","terça-feira","Independência do Brasil"]
["2094-10-12","terça-feira","Nossa Sr.a Aparecida - Padroeira do Brasil"]
["2094-11-02","terça-feira","Finados"]
["2094-11-15","segunda-feira","Proclamação da República"]
["2094-11-20","sábado","Dia Nacional de Zumbi e da Consciência Negra"]
["2094-12-25","sábado","Natal"]
["2095-01-01","sábado","Confraternização Universal"]
["2095-03-07","segunda-feira","Carnaval"]
["2095-03-08","terça-feira","Carnaval"]
["2095-04-21","quinta-feira","Tiradentes"]
["2095-04-22","sexta-feira","Paixão de Cristo"]
["2095-05-01","domingo","Dia do Trabalho"]
["2095-06-23","quinta-feira","Corpus Christi"]
["2095-09-07","quarta-feira","Independência do Brasil"]
["2095-10-12","quarta-feira","Nossa Sr.a Aparecida - Padroeira do Brasil"]
["2095-11-02","quarta-feira","Finados"]
["2095-11-15","terça-feira","Proclamação da República"]
["2095-11-20","domingo","Dia Nacional de Zumbi e da Consciência Negra"]
["2095-12-25","domingo","Natal"]
["2096-01-01","domingo","Confraternização Universal"]
["2096-02-27","segunda-feira","Carnaval"]
["2096-02-28","terça-feira","Carnaval"]
["2096-04-13","sexta-feira","Paixão de Cristo"]
["2096-04-21","sábado","Tiradentes"]
["2096-05-01","terça-feira","Dia do Trabalho"]
["2096-06-14","quinta-feira","Corpus Christi"]
["2096-09-07","sexta-feira","Independência do Brasil"]
["2096-10-12","sexta-feira","Nossa Sr.a Aparecida - Padroeira do Brasil"]
["2096-11-02","sexta-feira","Finados"]
["2096-11-15","quinta-feira","Proclamação da República"]
["2096-11-20","terça-feira","Dia Nacional de Zumbi e da Consciência Negra"]
["2096-12-25","terça-feira","Natal"]
["2097-01-01","terça-feira","Confraternização Universal"]
["2097-02-11","segunda-feira","Carnaval"]
["2097-02-12","terça-feira","Carnaval"]
["2097-03-29","sexta-feira","Paixão de Cristo"]
["2097-04-21","domingo","Tiradentes"]
["2097-05-01","quarta-feira","Dia do Trabalho"]
["2097-05-30","quinta-feira","Corpus Christi"]
["2097-09-07","sábado","Independência do Brasil"]
["2097-10-12","sábado","Nossa Sr.a Aparecida - Padroeira do Brasil"]
["2097-11-02","sábado","Finados"]
["2097-11-15","sexta-feira","Proclamação da República"]
["2097-11-20","quarta-feira","Dia Nacional de Zumbi e da Consciência Negra"]
["2097-12-25","quarta-feira","Natal"]
["2098-01-01","quarta-feira","Confraternização Universal"]
["2098-03-03","segunda-feira","Carnaval"]
["2098-03-04","terça-feira","Carnaval"]
["2098-04-18","sexta-feira","Paixão de Cristo"]
["2098-04-21","segunda-feira","Tiradentes"]
["2098-05-01","quinta-feira","Dia do Trabalho"]
["2098-06-19","quinta-feira","Corpus Christi"]
["2098-09-07","domingo","Independência do Brasil"]
["2098-10-12","domingo","Nossa Sr.a Aparecida - Padroeira do Brasil"]
["2098-11-02","domingo","Finados"]
["2098-11-15","sábado","Proclamação da República"]
["2098-11-20","quinta-feira","Dia Nacional de Zumbi e da Consciência Negra"]
["2098-12-25","quinta-feira","Natal"]
["2099-01-01","quinta-feira","Confraternização Universal "]
["2099-02-23","segunda-feira","Carnaval"]
["2099-02-24","terça-feira","Carnaval"]
["2099-04-10","sexta-feira","Paixão de Cristo"]
["2099-04-21","terça-feira","Tiradentes"]
["2099-05-01","sexta-feira","Dia do Trabalho"]
["2099-06-11","quinta-feira","Corpus Christi"]
["2099-09-07","segunda-feira","Independência do Brasil"]
["2099-10-12","segunda-feira","Nossa Sr.a Aparecida - Padroeira do Brasil"]
["2099-11-02","segunda-feira","Finados"]
["2099-11-15","domingo","Proclamação da República"]
["2099-11-20","sexta-feira","Dia Nacional de Zumbi e da Consciência Negra"]
["2099-12-25","sexta-feira","Natal"]